{
    "comments": {
        // symbols used for block comments
        "blockComment": [ "/*", "*/" ]
    },
    // symbols used as brackets
    "brackets": [
        ["[", "]"],
        ["(", ")"]
    ],
    // symbols that are auto closed
    "autoClosingPairs": [
        ["[", "]"],
        ["(", ")"],
        ["\"", "\""]
    ],
    // symbols that that can surround a selection
    "surroundingPairs": [
        ["[", "]"],
        ["(", ")"],
        ["\"", "\""],
        ["'", "'"]
    ],
    // auto indent
    "indentationRules": {
        "unIndentedLinePattern": "^\\s*/\\*.*\\*/",
        "increaseIndentPattern": {
          "pattern": "^\\s*(main|procedure|declare|preconditions|watchdog|else|(otherwise\\s*:)|while|for|record|with)|(initiate\\s+and\\s+confirm\\s+step\\s*)|(in\\s+the\\s+context\\s+of\\s+[a-zA-Z_]\\w*\\s+do)|(in\\s+parallel\\s+until\\s+(all\\s+complete)|(one\\s+completes))|(if\\s.\\sthen)|(in\\s+case)\\b",
        },
        "decreaseIndentPattern": {
          "pattern": "^\\s*end\\s+(main|procedure|declare|preconditions|watchdog|step|context|parallel|if|case|while|for|record|with)(\\s*|;|\n)",
        }
      }
}