{
    "functions": [
        {
            "function_id": 1,
            "function_name": "reset counter",
            "comment": "sets the counter back to zero"
        },
        {
            "function_id": 2,
            "function_name": "set switch",
            "arguments": [
                {
                    "argument_id": 1,
                    "argument_name": "status",
                    "encoding": "B"
                }
            ]
        }
    ]
}
