{
    "type": "marriage",
    "name":"Elena",
    "surname":"Gutierrez Salamanca",
    "vat":"4875345673T",
    "gender": "female",
    "birthdate": "12/05/1957",
    "phone": "6734650143",
    "email": "egsalamanca@gmail.com",
    "street": "C/ General Santoña",
    "is_chalet": false,
    "city": "Zamora",
    "state": "Castilla y León",
    "zip": "46960",
    "country": "España",
    "name2": "María Alejandra",
    "surname2": "Villanueva Rojas",
    "vat2": "48532759275T",
    "gender2": "female",
    "birthdate2": "12/02/1960",
    "project": "Corto plazo",
    "inversion": 5000,
    "personal_data_policy": true,
    "promotions": true,
    "about_us":"Redes Sociales",
    "participation_reason": "Veritatis aliquam et a aperiam atque."
}