{
    "name": "Alberto",
    "surname": "Gomez Sanchez",
    "phone": "692234753",
    "email": "ags@example.com",
    "personal_data_policy": true,
    "promotions": false,
    "street": "Calle Inexistente 2",
    "street2": "Piso 3D",
    "city": "Madrid",
    "state": "Madrid",
    "zip": "28432",
    "aprox_consumption": 200000,
    "participation_reason": "Participation reason",
    "about_us": "Redes Sociales",
    "tags": ["Auto. Residencial", "formulario presupuesto"]
}