{
  "project_info": {
    "project_number": "852506017616",
    "firebase_url": "https://revconverter.firebaseio.com",
    "project_id": "revconverter",
    "storage_bucket": "revconverter.appspot.com"
  },
  "client": [
    {
      "client_info": {
        "mobilesdk_app_id": "1:852506017616:android:82e334706336244f08f655",
        "android_client_info": {
          "package_name": "com.appias.revconverter"
        }
      },
      "oauth_client": [
        {
          "client_id": "852506017616-7u04rg3hrdklucfanphoh3esqk68hmgb.apps.googleusercontent.com",
          "client_type": 3
        }
      ],
      "api_key": [
        {
          "current_key": "AIzaSyCCOpVlt65Z5z-t8gevogyuHfpFt2OsULU"
        }
      ],
      "services": {
        "appinvite_service": {
          "other_platform_oauth_client": [
            {
              "client_id": "852506017616-7u04rg3hrdklucfanphoh3esqk68hmgb.apps.googleusercontent.com",
              "client_type": 3
            }
          ]
        }
      }
    }
  ],
  "configuration_version": "1"
}