<svg width="360" height="66" viewBox="0 0 360 66" xmlns="http://www.w3.org/2000/svg">
  <defs>
    <linearGradient x1="0%" y1="4571.67969%" x2="100%" y2="4571.67969%" id="gradient">
      <stop stop-color="#fdbc18" offset="0%"/>
      <stop stop-color="#d53333" offset="100%"/>
    </linearGradient>
  </defs>
  <g stroke="none" stroke-width="1" fill="none" fill-rule="evenodd">
    <g transform="translate(0.000000, -5024.000000)">
      <g transform="translate(0.000000, 5020.000000)">
        <polygon fill="url(#gradient)" fill-rule="nonzero" points="0 70 0 40 360 40 360 70"/>
        <path d="M293.65 7.16c0 .88-.2 1.6-.61 2.14-.4.54-.95.8-1.64.8-.7 0-1.26-.22-1.67-.66v2.8h-1V4.18h.92l.04.64c.4-.5.97-.75 1.69-.75.7 0 1.25.26 1.66.8.4.52.6 1.25.6 2.19v.09zm-1-.11c0-.66-.14-1.18-.42-1.56a1.35 1.35 0 0 0-1.15-.57c-.6 0-1.05.27-1.35.8V8.5c.3.53.75.8 1.37.8.47 0 .85-.2 1.13-.57.28-.38.42-.94.42-1.68zM298.5 10c-.06-.11-.1-.32-.14-.61-.46.48-1.02.72-1.66.72-.57 0-1.04-.16-1.4-.49a1.57 1.57 0 0 1-.56-1.23c0-.6.23-1.08.7-1.41.45-.34 1.1-.5 1.93-.5h.97v-.46c0-.35-.1-.62-.31-.83-.2-.2-.51-.3-.92-.3-.35 0-.65.08-.9.26-.23.18-.35.4-.35.65h-1c0-.29.1-.57.3-.84.22-.27.5-.49.85-.64.35-.16.74-.24 1.16-.24.67 0 1.2.17 1.57.5.38.34.58.8.6 1.39v2.67c0 .53.06.96.2 1.27V10h-1.04zm-1.65-.76c.3 0 .6-.08.88-.24.28-.16.49-.37.61-.63V7.18h-.78c-1.22 0-1.82.36-1.82 1.07 0 .31.1.55.3.73.22.17.48.26.8.26zm4-.05l.34-.43c.38-.5.6-1.25.66-2.25l.09-2.32h3.74v5h.75v2.52h-1V10h-4.05v1.7h-1l.01-2.51h.45zm1.17 0h2.67V5.1h-1.79l-.06 1.38a4.8 4.8 0 0 1-.82 2.7zm9.27-5h1V10h-1V5.76L308.61 10h-1V4.19h1v4.24l2.68-4.24zm4.4 3.33h-.73V10h-1V4.19h1v2.46h.65l1.96-2.46h1.2l-2.3 2.8 2.5 3.01h-1.27l-2.01-2.48zM323.4 10c-.06-.11-.1-.32-.14-.61-.46.48-1.02.72-1.66.72-.57 0-1.04-.16-1.4-.49a1.57 1.57 0 0 1-.56-1.23c0-.6.23-1.08.7-1.41.45-.34 1.1-.5 1.94-.5h.96v-.46c0-.35-.1-.62-.31-.83-.2-.2-.51-.3-.92-.3-.35 0-.65.08-.89.26s-.36.4-.36.65h-1c0-.29.1-.57.31-.84.2-.27.49-.49.84-.64.35-.16.74-.24 1.16-.24.67 0 1.2.17 1.57.5.38.34.58.8.6 1.39v2.67c0 .53.06.96.2 1.27V10h-1.04zm-1.65-.76c.31 0 .6-.08.89-.24.27-.16.48-.37.6-.63V7.18h-.78c-1.21 0-1.82.36-1.82 1.07 0 .31.1.55.3.73.22.17.48.26.8.26zm8.8-5.05V10h-1V5.01h-1.97l-.12 2.18a4.8 4.8 0 0 1-.5 2.14c-.27.43-.7.65-1.28.67h-.4v-.88l.28-.02c.32-.03.56-.22.7-.56.13-.33.22-.96.26-1.86l.11-2.5h3.93zm2.69 2h1.5c.67 0 1.19.18 1.57.52.38.33.57.8.57 1.37 0 .58-.2 1.04-.59 1.4-.39.34-.92.52-1.59.52h-2.46V4.19h1v2zm0 .81V9.2h1.47c.38 0 .67-.1.87-.29.2-.19.3-.45.3-.79 0-.32-.1-.58-.3-.79-.2-.2-.47-.31-.83-.32h-1.51zm9.63 3h-.99V7.52h-2.67V10h-1V4.19h1V6.7h2.67V4.19h1V10zm1.34-2.96c0-.57.1-1.08.33-1.54a2.5 2.5 0 0 1 2.3-1.42c.8 0 1.43.27 1.92.82.5.55.74 1.28.74 2.19v.07c0 .56-.11 1.07-.33 1.52a2.47 2.47 0 0 1-2.32 1.43c-.78 0-1.42-.28-1.91-.82a3.15 3.15 0 0 1-.73-2.18v-.07zm1 .12c0 .64.14 1.16.44 1.55.3.4.7.59 1.2.59s.9-.2 1.2-.6c.3-.4.45-.95.45-1.66 0-.64-.15-1.15-.45-1.55-.3-.4-.7-.6-1.2-.6s-.9.2-1.2.6c-.3.38-.45.94-.45 1.67zM273.03 23h-1v-2.48h-2.66V23h-1v-5.81h1v2.52h2.67v-2.52h1V23zm4.01.1c-.79 0-1.43-.25-1.92-.77-.5-.52-.74-1.2-.74-2.07v-.19c0-.57.1-1.09.33-1.54.22-.45.52-.8.92-1.06s.82-.39 1.29-.39c.75 0 1.34.25 1.76.75.42.5.63 1.2.63 2.14v.4h-3.94c.01.58.18 1.04.5 1.4.32.35.73.53 1.22.53.35 0 .65-.08.9-.22.24-.14.45-.33.63-.57l.61.47a2.44 2.44 0 0 1-2.19 1.13zm-.12-5.2c-.4 0-.74.14-1.01.44-.28.29-.44.7-.5 1.22h2.9v-.07a1.9 1.9 0 0 0-.4-1.18 1.25 1.25 0 0 0-1-.41zm9.6 3.78l1.98-4.5h1.24V23h-1v-4.23L286.89 23h-.69l-1.92-4.32V23h-.99v-5.81h1.29l1.97 4.5zm4.55-1.64c0-.57.12-1.08.34-1.54a2.5 2.5 0 0 1 2.3-1.42c.8 0 1.43.27 1.92.82.5.55.74 1.28.74 2.19v.07c0 .56-.11 1.07-.33 1.52a2.47 2.47 0 0 1-2.32 1.43c-.79 0-1.42-.28-1.91-.82a3.15 3.15 0 0 1-.74-2.18v-.07zm1 .12c0 .64.15 1.16.45 1.55.3.4.7.59 1.2.59s.9-.2 1.2-.6c.3-.4.45-.95.45-1.66 0-.64-.15-1.15-.45-1.55-.3-.4-.7-.6-1.2-.6s-.9.2-1.2.6c-.3.38-.45.94-.45 1.67zm9.3-2.97h1V23h-1v-4.24L298.7 23h-1v-5.81h1v4.24l2.68-4.24zm5.4 5.81v-5.81h2.27c.77 0 1.37.13 1.78.4.41.27.62.67.62 1.2 0 .26-.08.5-.24.72-.16.22-.4.38-.71.5.35.08.63.24.84.48.21.24.32.53.32.86 0 .53-.2.94-.59 1.23-.39.28-.94.42-1.66.42h-2.63zm1-2.55v1.75h1.64c.42 0 .73-.08.93-.23.2-.16.31-.37.31-.65 0-.58-.42-.87-1.28-.87h-1.6zm0-.8h1.28c.93 0 1.4-.27 1.4-.81 0-.55-.44-.83-1.32-.85h-1.36v1.66zm8.4-.87c0-.27-.11-.49-.32-.65-.2-.16-.5-.24-.85-.24s-.65.1-.88.28c-.24.18-.35.4-.35.64h-1c0-.5.22-.92.64-1.24.43-.32.95-.48 1.59-.48.68 0 1.2.14 1.59.43.38.3.57.71.57 1.25 0 .26-.08.5-.24.72-.16.22-.38.4-.67.52.68.23 1.01.68 1.01 1.36 0 .53-.2.95-.61 1.26-.42.32-.97.47-1.65.47-.67 0-1.22-.16-1.66-.49a1.58 1.58 0 0 1-.65-1.33h.99c0 .28.12.53.37.73.26.2.57.3.95.3s.68-.09.92-.26c.23-.18.34-.4.34-.68 0-.33-.1-.56-.29-.7-.2-.15-.5-.22-.9-.22h-1v-.83h1.08c.67-.02 1.01-.3 1.01-.84zm6.14-.77h-2.68V23h-1v-5.81h3.68V18zm5.62-.82V23h-1v-4.99h-1.97l-.12 2.18a4.8 4.8 0 0 1-.5 2.14c-.28.43-.7.65-1.3.67h-.39v-.88l.29-.02c.32-.03.55-.22.69-.56.14-.33.23-.96.27-1.86l.1-2.5h3.93zm6.04 0V23h-1v-2.26h-1.5L330.11 23h-1.07l1.46-2.41a1.73 1.73 0 0 1-.86-.63 1.7 1.7 0 0 1-.3-1c0-.53.2-.96.6-1.28.4-.32.93-.49 1.6-.5h2.44zm-3.64 1.78c0 .28.1.51.3.69.19.17.44.26.76.26h1.58V18h-1.43c-.37 0-.66.1-.88.28a.87.87 0 0 0-.33.7zm5.18 3.22l.35-.43c.39-.5.6-1.25.66-2.25l.1-2.32h3.73v5h.75v2.52h-1V23h-4.05v1.7h-1l.01-2.51h.45zm1.18 0h2.67V18.1h-1.79l-.06 1.38a4.8 4.8 0 0 1-.82 2.7zm6.6-3h1.5c.67 0 1.19.18 1.57.52.38.33.57.8.57 1.37 0 .58-.2 1.04-.59 1.4-.4.34-.92.52-1.59.52h-2.46v-5.81h1v2zm5.72 3.81h-1v-5.81h1V23zm-5.72-3v2.19h1.47c.38 0 .66-.1.87-.29.2-.19.3-.45.3-.79 0-.32-.1-.58-.3-.79-.2-.2-.47-.31-.83-.32h-1.51z" fill="#D82727"/>
        <path d="M145.08 8.54l1.35-4.35h1.07l-2.34 6.7c-.36.97-.94 1.46-1.73 1.46l-.18-.02-.37-.07v-.8l.26.02c.34 0 .6-.07.8-.2.18-.14.33-.4.46-.75l.22-.6-2.08-5.74h1.09l1.45 4.35zm6.65.14l1.97-4.5h1.25V10h-1V5.77L152.07 10h-.69l-1.91-4.32V10h-1V4.19h1.3l1.96 4.5zm7.22 1.43c-.79 0-1.43-.26-1.92-.78-.5-.52-.74-1.2-.74-2.07v-.19c0-.57.1-1.09.33-1.54.22-.45.53-.8.92-1.06.4-.26.83-.39 1.29-.39.75 0 1.34.25 1.76.75.42.5.63 1.2.63 2.14v.4h-3.94c.02.58.18 1.04.5 1.4.32.35.73.53 1.23.53.35 0 .64-.08.89-.22.24-.14.45-.33.64-.57l.6.47a2.44 2.44 0 0 1-2.19 1.13zm-.12-5.21c-.4 0-.74.14-1.01.44-.27.29-.44.7-.5 1.22h2.9V6.5a1.9 1.9 0 0 0-.4-1.18 1.25 1.25 0 0 0-1-.41zm8.45 2.26c0 .88-.2 1.6-.61 2.14-.4.54-.95.8-1.64.8-.7 0-1.26-.22-1.67-.66v2.8h-1V4.18h.92l.04.64c.4-.5.97-.75 1.69-.75.7 0 1.25.26 1.66.8.4.52.6 1.25.6 2.19v.09zm-1-.11c0-.66-.14-1.18-.42-1.56a1.35 1.35 0 0 0-1.14-.57c-.6 0-1.06.27-1.36.8V8.5c.3.53.75.8 1.37.8.47 0 .85-.2 1.13-.57.28-.38.42-.94.42-1.68zm4.67 3.06c-.79 0-1.43-.26-1.92-.78-.5-.52-.74-1.2-.74-2.07v-.19c0-.57.1-1.09.33-1.54.22-.45.53-.8.92-1.06.4-.26.83-.39 1.29-.39.75 0 1.34.25 1.76.75.42.5.63 1.2.63 2.14v.4h-3.94c.01.58.18 1.04.5 1.4.32.35.73.53 1.22.53.36 0 .65-.08.9-.22.24-.14.45-.33.64-.57l.6.47a2.44 2.44 0 0 1-2.19 1.13zm-.12-5.21c-.4 0-.74.14-1.01.44-.27.29-.44.7-.5 1.22h2.9V6.5a1.9 1.9 0 0 0-.4-1.18 1.25 1.25 0 0 0-1-.41zm8.28 5.1h-.99V7.52h-2.67V10h-1V4.19h1V6.7h2.67V4.19h1V10zm6.35 0h-1V7.52h-2.66V10h-1V4.19h1V6.7h2.66V4.19h1V10zm1.33-2.96c0-.57.11-1.08.34-1.54a2.5 2.5 0 0 1 2.3-1.42c.79 0 1.43.27 1.92.82.49.55.73 1.28.73 2.19v.07c0 .56-.1 1.07-.32 1.52a2.47 2.47 0 0 1-2.32 1.43c-.79 0-1.43-.28-1.92-.82a3.15 3.15 0 0 1-.73-2.18v-.07zm1 .12c0 .64.15 1.16.45 1.55.3.4.7.59 1.2.59s.9-.2 1.2-.6c.3-.4.45-.95.45-1.66 0-.64-.15-1.15-.46-1.55-.3-.4-.7-.6-1.2-.6s-.89.2-1.19.6c-.3.38-.45.94-.45 1.67zM131.77 23h-1v-2.48h-2.66V23h-1v-5.81h1v2.52h2.67v-2.52h1V23zm4 .1c-.78 0-1.42-.25-1.91-.77-.5-.52-.75-1.2-.75-2.07v-.19c0-.57.11-1.09.33-1.54.22-.45.53-.8.93-1.06s.82-.39 1.28-.39c.76 0 1.35.25 1.77.75.42.5.62 1.2.62 2.14v.4h-3.93c.01.58.18 1.04.5 1.4.32.35.73.53 1.22.53.35 0 .65-.08.9-.22.24-.14.45-.33.63-.57l.61.47a2.44 2.44 0 0 1-2.2 1.13zm-.12-5.2c-.4 0-.73.14-1 .44-.28.29-.45.7-.51 1.22h2.91v-.07a1.9 1.9 0 0 0-.4-1.18 1.25 1.25 0 0 0-1-.41zm9.61 3.78l1.98-4.5h1.24V23h-1v-4.23L145.62 23h-.69L143 18.68V23h-1v-5.81h1.3l1.96 4.5zm4.55-1.64c0-.57.11-1.08.34-1.54a2.5 2.5 0 0 1 2.3-1.42c.8 0 1.43.27 1.92.82.49.55.73 1.28.73 2.19v.07c0 .56-.1 1.07-.32 1.52a2.47 2.47 0 0 1-2.32 1.43c-.79 0-1.43-.28-1.91-.82a3.15 3.15 0 0 1-.74-2.18v-.07zm1 .12c0 .64.15 1.16.45 1.55.3.4.7.59 1.2.59s.9-.2 1.2-.6c.3-.4.45-.95.45-1.66 0-.64-.15-1.15-.45-1.55-.3-.4-.7-.6-1.21-.6-.49 0-.89.2-1.19.6-.3.38-.45.94-.45 1.67zm9.3-2.97h1V23h-1v-4.24L157.43 23h-1v-5.81h1v4.24l2.68-4.24zm5.4 5.81v-5.81h2.27c.77 0 1.37.13 1.78.4.41.27.62.67.62 1.2 0 .26-.08.5-.24.72-.16.22-.4.38-.72.5.36.08.64.24.85.48.21.24.32.53.32.86 0 .53-.2.94-.59 1.23-.4.28-.94.42-1.66.42h-2.63zm1-2.55v1.75h1.64c.42 0 .73-.08.93-.23.2-.16.31-.37.31-.65 0-.58-.43-.87-1.28-.87h-1.6zm0-.8h1.28c.93 0 1.4-.27 1.4-.81 0-.55-.44-.83-1.32-.85h-1.36v1.66zm8.4-.87c0-.27-.11-.49-.32-.65-.2-.16-.5-.24-.85-.24-.36 0-.65.1-.88.28-.24.18-.35.4-.35.64h-1c0-.5.22-.92.64-1.24.42-.32.95-.48 1.59-.48.68 0 1.2.14 1.59.43.38.3.57.71.57 1.25 0 .26-.08.5-.24.72-.16.22-.38.4-.67.52.67.23 1.01.68 1.01 1.36 0 .53-.2.95-.62 1.26-.4.32-.96.47-1.64.47-.67 0-1.23-.16-1.66-.49a1.58 1.58 0 0 1-.65-1.33h.98c0 .28.13.53.38.73.26.2.57.3.95.3s.68-.09.91-.26c.24-.18.35-.4.35-.68 0-.33-.1-.56-.29-.7-.2-.15-.5-.22-.91-.22h-1v-.83h1.09c.67-.02 1.01-.3 1.01-.84zm6.14-.77h-2.68V23h-1v-5.81h3.68V18zm5.62-.82V23h-1v-4.99h-1.98l-.11 2.18a4.8 4.8 0 0 1-.5 2.14c-.28.43-.7.65-1.3.67h-.39v-.88l.28-.02c.33-.03.56-.22.7-.56.14-.33.23-.96.27-1.86l.1-2.5h3.93zm6.04 0V23h-1v-2.26h-1.5L188.84 23h-1.07l1.46-2.41a1.73 1.73 0 0 1-.86-.63 1.7 1.7 0 0 1-.3-1c0-.53.2-.96.6-1.28.4-.32.93-.49 1.6-.5h2.44zm-3.64 1.78c0 .28.1.51.29.69.2.17.45.26.77.26h1.58V18h-1.43c-.37 0-.66.1-.88.28a.87.87 0 0 0-.33.7zm5.18 3.22l.35-.43c.38-.5.6-1.25.66-2.25l.09-2.32h3.74v5h.75v2.52h-1V23h-4.05v1.7h-1l.01-2.51h.45zm1.18 0h2.67V18.1h-1.79l-.06 1.38a4.8 4.8 0 0 1-.82 2.7zm6.6-3h1.5c.66 0 1.18.18 1.57.52.38.33.57.8.57 1.37 0 .58-.2 1.04-.59 1.4-.4.34-.92.52-1.59.52h-2.46v-5.81h1v2zm5.72 3.81h-1v-5.81h1V23zm-5.72-3v2.19h1.47c.37 0 .66-.1.87-.29.2-.19.3-.45.3-.79 0-.32-.1-.58-.3-.79-.2-.2-.47-.31-.83-.32h-1.51z" fill="#E45F11"/>
        <path d="M14.1 8.68l1.97-4.5h1.25V10h-1V5.77L14.44 10h-.69l-1.91-4.32V10h-1V4.19h1.3l1.96 4.5zm4.55-1.64c0-.57.1-1.08.33-1.54a2.5 2.5 0 0 1 2.3-1.42c.8 0 1.44.27 1.92.82.5.55.74 1.28.74 2.19v.07c0 .56-.11 1.07-.33 1.52a2.47 2.47 0 0 1-2.31 1.43c-.8 0-1.43-.28-1.92-.82a3.15 3.15 0 0 1-.73-2.18v-.07zm1 .12c0 .64.15 1.16.44 1.55.3.4.7.59 1.2.59.51 0 .91-.2 1.2-.6.3-.4.45-.95.45-1.66 0-.64-.15-1.15-.45-1.55-.3-.4-.7-.6-1.2-.6s-.9.2-1.2.6c-.3.38-.44.94-.44 1.67zm9.3-2.97h.99V10h-1V5.76L26.26 10h-.99V4.19h1v4.24l2.67-4.24zM10.84 23v-5.81h2.26c.77 0 1.37.13 1.78.4.41.27.62.67.62 1.2 0 .26-.08.5-.24.72-.16.22-.4.38-.72.5.36.08.64.24.85.48.21.24.32.53.32.86 0 .53-.2.94-.59 1.23-.39.28-.94.42-1.66.42h-2.63zm.99-2.55v1.75h1.64c.42 0 .73-.08.93-.23.2-.16.31-.37.31-.65 0-.58-.42-.87-1.28-.87h-1.6zm0-.8h1.28c.93 0 1.4-.27 1.4-.81 0-.55-.44-.83-1.32-.85h-1.36v1.66zm8.4-.87c0-.27-.11-.49-.32-.65-.2-.16-.5-.24-.85-.24s-.65.1-.88.28c-.24.18-.35.4-.35.64h-1c0-.5.22-.92.64-1.24.42-.32.95-.48 1.59-.48.68 0 1.2.14 1.59.43.38.3.57.71.57 1.25 0 .26-.08.5-.24.72-.16.22-.38.4-.67.52.67.23 1.01.68 1.01 1.36 0 .53-.2.95-.61 1.26-.42.32-.97.47-1.65.47-.67 0-1.23-.16-1.66-.49a1.58 1.58 0 0 1-.65-1.33h.99c0 .28.12.53.37.73.26.2.57.3.95.3s.68-.09.91-.26c.24-.18.35-.4.35-.68 0-.33-.1-.56-.29-.7-.2-.15-.5-.22-.9-.22h-1v-.83h1.08c.67-.02 1.01-.3 1.01-.84zm6.14-.77H23.7V23h-1v-5.81h3.68V18zm5.62-.82V23h-1v-4.99h-1.98l-.11 2.18a4.8 4.8 0 0 1-.5 2.14c-.28.43-.7.65-1.3.67h-.39v-.88l.28-.02c.33-.03.56-.22.7-.56.14-.33.23-.96.27-1.86l.1-2.5H32zm6.04 0V23h-1v-2.26h-1.5L34.17 23H33.1l1.46-2.41a1.73 1.73 0 0 1-.86-.63 1.7 1.7 0 0 1-.3-1c0-.53.2-.96.6-1.28.4-.32.93-.49 1.6-.5h2.44zm-3.64 1.78c0 .28.1.51.3.69.18.17.44.26.76.26h1.58V18H35.6c-.37 0-.66.1-.88.28a.87.87 0 0 0-.33.7zm5.18 3.22l.35-.43c.38-.5.6-1.25.66-2.25l.09-2.32h3.74v5h.75v2.52h-1V23h-4.05v1.7h-1l.01-2.51h.45zm1.18 0h2.67V18.1h-1.79l-.06 1.38a4.8 4.8 0 0 1-.82 2.7zm6.6-3h1.5c.66 0 1.19.18 1.57.52.38.33.57.8.57 1.37 0 .58-.2 1.04-.59 1.4-.4.34-.92.52-1.59.52h-2.46v-5.81h1v2zM53.08 23h-1v-5.81h1V23zm-5.72-3v2.19h1.47c.38 0 .66-.1.87-.29.2-.19.3-.45.3-.79 0-.32-.1-.58-.3-.79-.2-.2-.47-.31-.83-.32h-1.51z" fill="#E67813"/>
      </g>
    </g>
  </g>
</svg>
