<svg xmlns="http://www.w3.org/2000/svg" width="118" height="30" viewBox="0 0 118 30">
  <path fill="#003087" d="M21.495 2.246C20.115.674 17.622 0 14.432 0H5.174c-.652 0-1.207.475-1.31 1.118L.01 25.566a.795.795 0 0 0 .785.919h5.716l1.435-9.105-.044.285a1.321 1.321 0 0 1 1.304-1.118h2.716c5.336 0 9.513-2.167 10.734-8.436.036-.186.067-.366.095-.542-.155-.082-.155-.082 0 0 .363-2.318-.003-3.895-1.256-5.323" />
  <path fill="#002f86" d="M80.545 13.807h-3.076a.886.886 0 0 0-.734.39l-4.244 6.249-1.798-6.006a.89.89 0 0 0-.851-.633h-3.024a.533.533 0 0 0-.504.704l3.387 9.943-3.186 4.495c-.25.353.003.84.435.84h3.073a.89.89 0 0 0 .73-.381l10.23-14.765a.533.533 0 0 0-.438-.836M59.98 19.764c-.296 1.748-1.684 2.922-3.454 2.922-.888 0-1.599-.286-2.055-.826-.453-.536-.623-1.3-.48-2.15.275-1.733 1.686-2.944 3.43-2.944.869 0 1.574.288 2.04.834.469.55.653 1.317.519 2.164m4.265-5.957h-3.06a.533.533 0 0 0-.527.45l-.134.855-.214-.31c-.663-.962-2.14-1.284-3.615-1.284-3.381 0-6.27 2.563-6.832 6.157-.292 1.793.123 3.506 1.14 4.701.934 1.099 2.266 1.556 3.854 1.556 2.726 0 4.237-1.75 4.237-1.75l-.137.85a.533.533 0 0 0 .527.616h2.755c.438 0 .81-.317.878-.75l1.655-10.476a.533.533 0 0 0-.527-.615m-18.365.073c-.35 2.294-2.101 2.294-3.796 2.294h-.965l.677-4.283a.532.532 0 0 1 .526-.45h.442c1.154 0 2.243 0 2.805.658.336.393.438.976.31 1.781m-.737-5.986h-6.39a.888.888 0 0 0-.878.75L35.29 25.032a.532.532 0 0 0 .525.616h3.052a.888.888 0 0 0 .877-.749l.698-4.422a.888.888 0 0 1 .877-.75h2.022c4.21 0 6.64-2.037 7.275-6.075.285-1.765.011-3.153-.815-4.124-.91-1.068-2.52-1.634-4.659-1.634" />
  <path fill="#009cde" d="M113.437 8.345l-2.623 16.688a.532.532 0 0 0 .526.615h2.638c.437 0 .81-.318.877-.75l2.587-16.388a.533.533 0 0 0-.527-.615h-2.952a.532.532 0 0 0-.526.45m-7.872 11.419c-.296 1.748-1.684 2.922-3.455 2.922-.887 0-1.598-.286-2.055-.826-.453-.536-.623-1.3-.48-2.15.276-1.733 1.687-2.944 3.43-2.944.87 0 1.575.288 2.04.834.47.55.654 1.317.52 2.164m4.265-5.957h-3.06a.533.533 0 0 0-.527.45l-.134.855-.215-.31c-.662-.962-2.14-1.284-3.615-1.284-3.38 0-6.269 2.563-6.83 6.157-.293 1.793.122 3.506 1.139 4.701.933 1.099 2.266 1.556 3.854 1.556 2.726 0 4.237-1.75 4.237-1.75l-.137.85a.533.533 0 0 0 .527.616h2.755c.438 0 .81-.317.878-.75l1.654-10.476a.533.533 0 0 0-.526-.615m-18.365.073c-.35 2.294-2.102 2.294-3.797 2.294h-.964l.677-4.283a.532.532 0 0 1 .525-.45h.443c1.154 0 2.243 0 2.805.658.336.393.437.976.31 1.781m-.737-5.986h-6.391a.888.888 0 0 0-.878.75l-2.584 16.388c-.05.323.2.616.526.616h3.28a.622.622 0 0 0 .613-.524l.734-4.647a.888.888 0 0 1 .877-.75h2.022c4.21 0 6.64-2.037 7.274-6.075.286-1.765.012-3.153-.815-4.124-.909-1.068-2.52-1.634-4.658-1.634" />
  <path fill="#003087" d="M21.495 2.246C20.115.674 17.622 0 14.432 0H5.174c-.652 0-1.207.475-1.31 1.118L.01 25.566a.795.795 0 0 0 .785.919h5.716l1.435-9.105-.044.285a1.321 1.321 0 0 1 1.304-1.118h2.716c5.336 0 9.513-2.167 10.734-8.436.036-.186.067-.366.095-.542-.155-.082-.155-.082 0 0 .363-2.318-.003-3.895-1.256-5.323" />
  <path fill="#002F86" d="M9.489 7.6a1.16 1.16 0 0 1 1.144-.979h7.258c.86 0 1.662.056 2.394.174a10.033 10.033 0 0 1 1.462.35c.36.12.696.26 1.004.424.363-2.318-.003-3.894-1.256-5.322C20.115.674 17.622 0 14.432 0H5.173c-.651 0-1.206.475-1.308 1.118L.01 25.566a.794.794 0 0 0 .785.918H6.51l1.435-9.104L9.49 7.6z" />
  <path fill="#009cde" d="M22.75 7.569c-.027.177-.058.356-.094.542-1.22 6.268-5.398 8.436-10.734 8.436H9.205a1.32 1.32 0 0 0-1.303 1.118l-1.391 8.82-.395 2.5a.696.696 0 0 0 .687.805h4.818a1.16 1.16 0 0 0 1.144-.978l.047-.246.908-5.755.059-.318a1.16 1.16 0 0 1 1.144-.978h.721c4.668 0 8.322-1.896 9.39-7.38.446-2.291.215-4.205-.964-5.549a4.602 4.602 0 0 0-1.32-1.017" />
  <path fill="#012069" d="M21.473 7.06a8.902 8.902 0 0 0-.576-.148 10.85 10.85 0 0 0-.612-.116 15.065 15.065 0 0 0-2.394-.175h-7.257a1.157 1.157 0 0 0-1.145.979l-1.542 9.78-.045.285a1.32 1.32 0 0 1 1.304-1.118h2.716c5.336 0 9.514-2.167 10.734-8.436.036-.186.067-.365.095-.542a6.59 6.59 0 0 0-1.278-.51" />
</svg>
