<svg width="700" height="79" viewBox="0 0 700 79" xmlns="http://www.w3.org/2000/svg">
  <defs>
    <linearGradient x1="0%" y1="4571.67969%" x2="100%" y2="4571.67969%" id="gradient">
      <stop stop-color="#fdbc18" offset="0%"/>
      <stop stop-color="#d53333" offset="100%"/>
    </linearGradient>
  </defs>
  <g stroke="none" stroke-width="1" fill="none" fill-rule="evenodd">
    <g transform="translate(-600.000000, -8958.000000)">
      <g transform="translate(401.000000, 8090.000000)">
        <g transform="translate(0.000000, 803.000000)">
          <g transform="translate(199.000000, 65.000000)">
            <polygon fill="url(#gradient)" fill-rule="nonzero" points="0 79 0 49 700 49 700 79"/>
            <path d="M623.15 5.13c0 1.2-.27 2.17-.82 2.91-.56.74-1.3 1.1-2.24 1.1a2.9 2.9 0 0 1-2.28-.9v3.8h-1.35V1.09h1.24l.06.87a2.8 2.8 0 0 1 2.3-1.02c.96 0 1.7.36 2.26 1.08.56.71.83 1.71.83 3v.12zm-1.35-.16c0-.9-.2-1.6-.57-2.12-.38-.51-.9-.77-1.57-.77a2 2 0 0 0-1.85 1.09v3.79a2 2 0 0 0 1.87 1.08c.64 0 1.16-.26 1.54-.77.39-.52.58-1.28.58-2.3zM629.77 9a2.85 2.85 0 0 1-.2-.83c-.62.65-1.37.98-2.25.98a2.8 2.8 0 0 1-1.92-.67c-.5-.44-.75-1-.75-1.68 0-.82.31-1.46.94-1.92a4.44 4.44 0 0 1 2.65-.68h1.32v-.63c0-.47-.15-.85-.43-1.13-.28-.28-.7-.42-1.25-.42-.48 0-.89.12-1.22.37-.32.24-.49.54-.49.88h-1.36c0-.4.14-.78.42-1.14.28-.37.66-.66 1.14-.88a3.84 3.84 0 0 1 1.59-.32c.91 0 1.63.23 2.14.68.52.46.8 1.09.81 1.89v3.65c0 .72.1 1.3.28 1.73V9h-1.42zm-2.25-1.03c.42 0 .83-.11 1.2-.33a2 2 0 0 0 .84-.86V5.15h-1.07c-1.66 0-2.49.5-2.49 1.46 0 .43.15.76.43 1s.65.36 1.09.36zm5.45-.08l.47-.57c.52-.69.83-1.71.9-3.08l.12-3.16h5.1v6.81h1.03v3.44h-1.36V9h-5.53v2.33h-1.35V7.89h.62zm1.6 0h3.64V2.33h-2.44l-.08 1.89a6.56 6.56 0 0 1-1.12 3.67zm12.64-6.81h1.36V9h-1.36V3.22L643.56 9h-1.36V1.08h1.36v5.78l3.65-5.78zm6 4.54h-.99V9h-1.36V1.08h1.36v3.35h.89l2.67-3.35h1.64l-3.14 3.8 3.4 4.12h-1.72l-2.75-3.38zM663.74 9a2.85 2.85 0 0 1-.2-.83c-.62.65-1.37.98-2.25.98a2.8 2.8 0 0 1-1.92-.67c-.5-.44-.75-1-.75-1.68 0-.82.31-1.46.94-1.92a4.44 4.44 0 0 1 2.65-.68h1.32v-.63c0-.47-.15-.85-.43-1.13-.28-.28-.7-.42-1.25-.42-.49 0-.9.12-1.22.37-.32.24-.49.54-.49.88h-1.36c0-.4.14-.78.42-1.14.28-.37.66-.66 1.14-.88a3.84 3.84 0 0 1 1.59-.32c.91 0 1.63.23 2.14.68.52.46.8 1.09.81 1.89v3.65c0 .72.1 1.3.28 1.73V9h-1.42zm-2.25-1.03c.42 0 .83-.11 1.2-.33a2 2 0 0 0 .84-.86V5.15h-1.07c-1.66 0-2.49.5-2.49 1.46 0 .43.14.76.43 1 .28.24.64.36 1.09.36zm12.01-6.9V9h-1.36V2.2h-2.7l-.16 2.96a6.56 6.56 0 0 1-.68 2.92c-.37.59-.96.9-1.76.92h-.54V7.8l.39-.02c.44-.05.75-.3.94-.76.2-.46.32-1.31.37-2.55l.15-3.4h5.35zm3.66 2.74h2.05c.9 0 1.61.24 2.14.7.52.46.78 1.08.78 1.87s-.27 1.42-.8 1.9c-.54.48-1.27.72-2.17.72h-3.36V1.08h1.36V3.8zm0 1.1V7.9h2.01c.5 0 .9-.13 1.18-.39.28-.26.42-.62.42-1.07 0-.44-.14-.8-.41-1.08a1.55 1.55 0 0 0-1.14-.44h-2.06zM690.3 9h-1.36V5.62h-3.64V9h-1.36V1.08h1.36V4.5h3.64V1.08h1.36V9zm1.81-4.04c0-.77.15-1.47.46-2.09a3.41 3.41 0 0 1 3.14-1.94c1.08 0 1.95.37 2.62 1.12.66.75 1 1.74 1 2.98v.1c0 .77-.15 1.46-.45 2.07a3.36 3.36 0 0 1-3.16 1.95 3.33 3.33 0 0 1-2.6-1.12c-.67-.75-1-1.74-1-2.97v-.1zm1.36.17c0 .87.2 1.58.62 2.11.4.53.95.8 1.63.8.7 0 1.24-.27 1.64-.8.4-.55.61-1.3.61-2.28 0-.86-.2-1.57-.62-2.1-.41-.55-.96-.82-1.64-.82-.67 0-1.21.27-1.62.8-.41.53-.62 1.3-.62 2.29zM595.06 29h-1.36v-3.38h-3.64V29h-1.36v-7.92h1.36v3.43h3.64v-3.43h1.36V29zm5.46.15a3.46 3.46 0 0 1-2.62-1.06 3.93 3.93 0 0 1-1.01-2.83V25c0-.79.15-1.49.45-2.1.3-.63.72-1.1 1.26-1.46a3.17 3.17 0 0 1 1.75-.52c1.03 0 1.84.34 2.4 1.02.58.68.86 1.65.86 2.91v.57h-5.37c.02.78.25 1.4.69 1.89.44.48 1 .72 1.67.72.47 0 .88-.1 1.21-.3.33-.19.62-.45.87-.77l.83.65a3.33 3.33 0 0 1-2.99 1.53zm-.17-7.1c-.54 0-1 .2-1.37.59-.37.4-.6.95-.7 1.67h3.98v-.1a2.58 2.58 0 0 0-.56-1.6 1.7 1.7 0 0 0-1.35-.57zm13.1 5.16l2.7-6.13h1.7V29h-1.36v-5.76L613.93 29h-.94l-2.62-5.89V29h-1.35v-7.92h1.76l2.68 6.13zm6.21-2.25c0-.77.15-1.47.46-2.09a3.41 3.41 0 0 1 3.14-1.94c1.08 0 1.95.37 2.62 1.12.66.75 1 1.74 1 2.98v.1c0 .77-.15 1.46-.45 2.07a3.36 3.36 0 0 1-3.16 1.95 3.33 3.33 0 0 1-2.61-1.12c-.67-.75-1-1.74-1-2.97v-.1zm1.36.17c0 .87.2 1.58.61 2.11.41.53.96.8 1.64.8.69 0 1.24-.27 1.64-.8.4-.55.61-1.3.61-2.28 0-.86-.2-1.57-.62-2.1-.41-.55-.96-.82-1.64-.82-.67 0-1.21.27-1.62.8-.41.53-.62 1.3-.62 2.29zm12.68-4.05h1.36V29h-1.36v-5.78L630.05 29h-1.36v-7.92h1.36v5.78l3.65-5.78zm7.37 7.92v-7.92h3.09c1.05 0 1.86.18 2.43.55.56.37.84.9.84 1.62 0 .37-.1.7-.33 1-.22.29-.54.51-.97.67.48.11.86.33 1.15.66.3.33.44.72.44 1.17 0 .73-.27 1.29-.8 1.67-.54.39-1.3.58-2.27.58h-3.58zm1.35-3.48v2.39h2.25c.56 0 .99-.1 1.27-.32.28-.2.42-.5.42-.88 0-.8-.58-1.19-1.75-1.19h-2.19zm0-1.08h1.75c1.27 0 1.9-.37 1.9-1.12 0-.74-.6-1.12-1.8-1.15h-1.85v2.27zm11.45-1.2c0-.37-.14-.66-.42-.88a1.87 1.87 0 0 0-1.17-.33c-.48 0-.87.13-1.2.38-.31.25-.47.54-.47.88h-1.35c0-.7.29-1.26.86-1.7.58-.43 1.3-.65 2.16-.65.93 0 1.65.2 2.17.6.52.4.78.96.78 1.7 0 .35-.11.68-.33.98-.21.3-.52.53-.91.7.92.32 1.38.94 1.38 1.85 0 .73-.28 1.3-.84 1.73-.56.43-1.31.64-2.25.64-.91 0-1.66-.22-2.26-.67a2.15 2.15 0 0 1-.89-1.81h1.35c0 .38.17.71.52.99.34.27.77.41 1.28.41.52 0 .94-.12 1.26-.36.31-.24.47-.55.47-.93 0-.44-.13-.76-.4-.95-.26-.2-.68-.3-1.24-.3h-1.35V24.4h1.47c.92-.03 1.38-.41 1.38-1.15zm8.38-1.04h-3.65V29h-1.37v-7.92h5.02v1.12zm7.67-1.12V29h-1.36v-6.8h-2.7l-.16 2.96a6.56 6.56 0 0 1-.68 2.92c-.37.59-.96.9-1.76.92h-.54v-1.2l.39-.02c.44-.05.75-.3.94-.76.2-.46.32-1.31.37-2.55l.15-3.4h5.35zm8.23 0V29h-1.36v-3.08h-2.04L672.88 29h-1.47l2-3.29c-.51-.18-.9-.47-1.17-.86-.27-.39-.4-.84-.4-1.36 0-.72.26-1.3.8-1.74a3.37 3.37 0 0 1 2.18-.67h3.33zm-4.96 2.43c0 .38.14.7.4.93.26.24.61.36 1.05.36h2.15v-2.63h-1.95c-.5 0-.9.13-1.2.37-.3.25-.45.57-.45.97zm7.07 4.38l.47-.57c.53-.69.83-1.71.9-3.08l.13-3.16h5.1v6.81h1.02v3.44h-1.36V29H681v2.33h-1.35v-3.44h.62zm1.6 0h3.65v-5.56h-2.44l-.08 1.89a6.56 6.56 0 0 1-1.12 3.67zm9-4.08h2.06c.9 0 1.6.24 2.13.7.52.46.78 1.08.78 1.87s-.27 1.42-.8 1.9c-.54.48-1.26.72-2.17.72h-3.36v-7.92h1.36v2.73zm7.8 5.19h-1.36v-7.92h1.36V29zm-7.8-4.09v2.98h2.01c.51 0 .9-.13 1.18-.39.28-.26.42-.62.42-1.07 0-.44-.14-.8-.4-1.08a1.55 1.55 0 0 0-1.15-.44h-2.06z" fill="#d82727" />
            <path d="M319.5 7.09l1.85-5.94h1.45l-3.19 9.14c-.49 1.32-1.27 1.98-2.35 1.98l-.25-.02-.51-.1v-1.1l.37.04c.46 0 .81-.1 1.07-.28.26-.19.47-.53.63-1.02l.3-.8-2.82-7.84h1.48l1.97 5.94zm9.07.19l2.7-6.13h1.69v7.92h-1.36V3.31l-2.56 5.76h-.94l-2.61-5.89v5.9h-1.36V1.14h1.76l2.68 6.13zm9.85 1.94a3.46 3.46 0 0 1-2.62-1.06 3.93 3.93 0 0 1-1.01-2.83v-.25c0-.79.15-1.49.45-2.1.3-.62.72-1.1 1.26-1.46a3.17 3.17 0 0 1 1.75-.52c1.03 0 1.83.34 2.4 1.02.58.68.86 1.65.86 2.91v.57h-5.37c.02.78.25 1.4.69 1.89.44.48 1 .72 1.66.72.48 0 .89-.1 1.22-.3.33-.19.62-.45.87-.77l.83.65a3.33 3.33 0 0 1-2.99 1.53zm-.17-7.1c-.54 0-1 .2-1.37.59-.37.4-.6.96-.7 1.67h3.98v-.1a2.58 2.58 0 0 0-.56-1.6 1.7 1.7 0 0 0-1.35-.57zm11.52 3.08c0 1.2-.27 2.17-.82 2.91-.56.74-1.3 1.1-2.24 1.1a2.9 2.9 0 0 1-2.28-.9v3.8h-1.35V1.16h1.24l.06.88a2.8 2.8 0 0 1 2.3-1.03c.96 0 1.7.36 2.26 1.08.56.71.83 1.71.83 3v.12zm-1.35-.16c0-.9-.2-1.6-.57-2.11-.38-.52-.9-.78-1.57-.78a2 2 0 0 0-1.85 1.1v3.78a2 2 0 0 0 1.87 1.08c.64 0 1.16-.26 1.54-.77.39-.52.58-1.28.58-2.3zm6.36 4.18a3.46 3.46 0 0 1-2.62-1.06 3.93 3.93 0 0 1-1-2.83v-.25c0-.79.14-1.49.44-2.1.3-.62.72-1.1 1.26-1.46a3.17 3.17 0 0 1 1.76-.52c1.03 0 1.83.34 2.4 1.02.57.68.85 1.65.85 2.91v.57h-5.36c.02.78.24 1.4.68 1.89.44.48 1 .72 1.67.72.48 0 .88-.1 1.21-.3.34-.19.63-.45.87-.77l.83.65a3.33 3.33 0 0 1-2.99 1.53zm-.16-7.1c-.55 0-1.01.2-1.38.59-.37.4-.6.96-.69 1.67h3.97v-.1a2.58 2.58 0 0 0-.56-1.6 1.7 1.7 0 0 0-1.34-.57zm11.3 6.95h-1.36V5.7h-3.64v3.38h-1.36V1.15h1.36v3.43h3.64V1.15h1.36v7.92zm8.65 0h-1.36V5.7h-3.64v3.38h-1.36V1.15h1.36v3.43h3.64V1.15h1.36v7.92zm1.81-4.03c0-.78.16-1.48.46-2.1A3.41 3.41 0 0 1 379.98 1c1.08 0 1.95.37 2.62 1.12.66.75 1 1.74 1 2.98v.1c0 .77-.15 1.46-.45 2.07A3.36 3.36 0 0 1 380 9.22a3.33 3.33 0 0 1-2.6-1.12c-.67-.75-1-1.74-1-2.97v-.1zm1.37.16c0 .88.2 1.58.6 2.11.41.54.96.8 1.64.8.7 0 1.24-.27 1.64-.8.41-.55.61-1.3.61-2.27 0-.87-.2-1.58-.62-2.12-.4-.54-.96-.8-1.64-.8-.67 0-1.2.26-1.62.8-.41.52-.61 1.29-.61 2.28zm-76.4 23.87H300V25.7h-3.64v3.38H295v-7.92h1.36v3.43H300v-3.43h1.36v7.92zm5.47.15a3.46 3.46 0 0 1-2.62-1.06 3.93 3.93 0 0 1-1.01-2.83v-.25c0-.79.15-1.49.45-2.1.3-.62.72-1.1 1.26-1.46a3.17 3.17 0 0 1 1.75-.52c1.03 0 1.83.34 2.4 1.02.58.68.86 1.65.86 2.91v.57h-5.37c.02.78.25 1.4.69 1.89.44.48 1 .72 1.66.72.48 0 .89-.1 1.22-.3.33-.19.62-.45.87-.77l.83.65a3.33 3.33 0 0 1-2.99 1.53zm-.17-7.1c-.54 0-1 .2-1.37.59-.38.4-.6.96-.7 1.67h3.98v-.1a2.58 2.58 0 0 0-.56-1.6 1.7 1.7 0 0 0-1.35-.57zm13.1 5.16l2.7-6.13h1.7v7.92h-1.36v-5.76l-2.57 5.76h-.93l-2.62-5.89v5.9h-1.35v-7.93h1.76l2.68 6.13zm6.2-2.24c0-.78.16-1.48.47-2.1a3.41 3.41 0 0 1 3.14-1.94c1.07 0 1.95.37 2.61 1.12.67.75 1 1.74 1 2.98v.1c0 .77-.14 1.46-.44 2.07a3.36 3.36 0 0 1-3.16 1.95 3.33 3.33 0 0 1-2.61-1.12c-.67-.75-1-1.74-1-2.97v-.1zm1.37.16c0 .88.2 1.58.61 2.11.41.54.96.8 1.64.8.69 0 1.24-.27 1.64-.8.4-.55.6-1.3.6-2.27 0-.87-.2-1.58-.61-2.12s-.96-.8-1.64-.8c-.67 0-1.21.26-1.62.8-.41.52-.62 1.29-.62 2.28zM340 21.15h1.35v7.92H340V23.3l-3.65 5.78h-1.36v-7.92h1.36v5.78l3.65-5.78zm7.37 7.92v-7.92h3.09c1.05 0 1.86.18 2.43.55.56.37.84.9.84 1.62 0 .37-.1.7-.33 1-.22.29-.54.52-.97.67.48.11.86.33 1.15.66.3.33.44.72.44 1.17 0 .73-.27 1.29-.8 1.67-.54.39-1.3.58-2.27.58h-3.58zm1.35-3.48v2.39h2.24c.57 0 1-.1 1.28-.31s.42-.51.42-.9c0-.78-.58-1.18-1.75-1.18h-2.19zm0-1.08h1.75c1.27 0 1.9-.37 1.9-1.11 0-.75-.6-1.13-1.8-1.15h-1.85v2.26zm11.45-1.2c0-.37-.14-.66-.42-.88a1.87 1.87 0 0 0-1.17-.32c-.48 0-.88.12-1.2.37-.32.25-.48.54-.48.88h-1.34c0-.69.28-1.25.86-1.7.58-.43 1.3-.65 2.16-.65.93 0 1.65.2 2.17.6.52.4.78.96.78 1.7 0 .35-.11.68-.33.98-.21.3-.52.53-.91.7.92.32 1.38.94 1.38 1.85 0 .73-.28 1.3-.84 1.73-.56.43-1.31.64-2.25.64-.91 0-1.66-.22-2.26-.67a2.15 2.15 0 0 1-.89-1.81h1.35c0 .38.17.71.52.99.34.28.77.41 1.28.41.52 0 .94-.12 1.25-.36.32-.23.48-.54.48-.93 0-.44-.13-.76-.4-.95-.27-.2-.68-.29-1.24-.29h-1.36v-1.14h1.48c.92-.03 1.38-.4 1.38-1.15zm8.38-1.04h-3.65v6.8h-1.37v-7.92h5.02v1.12zm7.67-1.12v7.92h-1.36v-6.8h-2.7l-.16 2.96a6.56 6.56 0 0 1-.69 2.93c-.36.58-.95.89-1.75.91h-.54v-1.2l.39-.02c.44-.05.75-.3.94-.76.2-.46.31-1.31.37-2.55l.14-3.4h5.36zm8.23 0v7.92h-1.36V26h-2.05l-1.86 3.08h-1.47l2-3.29c-.51-.18-.9-.47-1.17-.86-.27-.39-.41-.84-.41-1.36 0-.72.27-1.3.81-1.74a3.37 3.37 0 0 1 2.18-.67h3.33zm-4.96 2.43c0 .38.13.7.4.93.26.24.61.36 1.05.36h2.15v-2.62h-1.95c-.5 0-.9.12-1.2.36-.3.25-.45.57-.45.97zm7.07 4.39l.47-.58c.53-.69.83-1.71.9-3.08l.12-3.16h5.1v6.82h1.03v3.43h-1.36v-2.33h-5.53v2.33h-1.35v-3.43h.62zm1.6 0h3.64V22.4h-2.43l-.09 1.89a6.56 6.56 0 0 1-1.12 3.68zm9-4.1h2.06c.9.02 1.6.25 2.13.71.52.46.78 1.08.78 1.87s-.27 1.42-.8 1.9c-.54.48-1.26.72-2.17.72h-3.36v-7.92h1.36v2.73zm7.8 5.2h-1.36v-7.92h1.36v7.92zm-7.8-4.09v2.99h2.01c.51 0 .9-.14 1.18-.4.28-.26.42-.62.42-1.07 0-.44-.14-.8-.4-1.08a1.55 1.55 0 0 0-1.15-.44h-2.06z" fill="#e45f11" />
            <path d="M5.59 7.2l2.7-6.12h1.69V9H8.62V3.24L6.06 9h-.94L2.5 3.11V9H1.15V1.08h1.76L5.59 7.2zm6.2-2.24c0-.77.15-1.47.46-2.09A3.41 3.41 0 0 1 15.39.93c1.08 0 1.95.37 2.62 1.12.66.75 1 1.74 1 2.98v.1c0 .77-.15 1.46-.45 2.07a3.36 3.36 0 0 1-3.16 1.95 3.33 3.33 0 0 1-2.6-1.12c-.67-.75-1-1.74-1-2.97v-.1zm1.36.17c0 .87.2 1.58.62 2.11.4.53.95.8 1.63.8.7 0 1.24-.27 1.64-.8.4-.55.61-1.3.61-2.28 0-.86-.2-1.57-.62-2.1-.41-.55-.96-.82-1.64-.82-.67 0-1.21.27-1.62.8-.41.53-.62 1.3-.62 2.29zm12.68-4.05h1.36V9h-1.36V3.22L22.18 9h-1.36V1.08h1.36v5.78l3.65-5.78zM1.15 29v-7.92h3.1c1.05 0 1.85.18 2.42.55.56.37.84.9.84 1.62 0 .37-.1.7-.32 1-.22.29-.55.51-.98.67.48.11.86.33 1.15.66.3.33.44.72.44 1.17 0 .73-.27 1.29-.8 1.67-.54.39-1.3.58-2.27.58H1.15zm1.35-3.48v2.39h2.25c.56 0 .99-.1 1.27-.32.28-.2.42-.5.42-.88 0-.8-.58-1.19-1.75-1.19H2.5zm0-1.08h1.76c1.26 0 1.9-.37 1.9-1.12 0-.74-.6-1.12-1.8-1.15H2.5v2.27zm11.45-1.2c0-.37-.14-.66-.42-.88a1.87 1.87 0 0 0-1.17-.33c-.48 0-.87.13-1.2.38-.31.25-.47.54-.47.88H9.34c0-.7.29-1.26.86-1.7.58-.43 1.3-.65 2.16-.65.93 0 1.65.2 2.17.6.52.4.78.96.78 1.7 0 .35-.11.68-.32.98-.22.3-.52.53-.92.7.92.32 1.38.94 1.38 1.85 0 .73-.28 1.3-.84 1.73-.56.43-1.3.64-2.25.64-.91 0-1.66-.22-2.26-.67a2.15 2.15 0 0 1-.89-1.81h1.35c0 .38.17.71.52.99.34.27.77.41 1.28.41.52 0 .94-.12 1.26-.36.31-.24.47-.55.47-.93 0-.44-.13-.76-.4-.95-.26-.2-.68-.3-1.24-.3H11.1V24.4h1.47c.92-.03 1.38-.41 1.38-1.15zm8.38-1.04h-3.65V29H17.3v-7.92h5.02v1.12zM30 21.08V29h-1.36v-6.8h-2.7l-.16 2.96a6.56 6.56 0 0 1-.68 2.92c-.37.59-.96.9-1.76.92h-.54v-1.2l.39-.02c.44-.05.75-.3.94-.76.2-.46.32-1.31.37-2.55l.15-3.4H30zm8.23 0V29h-1.36v-3.08h-2.04L32.96 29h-1.47l2-3.29c-.51-.18-.9-.47-1.17-.86-.27-.39-.4-.84-.4-1.36 0-.72.26-1.3.8-1.74a3.37 3.37 0 0 1 2.18-.67h3.33zm-4.96 2.43c0 .38.14.7.4.93.26.24.61.36 1.05.36h2.15v-2.63h-1.95c-.5 0-.9.13-1.2.37-.3.25-.45.57-.45.97zm7.07 4.38l.47-.57c.53-.69.83-1.71.9-3.08l.13-3.16h5.1v6.81h1.02v3.44H46.6V29h-5.53v2.33h-1.35v-3.44h.62zm1.6 0h3.65v-5.56h-2.44l-.08 1.89a6.56 6.56 0 0 1-1.12 3.67zm9-4.08H53c.9 0 1.6.24 2.13.7.52.46.78 1.08.78 1.87s-.27 1.42-.8 1.9c-.54.48-1.26.72-2.17.72h-3.36v-7.92h1.36v2.73zm7.8 5.19h-1.36v-7.92h1.36V29zm-7.8-4.09v2.98h2.01c.51 0 .9-.13 1.18-.39.28-.26.42-.62.42-1.07 0-.44-.13-.8-.4-1.08A1.55 1.55 0 0 0 53 24.9h-2.07z" fill="#e67813" />
          </g>
        </g>
      </g>
    </g>
  </g>
</svg>
