Add support for Armv8.2-a __fp16

Armv8.2-a provides a native half-precision floating point (__fp16 aka.
float16_t). This patch introduces

* __fp16 as underlying type of Eigen::half if this type is available
* the packet types Packet4hf and Packet8hf representing float16x4_t and
  float16x8_t respectively
* packet-math for the above packets with corresponding scalar type Eigen::half

The packet-math functionality has been implemented by Ashutosh Sharma
<[email protected]>.

This closes #1940.
100 jobs for master in 143 minutes and 47 seconds (queued for 14 seconds)
Status Job ID Name Coverage
  Build
passed #818105026
aarch64 linux eigen-runner
build:aarch64:linux:clang-10:cxx11-off

00:59:46

passed #818105052
aarch64 linux eigen-runner
build:aarch64:linux:clang-10:cxx11-on

01:08:47

passed #818104982
aarch64 linux eigen-runner
build:aarch64:linux:gcc-10:cxx11-off

01:12:53

passed #818105006
aarch64 linux eigen-runner
build:aarch64:linux:gcc-10:cxx11-on

01:25:03

failed #818105237
ppc64le linux eigen-runner allowed to fail
build:ppc64le:linux:clang-10:cxx11-off

00:07:40

failed #818105258
ppc64le linux eigen-runner allowed to fail
build:ppc64le:linux:clang-10:cxx11-on

00:08:08

failed #818105081
ppc64le linux eigen-runner allowed to fail
build:ppc64le:linux:gcc-10:cxx11-off

00:26:38

failed #818105184
ppc64le linux eigen-runner allowed to fail
build:ppc64le:linux:gcc-10:cxx11-on

00:16:37

passed #818104959
x86-64 linux eigen-runner
build:x86-64:linux:clang-10:cxx11-off

00:44:54

passed #818104969
x86-64 linux eigen-runner
build:x86-64:linux:clang-10:cxx11-on

00:49:42

passed #818104937
x86-64 linux eigen-runner
build:x86-64:linux:gcc-10:cxx11-off

00:54:10

passed #818104948
x86-64 linux eigen-runner
build:x86-64:linux:gcc-10:cxx11-on

00:59:25

passed #818104865
x86-64 linux eigen-runner
build:x86-64:linux:gcc-4.8:cxx11-off

00:53:43

passed #818104879
x86-64 linux eigen-runner
build:x86-64:linux:gcc-4.8:cxx11-on

00:58:43

passed #818104898
x86-64 linux eigen-runner
build:x86-64:linux:gcc-9:cxx11-off

00:56:07

passed #818104920
x86-64 linux eigen-runner
build:x86-64:linux:gcc-9:cxx11-on

01:02:13

 
  Test
failed #818174108
aarch64 linux eigen-runner allowed to fail
test:aarch64:linux:clang-10:cxx11-off:official

00:11:35

failed #818167777
aarch64 linux eigen-runner allowed to fail
test:aarch64:linux:clang-10:cxx11-off:unsupported

00:02:50

failed #818180003
aarch64 linux eigen-runner allowed to fail
test:aarch64:linux:clang-10:cxx11-on:official

00:11:25

failed #818172768
aarch64 linux eigen-runner allowed to fail
test:aarch64:linux:clang-10:cxx11-on:unsupported

00:05:52

failed #818177280
aarch64 linux eigen-runner allowed to fail
test:aarch64:linux:gcc-10:cxx11-off:official

00:10:43

failed #818168705
aarch64 linux eigen-runner allowed to fail
test:aarch64:linux:gcc-10:cxx11-off:unsupported

00:03:08

failed #818183456
aarch64 linux eigen-runner allowed to fail
test:aarch64:linux:gcc-10:cxx11-on:official

00:10:20

failed #818178478
aarch64 linux eigen-runner allowed to fail
test:aarch64:linux:gcc-10:cxx11-on:unsupported

00:04:52

failed #818125969
ppc64le linux eigen-runner allowed to fail
test:ppc64le:linux:clang-10:cxx11-off:official

failed #818125970
ppc64le linux eigen-runner allowed to fail
test:ppc64le:linux:clang-10:cxx11-off:unsupported

failed #818129716
ppc64le linux eigen-runner allowed to fail
test:ppc64le:linux:clang-10:cxx11-on:official

failed #818129722
ppc64le linux eigen-runner allowed to fail
test:ppc64le:linux:clang-10:cxx11-on:unsupported

failed #818125956
ppc64le linux eigen-runner allowed to fail
test:ppc64le:linux:gcc-10:cxx11-off:official

failed #818125957
ppc64le linux eigen-runner allowed to fail
test:ppc64le:linux:gcc-10:cxx11-off:unsupported

failed #818125958
ppc64le linux eigen-runner allowed to fail
test:ppc64le:linux:gcc-10:cxx11-on:official

failed #818125962
ppc64le linux eigen-runner allowed to fail
test:ppc64le:linux:gcc-10:cxx11-on:unsupported

passed #818105596
x86-64 linux eigen-runner
test:x86-64:linux:clang-10:cxx11-off:official

00:05:02

failed #818213771
x86-64 linux eigen-runner allowed to fail
test:x86-64:linux:clang-10:cxx11-off:unsupported

00:02:07

passed #818105619
x86-64 linux eigen-runner
test:x86-64:linux:clang-10:cxx11-on:official

00:05:28

failed #818217025
x86-64 linux eigen-runner allowed to fail
test:x86-64:linux:clang-10:cxx11-on:unsupported

00:03:24

failed #818216281
x86-64 linux eigen-runner allowed to fail
test:x86-64:linux:gcc-10:cxx11-off:official

00:05:39

failed #818212844
x86-64 linux eigen-runner allowed to fail
test:x86-64:linux:gcc-10:cxx11-off:unsupported

00:01:39

failed #818217258
x86-64 linux eigen-runner allowed to fail
test:x86-64:linux:gcc-10:cxx11-on:official

00:05:04

failed #818215084
x86-64 linux eigen-runner allowed to fail
test:x86-64:linux:gcc-10:cxx11-on:unsupported

00:03:29

passed #818105279
x86-64 linux eigen-runner
test:x86-64:linux:gcc-4.8:cxx11-off:official

00:09:56

failed #818210481
x86-64 linux eigen-runner allowed to fail
test:x86-64:linux:gcc-4.8:cxx11-off:unsupported

00:01:43

passed #818105380
x86-64 linux eigen-runner
test:x86-64:linux:gcc-4.8:cxx11-on:official

00:07:35

failed #818212335
x86-64 linux eigen-runner allowed to fail
test:x86-64:linux:gcc-4.8:cxx11-on:unsupported

00:03:51

passed #818105461
x86-64 linux eigen-runner
test:x86-64:linux:gcc-9:cxx11-off:official

00:05:43

failed #818211863
x86-64 linux eigen-runner allowed to fail
test:x86-64:linux:gcc-9:cxx11-off:unsupported

00:01:42

passed #818105493
x86-64 linux eigen-runner
test:x86-64:linux:gcc-9:cxx11-on:official

00:06:02

failed #818213545
x86-64 linux eigen-runner allowed to fail
test:x86-64:linux:gcc-9:cxx11-on:unsupported

00:04:08

failed #818158890
eigen-runner linux aarch64 allowed to fail
test:aarch64:linux:clang-10:cxx11-off:official

00:12:12

failed #818105774
aarch64 linux eigen-runner allowed to fail
test:aarch64:linux:clang-10:cxx11-off:official

00:12:28

failed #818158645
eigen-runner linux aarch64 allowed to fail
test:aarch64:linux:clang-10:cxx11-off:unsupported

00:02:59

failed #818105788
aarch64 linux eigen-runner allowed to fail
test:aarch64:linux:clang-10:cxx11-off:unsupported

00:03:30

failed #818105814
aarch64 linux eigen-runner allowed to fail
test:aarch64:linux:clang-10:cxx11-on:official

00:12:11

failed #818167027
eigen-runner linux aarch64 allowed to fail
test:aarch64:linux:clang-10:cxx11-on:official

00:11:42

failed #818105845
aarch64 linux eigen-runner allowed to fail
test:aarch64:linux:clang-10:cxx11-on:unsupported

00:06:29

failed #818165671
eigen-runner linux aarch64 allowed to fail
test:aarch64:linux:clang-10:cxx11-on:unsupported

00:06:07

failed #818166084
eigen-runner linux aarch64 allowed to fail
test:aarch64:linux:gcc-10:cxx11-off:official

00:10:17

failed #818105633
aarch64 linux eigen-runner allowed to fail
test:aarch64:linux:gcc-10:cxx11-off:official

00:10:45

failed #818160999
eigen-runner linux aarch64 allowed to fail
test:aarch64:linux:gcc-10:cxx11-off:unsupported

00:03:15

failed #818105660
aarch64 linux eigen-runner allowed to fail
test:aarch64:linux:gcc-10:cxx11-off:unsupported

00:03:36

failed #818105704
aarch64 linux eigen-runner allowed to fail
test:aarch64:linux:gcc-10:cxx11-on:official

00:10:32

failed #818173989
eigen-runner linux aarch64 allowed to fail
test:aarch64:linux:gcc-10:cxx11-on:official

00:10:26

failed #818105764
aarch64 linux eigen-runner allowed to fail
test:aarch64:linux:gcc-10:cxx11-on:unsupported

00:05:09

failed #818171579
eigen-runner linux aarch64 allowed to fail
test:aarch64:linux:gcc-10:cxx11-on:unsupported

00:05:10

failed #818105969
ppc64le linux eigen-runner allowed to fail
test:ppc64le:linux:clang-10:cxx11-off:official

failed #818125256
eigen-runner linux ppc64le allowed to fail
test:ppc64le:linux:clang-10:cxx11-off:official

failed #818105981
ppc64le linux eigen-runner allowed to fail
test:ppc64le:linux:clang-10:cxx11-off:unsupported

failed #818125258
eigen-runner linux ppc64le allowed to fail
test:ppc64le:linux:clang-10:cxx11-off:unsupported

failed #818128500
eigen-runner linux ppc64le allowed to fail
test:ppc64le:linux:clang-10:cxx11-on:official

failed #818105988
ppc64le linux eigen-runner allowed to fail
test:ppc64le:linux:clang-10:cxx11-on:official

failed #818128501
eigen-runner linux ppc64le allowed to fail
test:ppc64le:linux:clang-10:cxx11-on:unsupported

failed #818106005
ppc64le linux eigen-runner allowed to fail
test:ppc64le:linux:clang-10:cxx11-on:unsupported

failed #818105895
ppc64le linux eigen-runner allowed to fail
test:ppc64le:linux:gcc-10:cxx11-off:official

failed #818125249
eigen-runner linux ppc64le allowed to fail
test:ppc64le:linux:gcc-10:cxx11-off:official

failed #818105923
ppc64le linux eigen-runner allowed to fail
test:ppc64le:linux:gcc-10:cxx11-off:unsupported

failed #818125250
eigen-runner linux ppc64le allowed to fail
test:ppc64le:linux:gcc-10:cxx11-off:unsupported

failed #818125251
eigen-runner linux ppc64le allowed to fail
test:ppc64le:linux:gcc-10:cxx11-on:official

failed #818105934
ppc64le linux eigen-runner allowed to fail
test:ppc64le:linux:gcc-10:cxx11-on:official

failed #818105942
ppc64le linux eigen-runner allowed to fail
test:ppc64le:linux:gcc-10:cxx11-on:unsupported

failed #818125255
eigen-runner linux ppc64le allowed to fail
test:ppc64le:linux:gcc-10:cxx11-on:unsupported

failed #818105611
x86-64 linux eigen-runner allowed to fail
test:x86-64:linux:clang-10:cxx11-off:unsupported

00:01:46

failed #818209359
eigen-runner linux x86-64 allowed to fail
test:x86-64:linux:clang-10:cxx11-off:unsupported

00:01:35

failed #818211541
eigen-runner linux x86-64 allowed to fail
test:x86-64:linux:clang-10:cxx11-on:unsupported

00:03:33

failed #818105623
x86-64 linux eigen-runner allowed to fail
test:x86-64:linux:clang-10:cxx11-on:unsupported

00:03:33

failed #818207287
eigen-runner linux x86-64 allowed to fail
test:x86-64:linux:gcc-10:cxx11-off:official

00:06:07

failed #818105524
x86-64 linux eigen-runner allowed to fail
test:x86-64:linux:gcc-10:cxx11-off:official

00:05:57

failed #818105548
x86-64 linux eigen-runner allowed to fail
test:x86-64:linux:gcc-10:cxx11-off:unsupported

00:01:41

failed #818201943
eigen-runner linux x86-64 allowed to fail
test:x86-64:linux:gcc-10:cxx11-off:unsupported

00:02:04

failed #818105571
x86-64 linux eigen-runner allowed to fail
test:x86-64:linux:gcc-10:cxx11-on:official

00:06:05

failed #818209641
eigen-runner linux x86-64 allowed to fail
test:x86-64:linux:gcc-10:cxx11-on:official

00:05:30

failed #818208255
eigen-runner linux x86-64 allowed to fail
test:x86-64:linux:gcc-10:cxx11-on:unsupported

00:04:02

failed #818105584
x86-64 linux eigen-runner allowed to fail
test:x86-64:linux:gcc-10:cxx11-on:unsupported

00:03:35

failed #818105323
x86-64 linux eigen-runner allowed to fail
test:x86-64:linux:gcc-4.8:cxx11-off:unsupported

00:02:38

failed #818182440
eigen-runner linux x86-64 allowed to fail
test:x86-64:linux:gcc-4.8:cxx11-off:unsupported

00:01:41

failed #818185937
eigen-runner linux x86-64 allowed to fail
test:x86-64:linux:gcc-4.8:cxx11-on:unsupported

00:03:59

failed #818105445
x86-64 linux eigen-runner allowed to fail
test:x86-64:linux:gcc-4.8:cxx11-on:unsupported

00:03:39

failed #818186497
eigen-runner linux x86-64 allowed to fail
test:x86-64:linux:gcc-9:cxx11-off:unsupported

00:01:44

failed #818105476
x86-64 linux eigen-runner allowed to fail
test:x86-64:linux:gcc-9:cxx11-off:unsupported

00:01:36

failed #818197465
eigen-runner linux x86-64 allowed to fail
test:x86-64:linux:gcc-9:cxx11-on:unsupported

00:03:39

failed #818105514
x86-64 linux eigen-runner allowed to fail
test:x86-64:linux:gcc-9:cxx11-on:unsupported

00:03:19

 
Name Stage Failure
failed
test:x86-64:linux:gcc-10:cxx11-on:official Test
xsltproc is already the newest version (1.1.29-5ubuntu0.2).
0 upgraded, 0 newly installed, 0 to remove and 2 not upgraded.
$ cd ${BUILDDIR}
$ xsltproc ../ci/CTest2JUnit.xsl Testing/`head -n 1 < Testing/TAG`/Test.xml > "JUnitTestResults_$CI_JOB_ID.xml"
Uploading artifacts for failed job
Uploading artifacts...
builddir/JUnitTestResults_818217258.xml: found 1 matching files and directories

Uploading artifacts as "junit" to coordinator... ok
id=818217258 responseStatus=201 Created token=-wsfKxRG
ERROR: Job failed: exit code 1
failed
test:x86-64:linux:gcc-10:cxx11-off:official Test
xsltproc is already the newest version (1.1.29-5ubuntu0.2).
0 upgraded, 0 newly installed, 0 to remove and 2 not upgraded.
$ cd ${BUILDDIR}
$ xsltproc ../ci/CTest2JUnit.xsl Testing/`head -n 1 < Testing/TAG`/Test.xml > "JUnitTestResults_$CI_JOB_ID.xml"
Uploading artifacts for failed job
Uploading artifacts...
builddir/JUnitTestResults_818216281.xml: found 1 matching files and directories

Uploading artifacts as "junit" to coordinator... ok
id=818216281 responseStatus=201 Created token=v_RHyAmr
ERROR: Job failed: exit code 1
failed
test:x86-64:linux:clang-10:cxx11-on:unsupported Test
xsltproc is already the newest version (1.1.29-5ubuntu0.2).
0 upgraded, 0 newly installed, 0 to remove and 3 not upgraded.
$ cd ${BUILDDIR}
$ xsltproc ../ci/CTest2JUnit.xsl Testing/`head -n 1 < Testing/TAG`/Test.xml > "JUnitTestResults_$CI_JOB_ID.xml"
Uploading artifacts for failed job
Uploading artifacts...
builddir/JUnitTestResults_818217025.xml: found 1 matching files and directories

Uploading artifacts as "junit" to coordinator... ok
id=818217025 responseStatus=201 Created token=EVkFk1uf
ERROR: Job failed: exit code 1
failed
test:x86-64:linux:gcc-9:cxx11-on:unsupported Test
xsltproc is already the newest version (1.1.29-5ubuntu0.2).
0 upgraded, 0 newly installed, 0 to remove and 2 not upgraded.
$ cd ${BUILDDIR}
$ xsltproc ../ci/CTest2JUnit.xsl Testing/`head -n 1 < Testing/TAG`/Test.xml > "JUnitTestResults_$CI_JOB_ID.xml"
Uploading artifacts for failed job
Uploading artifacts...
builddir/JUnitTestResults_818213545.xml: found 1 matching files and directories

Uploading artifacts as "junit" to coordinator... ok
id=818213545 responseStatus=201 Created token=uCa7eJxc
ERROR: Job failed: exit code 1
failed
test:x86-64:linux:gcc-10:cxx11-on:unsupported Test
xsltproc is already the newest version (1.1.29-5ubuntu0.2).
0 upgraded, 0 newly installed, 0 to remove and 2 not upgraded.
$ cd ${BUILDDIR}
$ xsltproc ../ci/CTest2JUnit.xsl Testing/`head -n 1 < Testing/TAG`/Test.xml > "JUnitTestResults_$CI_JOB_ID.xml"
Uploading artifacts for failed job
Uploading artifacts...
builddir/JUnitTestResults_818215084.xml: found 1 matching files and directories

Uploading artifacts as "junit" to coordinator... ok
id=818215084 responseStatus=201 Created token=or2PsrNB
ERROR: Job failed: exit code 1
failed
test:x86-64:linux:clang-10:cxx11-off:unsupported Test
xsltproc is already the newest version (1.1.29-5ubuntu0.2).
0 upgraded, 0 newly installed, 0 to remove and 3 not upgraded.
$ cd ${BUILDDIR}
$ xsltproc ../ci/CTest2JUnit.xsl Testing/`head -n 1 < Testing/TAG`/Test.xml > "JUnitTestResults_$CI_JOB_ID.xml"
Uploading artifacts for failed job
Uploading artifacts...
builddir/JUnitTestResults_818213771.xml: found 1 matching files and directories

Uploading artifacts as "junit" to coordinator... ok
id=818213771 responseStatus=201 Created token=81Tsyx-D
ERROR: Job failed: exit code 1
failed
test:x86-64:linux:gcc-4.8:cxx11-on:unsupported Test
xsltproc is already the newest version (1.1.29-5ubuntu0.2).
0 upgraded, 0 newly installed, 0 to remove and 3 not upgraded.
$ cd ${BUILDDIR}
$ xsltproc ../ci/CTest2JUnit.xsl Testing/`head -n 1 < Testing/TAG`/Test.xml > "JUnitTestResults_$CI_JOB_ID.xml"
Uploading artifacts for failed job
Uploading artifacts...
builddir/JUnitTestResults_818212335.xml: found 1 matching files and directories

Uploading artifacts as "junit" to coordinator... ok
id=818212335 responseStatus=201 Created token=-jZaAfdN
ERROR: Job failed: exit code 1
failed
test:x86-64:linux:gcc-10:cxx11-off:unsupported Test
xsltproc is already the newest version (1.1.29-5ubuntu0.2).
0 upgraded, 0 newly installed, 0 to remove and 2 not upgraded.
$ cd ${BUILDDIR}
$ xsltproc ../ci/CTest2JUnit.xsl Testing/`head -n 1 < Testing/TAG`/Test.xml > "JUnitTestResults_$CI_JOB_ID.xml"
Uploading artifacts for failed job
Uploading artifacts...
builddir/JUnitTestResults_818212844.xml: found 1 matching files and directories

Uploading artifacts as "junit" to coordinator... ok
id=818212844 responseStatus=201 Created token=4taFZCq9
ERROR: Job failed: exit code 1
failed
test:x86-64:linux:gcc-9:cxx11-off:unsupported Test
xsltproc is already the newest version (1.1.29-5ubuntu0.2).
0 upgraded, 0 newly installed, 0 to remove and 2 not upgraded.
$ cd ${BUILDDIR}
$ xsltproc ../ci/CTest2JUnit.xsl Testing/`head -n 1 < Testing/TAG`/Test.xml > "JUnitTestResults_$CI_JOB_ID.xml"
Uploading artifacts for failed job
Uploading artifacts...
builddir/JUnitTestResults_818211863.xml: found 1 matching files and directories

Uploading artifacts as "junit" to coordinator... ok
id=818211863 responseStatus=201 Created token=i1Usjsy1
ERROR: Job failed: exit code 1
failed
test:x86-64:linux:gcc-4.8:cxx11-off:unsupported Test
xsltproc is already the newest version (1.1.29-5ubuntu0.2).
0 upgraded, 0 newly installed, 0 to remove and 3 not upgraded.
$ cd ${BUILDDIR}
$ xsltproc ../ci/CTest2JUnit.xsl Testing/`head -n 1 < Testing/TAG`/Test.xml > "JUnitTestResults_$CI_JOB_ID.xml"
Uploading artifacts for failed job
Uploading artifacts...
builddir/JUnitTestResults_818210481.xml: found 1 matching files and directories

Uploading artifacts as "junit" to coordinator... ok
id=818210481 responseStatus=201 Created token=ryj4CsAz
ERROR: Job failed: exit code 1
failed
test:aarch64:linux:gcc-10:cxx11-on:official Test
xsltproc is already the newest version (1.1.29-5ubuntu0.2).
0 upgraded, 0 newly installed, 0 to remove and 2 not upgraded.
$ cd ${BUILDDIR}
$ xsltproc ../ci/CTest2JUnit.xsl Testing/`head -n 1 < Testing/TAG`/Test.xml > "JUnitTestResults_$CI_JOB_ID.xml"
Uploading artifacts for failed job
Uploading artifacts...
builddir/JUnitTestResults_818183456.xml: found 1 matching files and directories

Uploading artifacts as "junit" to coordinator... ok
id=818183456 responseStatus=201 Created token=YD5JVNdG
ERROR: Job failed: exit code 1
failed
test:aarch64:linux:clang-10:cxx11-on:official Test
xsltproc is already the newest version (1.1.29-5ubuntu0.2).
0 upgraded, 0 newly installed, 0 to remove and 3 not upgraded.
$ cd ${BUILDDIR}
$ xsltproc ../ci/CTest2JUnit.xsl Testing/`head -n 1 < Testing/TAG`/Test.xml > "JUnitTestResults_$CI_JOB_ID.xml"
Uploading artifacts for failed job
Uploading artifacts...
builddir/JUnitTestResults_818180003.xml: found 1 matching files and directories

Uploading artifacts as "junit" to coordinator... ok
id=818180003 responseStatus=201 Created token=_Chkud31
ERROR: Job failed: exit code 1
failed
test:aarch64:linux:gcc-10:cxx11-off:official Test
xsltproc is already the newest version (1.1.29-5ubuntu0.2).
0 upgraded, 0 newly installed, 0 to remove and 2 not upgraded.
$ cd ${BUILDDIR}
$ xsltproc ../ci/CTest2JUnit.xsl Testing/`head -n 1 < Testing/TAG`/Test.xml > "JUnitTestResults_$CI_JOB_ID.xml"
Uploading artifacts for failed job
Uploading artifacts...
builddir/JUnitTestResults_818177280.xml: found 1 matching files and directories

Uploading artifacts as "junit" to coordinator... ok
id=818177280 responseStatus=201 Created token=PmaB59cw
ERROR: Job failed: exit code 1
failed
test:aarch64:linux:clang-10:cxx11-off:official Test
xsltproc is already the newest version (1.1.29-5ubuntu0.2).
0 upgraded, 0 newly installed, 0 to remove and 3 not upgraded.
$ cd ${BUILDDIR}
$ xsltproc ../ci/CTest2JUnit.xsl Testing/`head -n 1 < Testing/TAG`/Test.xml > "JUnitTestResults_$CI_JOB_ID.xml"
Uploading artifacts for failed job
Uploading artifacts...
builddir/JUnitTestResults_818174108.xml: found 1 matching files and directories

Uploading artifacts as "junit" to coordinator... ok
id=818174108 responseStatus=201 Created token=3S9MySyY
ERROR: Job failed: exit code 1
failed
test:aarch64:linux:gcc-10:cxx11-on:unsupported Test
xsltproc is already the newest version (1.1.29-5ubuntu0.2).
0 upgraded, 0 newly installed, 0 to remove and 2 not upgraded.
$ cd ${BUILDDIR}
$ xsltproc ../ci/CTest2JUnit.xsl Testing/`head -n 1 < Testing/TAG`/Test.xml > "JUnitTestResults_$CI_JOB_ID.xml"
Uploading artifacts for failed job
Uploading artifacts...
builddir/JUnitTestResults_818178478.xml: found 1 matching files and directories

Uploading artifacts as "junit" to coordinator... ok
id=818178478 responseStatus=201 Created token=-2Jh_C4_
ERROR: Job failed: exit code 1
failed
test:aarch64:linux:clang-10:cxx11-on:unsupported Test
xsltproc is already the newest version (1.1.29-5ubuntu0.2).
0 upgraded, 0 newly installed, 0 to remove and 3 not upgraded.
$ cd ${BUILDDIR}
$ xsltproc ../ci/CTest2JUnit.xsl Testing/`head -n 1 < Testing/TAG`/Test.xml > "JUnitTestResults_$CI_JOB_ID.xml"
Uploading artifacts for failed job
Uploading artifacts...
builddir/JUnitTestResults_818172768.xml: found 1 matching files and directories

Uploading artifacts as "junit" to coordinator... ok
id=818172768 responseStatus=201 Created token=9wx-pep_
ERROR: Job failed: exit code 1
failed
test:aarch64:linux:gcc-10:cxx11-off:unsupported Test
xsltproc is already the newest version (1.1.29-5ubuntu0.2).
0 upgraded, 0 newly installed, 0 to remove and 2 not upgraded.
$ cd ${BUILDDIR}
$ xsltproc ../ci/CTest2JUnit.xsl Testing/`head -n 1 < Testing/TAG`/Test.xml > "JUnitTestResults_$CI_JOB_ID.xml"
Uploading artifacts for failed job
Uploading artifacts...
builddir/JUnitTestResults_818168705.xml: found 1 matching files and directories

Uploading artifacts as "junit" to coordinator... ok
id=818168705 responseStatus=201 Created token=G813CkW3
ERROR: Job failed: exit code 1
failed
test:aarch64:linux:clang-10:cxx11-off:unsupported Test
xsltproc is already the newest version (1.1.29-5ubuntu0.2).
0 upgraded, 0 newly installed, 0 to remove and 3 not upgraded.
$ cd ${BUILDDIR}
$ xsltproc ../ci/CTest2JUnit.xsl Testing/`head -n 1 < Testing/TAG`/Test.xml > "JUnitTestResults_$CI_JOB_ID.xml"
Uploading artifacts for failed job
Uploading artifacts...
builddir/JUnitTestResults_818167777.xml: found 1 matching files and directories

Uploading artifacts as "junit" to coordinator... ok
id=818167777 responseStatus=201 Created token=xsmFhyqS
ERROR: Job failed: exit code 1
failed
test:ppc64le:linux:clang-10:cxx11-on:unsupported Test Your runner is outdated, please upgrade your runner
No job log
failed
test:ppc64le:linux:clang-10:cxx11-on:official Test Your runner is outdated, please upgrade your runner
No job log
failed
build:ppc64le:linux:clang-10:cxx11-on Build
In file included from ../test/qr.cpp:10:
In file included from ../test/main.h:355:
In file included from ../Eigen/QR:11:
In file included from ../Eigen/Core:339:
../Eigen/src/Core/arch/AltiVec/MatrixProduct.h:1502:28: warning: cast from 'const float *' to '__vector float *' increases required alignment from 4 to 16 [-Wcast-align]
if(!LhsIsReal) lhsVi = *((Packet *) lhs_ptr_imag);
^~~~~~~~~~~~~~~~~~~~~~~
12 warnings and 14 errors generated.
ninja: build stopped: subcommand failed.
failed
test:ppc64le:linux:clang-10:cxx11-off:unsupported Test Your runner is outdated, please upgrade your runner
No job log
failed
test:ppc64le:linux:clang-10:cxx11-off:official Test Your runner is outdated, please upgrade your runner
No job log
failed
test:ppc64le:linux:gcc-10:cxx11-on:official Test Your runner is outdated, please upgrade your runner
No job log
failed
test:ppc64le:linux:gcc-10:cxx11-on:unsupported Test Your runner is outdated, please upgrade your runner
No job log
failed
test:ppc64le:linux:gcc-10:cxx11-off:unsupported Test Your runner is outdated, please upgrade your runner
No job log
failed
test:ppc64le:linux:gcc-10:cxx11-off:official Test Your runner is outdated, please upgrade your runner
No job log
failed
build:ppc64le:linux:clang-10:cxx11-off Build
In file included from ../test/hessenberg.cpp:11:
In file included from ../test/main.h:355:
In file included from ../Eigen/QR:11:
In file included from ../Eigen/Core:339:
../Eigen/src/Core/arch/AltiVec/MatrixProduct.h:1502:28: warning: cast from 'const double *' to '__vector double *' increases required alignment from 8 to 16 [-Wcast-align]
if(!LhsIsReal) lhsVi = *((Packet *) lhs_ptr_imag);
^~~~~~~~~~~~~~~~~~~~~~~
7 warnings and 14 errors generated.
ninja: build stopped: subcommand failed.
failed
build:ppc64le:linux:gcc-10:cxx11-off Build
[261/1590] Building CXX object test/CMakeFiles/bdcsvd_101.dir/bdcsvd.cpp.o
FAILED: test/CMakeFiles/bdcsvd_101.dir/bdcsvd.cpp.o
/usr/bin/g++-10 -I../ -std=c++03 -pedantic -Wall -Wextra -Wundef -Wcast-align -Wchar-subscripts -Wnon-virtual-dtor -Wunused-local-typedefs -Wpointer-arith -Wwrite-strings -Wformat-security -Wlogical-op -Wdouble-promotion -Wshadow -Wno-psabi -Wno-variadic-macros -Wno-long-long -fno-check-new -fno-common -fstrict-aliasing -ansi -O3 -DNDEBUG -DEIGEN_TEST_MAX_SIZE=320 -DEIGEN_TEST_PART_101=1 -MD -MT test/CMakeFiles/bdcsvd_101.dir/bdcsvd.cpp.o -MF test/CMakeFiles/bdcsvd_101.dir/bdcsvd.cpp.o.d -o test/CMakeFiles/bdcsvd_101.dir/bdcsvd.cpp.o -c ../test/bdcsvd.cpp
g++-10: fatal error: Killed signal terminated program cc1plus
compilation terminated.
[262/1590] Building CXX object test/CMakeFiles/bdcsvd_8.dir/bdcsvd.cpp.o
[263/1590] Building CXX object test/CMakeFiles/bdcsvd_4.dir/bdcsvd.cpp.o
[264/1590] Building CXX object test/CMakeFiles/bdcsvd_3.dir/bdcsvd.cpp.o
ninja: build stopped: subcommand failed.
failed
build:ppc64le:linux:gcc-10:cxx11-on Build
/usr/bin/g++-10   -I../ -std=c++11 -pedantic -Wall -Wextra -Wundef -Wcast-align -Wchar-subscripts -Wnon-virtual-dtor -Wunused-local-typedefs -Wpointer-arith -Wwrite-strings -Wformat-security -Wlogical-op -Wdouble-promotion -Wshadow -Wno-psabi -Wno-variadic-macros -Wno-long-long -fno-check-new -fno-common -fstrict-aliasing -ansi -O3 -DNDEBUG    -DEIGEN_TEST_MAX_SIZE=320  -DEIGEN_TEST_PART_5=1 -std=c++11 -MD -MT test/CMakeFiles/product_large_5.dir/product_large.cpp.o -MF test/CMakeFiles/product_large_5.dir/product_large.cpp.o.d -o test/CMakeFiles/product_large_5.dir/product_large.cpp.o -c ../test/product_large.cpp
g++-10: fatal error: Killed signal terminated program cc1plus
compilation terminated.
[39/1844] Building CXX object test/CMakeFiles/inplace_decomposition_6.dir/inplace_decomposition.cpp.o
[40/1844] Building CXX object test/CMakeFiles/vectorwiseop_2.dir/vectorwiseop.cpp.o
[41/1844] Building CXX object test/CMakeFiles/prec_inverse_4x4_2.dir/prec_inverse_4x4.cpp.o
[42/1844] Building CXX object test/CMakeFiles/inplace_decomposition_5.dir/inplace_decomposition.cpp.o
[43/1844] Building CXX object test/CMakeFiles/vectorwiseop_7.dir/vectorwiseop.cpp.o
ninja: build stopped: subcommand failed.