[0626/141948.527:ERROR:process_info.cc(329)] VirtualQueryEx: Access is denied. (0x5)
[0626/141948.528:ERROR:process_info.cc(556)] ReadMemoryInfo failed
[0626/141948.528:ERROR:process_memory_win.cc(39)] Failed to initialize ProcessInfo.
[0626/141948.528:ERROR:scoped_process_suspend.cc(40)] NtResumeProcess: An attempt was made to access an exiting process. (0xc000010a)
