{
    "BAV": {
        "longitude": 109.99700164794922,
        "latitude": 40.560001373291016,
        "elevation": 3321.0,
        "iata": "BAV",
        "icao": "ZBOW",
        "description": "Baotou Airport"
    },
    "CAN": {
        "longitude": 113.29900360107422,
        "latitude": 23.39240074157715,
        "elevation": 50.0,
        "iata": "CAN",
        "icao": "ZGGG",
        "description": "Guangzhou Baiyun International Airport"
    },
    "CGO": {
        "longitude": 113.841003418,
        "latitude": 34.519699096699995,
        "elevation": 495.0,
        "iata": "CGO",
        "icao": "ZHCC",
        "description": "Zhengzhou Xinzheng International Airport"
    },
    "CGQ": {
        "longitude": 125.684997559,
        "latitude": 43.9962005615,
        "elevation": 706.0,
        "iata": "CGQ",
        "icao": "ZYCC",
        "description": "Longjia Airport"
    },
    "CKG": {
        "longitude": 106.64199829101562,
        "latitude": 29.719200134277344,
        "elevation": 1365.0,
        "iata": "CKG",
        "icao": "ZUCK",
        "description": "Chongqing Jiangbei International Airport"
    },
    "CSX": {
        "longitude": 113.220001221,
        "latitude": 28.189199447599997,
        "elevation": 217.0,
        "iata": "CSX",
        "icao": "ZGHA",
        "description": "Changsha Huanghua International Airport"
    },
    "CTU": {
        "longitude": 103.9469985961914,
        "latitude": 30.578500747680664,
        "elevation": 1625.0,
        "iata": "CTU",
        "icao": "ZUUU",
        "description": "Chengdu Shuangliu International Airport"
    },
    "CZX": {
        "longitude": 119.778999,
        "latitude": 31.919701,
        "elevation": 0.0,
        "iata": "CZX",
        "icao": "ZSCG",
        "description": "Changzhou Benniu Airport"
    },
    "DLC": {
        "longitude": 121.53900146484375,
        "latitude": 38.9656982421875,
        "elevation": 107.0,
        "iata": "DLC",
        "icao": "ZYTL",
        "description": "Zhoushuizi Airport"
    },
    "DLU": {
        "longitude": 100.319,
        "latitude": 25.649401,
        "elevation": 7050.0,
        "iata": "DLU",
        "icao": "ZPDL",
        "description": "Dali Airport"
    },
    "FOC": {
        "longitude": 119.66300201416016,
        "latitude": 25.935100555419922,
        "elevation": 46.0,
        "iata": "FOC",
        "icao": "ZSFZ",
        "description": "Fuzhou Changle International Airport"
    },
    "HAK": {
        "longitude": 110.45899963378906,
        "latitude": 19.934900283813477,
        "elevation": 75.0,
        "iata": "HAK",
        "icao": "ZJHK",
        "description": "Haikou Meilan International Airport"
    },
    "HET": {
        "longitude": 111.823997,
        "latitude": 40.851398,
        "elevation": 3556.0,
        "iata": "HET",
        "icao": "ZBHH",
        "description": "Baita International Airport"
    },
    "HFE": {
        "longitude": 117.2979965209961,
        "latitude": 31.780000686645508,
        "elevation": 108.0,
        "iata": "HFE",
        "icao": "ZSOF",
        "description": "Hefei Luogang International Airport"
    },
    "HGH": {
        "longitude": 120.43399810791016,
        "latitude": 30.22949981689453,
        "elevation": 23.0,
        "iata": "HGH",
        "icao": "ZSHC",
        "description": "Hangzhou Xiaoshan International Airport"
    },
    "HKG": {
        "longitude": 113.915001,
        "latitude": 22.308901,
        "elevation": 28.0,
        "iata": "HKG",
        "icao": "VHHH",
        "description": "Hong Kong International Airport"
    },
    "HRB": {
        "longitude": 126.25,
        "latitude": 45.6234016418457,
        "elevation": 457.0,
        "iata": "HRB",
        "icao": "ZYHB",
        "description": "Taiping Airport"
    },
    "INC": {
        "longitude": 106.009003,
        "latitude": 38.481899,
        "elevation": 0.0,
        "iata": "INC",
        "icao": "ZLIC",
        "description": "Yinchuan Airport"
    },
    "JJN": {
        "longitude": 118.589996,
        "latitude": 24.7964,
        "elevation": 0.0,
        "iata": "JJN",
        "icao": "ZSQZ",
        "description": "Quanzhou Jinjiang International Airport"
    },
    "KHN": {
        "longitude": 115.9000015258789,
        "latitude": 28.864999771118164,
        "elevation": 143.0,
        "iata": "KHN",
        "icao": "ZSCN",
        "description": "Nanchang Changbei International Airport"
    },
    "KMG": {
        "longitude": 102.9291667,
        "latitude": 25.1019444,
        "elevation": 6903.0,
        "iata": "KMG",
        "icao": "ZPPP",
        "description": "Kunming Changshui International Airport"
    },
    "KWE": {
        "longitude": 106.8010025024414,
        "latitude": 26.53849983215332,
        "elevation": 3736.0,
        "iata": "KWE",
        "icao": "ZUGY",
        "description": "Guiyang Longdongbao Airport"
    },
    "KWL": {
        "longitude": 110.03900146484375,
        "latitude": 25.21809959411621,
        "elevation": 570.0,
        "iata": "KWL",
        "icao": "ZGKL",
        "description": "Guilin Liangjiang International Airport"
    },
    "LHW": {
        "longitude": 103.620002747,
        "latitude": 36.5152015686,
        "elevation": 6388.0,
        "iata": "LHW",
        "icao": "ZLLL",
        "description": "Lanzhou Zhongchuan Airport"
    },
    "LJG": {
        "longitude": 100.246002197,
        "latitude": 26.6800003052,
        "elevation": 0.0,
        "iata": "LJG",
        "icao": "ZPLJ",
        "description": "Lijiang Airport"
    },
    "LXA": {
        "longitude": 90.91190338130001,
        "latitude": 29.2978000641,
        "elevation": 11713.0,
        "iata": "LXA",
        "icao": "ZULS",
        "description": "Lhasa Gonggar Airport"
    },
    "LYA": {
        "longitude": 112.388000488,
        "latitude": 34.741100311299995,
        "elevation": 840.0,
        "iata": "LYA",
        "icao": "ZHLY",
        "description": "Luoyang Airport"
    },
    "LYG": {
        "longitude": 118.873611,
        "latitude": 34.571667,
        "elevation": 0.0,
        "iata": "LYG",
        "icao": "ZSLG",
        "description": "Lianyungang Airport"
    },
    "MFM": {
        "longitude": 113.592003,
        "latitude": 22.149599,
        "elevation": 20.0,
        "iata": "MFM",
        "icao": "VMMC",
        "description": "Macau International Airport"
    },
    "NGB": {
        "longitude": 121.46199798583984,
        "latitude": 29.82670021057129,
        "elevation": 13.0,
        "iata": "NGB",
        "icao": "ZSNB",
        "description": "Ningbo Lishe International Airport"
    },
    "NKG": {
        "longitude": 118.86199951171875,
        "latitude": 31.742000579833984,
        "elevation": 49.0,
        "iata": "NKG",
        "icao": "ZSNJ",
        "description": "Nanjing Lukou Airport"
    },
    "NNG": {
        "longitude": 108.1719970703125,
        "latitude": 22.608299255371094,
        "elevation": 421.0,
        "iata": "NNG",
        "icao": "ZGNN",
        "description": "Nanning Wuxu Airport"
    },
    "PEK": {
        "longitude": 116.58499908447266,
        "latitude": 40.080101013183594,
        "elevation": 116.0,
        "iata": "PEK",
        "icao": "ZBAA",
        "description": "Beijing Capital International Airport"
    },
    "SHA": {
        "longitude": 121.33599853515625,
        "latitude": 31.197900772094727,
        "elevation": 10.0,
        "iata": "SHA",
        "icao": "ZSSS",
        "description": "Shanghai Hongqiao International Airport"
    },
    "SHE": {
        "longitude": 123.48300170898438,
        "latitude": 41.639801025390625,
        "elevation": 198.0,
        "iata": "SHE",
        "icao": "ZYTX",
        "description": "Taoxian Airport"
    },
    "SJW": {
        "longitude": 114.6969985961914,
        "latitude": 38.28070068359375,
        "elevation": 233.0,
        "iata": "SJW",
        "icao": "ZBSJ",
        "description": "Shijiazhuang Daguocun International Airport"
    },
    "SYX": {
        "longitude": 109.41200256347656,
        "latitude": 18.302900314331055,
        "elevation": 92.0,
        "iata": "SYX",
        "icao": "ZJSY",
        "description": "Sanya Phoenix International Airport"
    },
    "SZX": {
        "longitude": 113.81099700927734,
        "latitude": 22.639299392700195,
        "elevation": 13.0,
        "iata": "SZX",
        "icao": "ZGSZ",
        "description": "Shenzhen Bao'an International Airport"
    },
    "TAO": {
        "longitude": 120.374000549,
        "latitude": 36.2661018372,
        "elevation": 33.0,
        "iata": "TAO",
        "icao": "ZSQD",
        "description": "Qingdao Liuting Airport"
    },
    "TNA": {
        "longitude": 117.21600341796875,
        "latitude": 36.857200622558594,
        "elevation": 76.0,
        "iata": "TNA",
        "icao": "ZSJN",
        "description": "Jinan Yaoqiang Airport"
    },
    "TPE": {
        "longitude": 121.233002,
        "latitude": 25.0777,
        "elevation": 106.0,
        "iata": "TPE",
        "icao": "RCTP",
        "description": "Taiwan Taoyuan International Airport"
    },
    "TSA": {
        "longitude": 121.552001953125,
        "latitude": 25.069400787353516,
        "elevation": 18.0,
        "iata": "TSA",
        "icao": "RCSS",
        "description": "Taipei Songshan Airport"
    },
    "TSN": {
        "longitude": 117.346000671,
        "latitude": 39.124401092499994,
        "elevation": 10.0,
        "iata": "TSN",
        "icao": "ZBTJ",
        "description": "Tianjin Binhai International Airport"
    },
    "TXN": {
        "longitude": 118.25599670410156,
        "latitude": 29.733299255371094,
        "elevation": 0.0,
        "iata": "TXN",
        "icao": "ZSTX",
        "description": "Tunxi International Airport"
    },
    "TYN": {
        "longitude": 112.62799835205078,
        "latitude": 37.74689865112305,
        "elevation": 2575.0,
        "iata": "TYN",
        "icao": "ZBYN",
        "description": "Taiyuan Wusu Airport"
    },
    "URC": {
        "longitude": 87.47419738769531,
        "latitude": 43.907100677490234,
        "elevation": 2125.0,
        "iata": "URC",
        "icao": "ZWWW",
        "description": "Wurumuqi International Airport"
    },
    "WNZ": {
        "longitude": 120.851997,
        "latitude": 27.912201,
        "elevation": 0.0,
        "iata": "WNZ",
        "icao": "ZSWZ",
        "description": "Wenzhou Longwan International Airport"
    },
    "WUH": {
        "longitude": 114.208,
        "latitude": 30.7838,
        "elevation": 113.0,
        "iata": "WUH",
        "icao": "ZHHH",
        "description": "Wuhan Tianhe International Airport"
    },
    "WUX": {
        "longitude": 120.429000854,
        "latitude": 31.494400024399997,
        "elevation": 24.0,
        "iata": "WUX",
        "icao": "ZSWX",
        "description": "Sunan Shuofang International Airport"
    },
    "XIY": {
        "longitude": 108.751999,
        "latitude": 34.447102,
        "elevation": 1572.0,
        "iata": "XIY",
        "icao": "ZLXY",
        "description": "Xi'an Xianyang International Airport"
    },
    "XMN": {
        "longitude": 118.12799835205078,
        "latitude": 24.54400062561035,
        "elevation": 59.0,
        "iata": "XMN",
        "icao": "ZSAM",
        "description": "Xiamen Gaoqi International Airport"
    },
    "XNN": {
        "longitude": 102.042999,
        "latitude": 36.5275,
        "elevation": 7119.0,
        "iata": "XNN",
        "icao": "ZLXN",
        "description": "Xining Caojiabu Airport"
    },
    "XUZ": {
        "longitude": 117.555278,
        "latitude": 34.059056,
        "elevation": 0.0,
        "iata": "XUZ",
        "icao": "ZSXZ",
        "description": "Xuzhou Guanyin Airport"
    },
    "YIW": {
        "longitude": 120.031997681,
        "latitude": 29.3446998596,
        "elevation": 262.0,
        "iata": "YIW",
        "icao": "ZSYW",
        "description": "Yiwu Airport"
    },
    "YNT": {
        "longitude": 121.37200164794922,
        "latitude": 37.40169906616211,
        "elevation": 59.0,
        "iata": "YNT",
        "icao": "ZSYT",
        "description": "Yantai Laishan Airport"
    },
    "ZUH": {
        "longitude": 113.375999,
        "latitude": 22.006399,
        "elevation": 23.0,
        "iata": "ZUH",
        "icao": "ZGSD",
        "description": "Zhuhai Jinwan Airport"
    }
}