.........
----------------------------------------------------------------------
Ran 9 tests in 0.003s

OK
Name               Stmts   Miss Branch BrPart  Cover   Missing
--------------------------------------------------------------
Army.py               23      0      4      0   100%
Diplomacy.py          48      0     40      0   100%
TestDiplomacy.py      67      0      0      0   100%
--------------------------------------------------------------
TOTAL                138      0     44      0   100%
