..............
----------------------------------------------------------------------
Ran 14 tests in 0.004s

OK
Name               Stmts   Miss Branch BrPart  Cover   Missing
--------------------------------------------------------------
Diplomacy.py          54      0     42      0   100%
TestDiplomacy.py      61      0      0      0   100%
--------------------------------------------------------------
TOTAL                115      0     42      0   100%
