6285 194 262
7445 3685 262
8555 31 262
5548 3122 238
8337 1684 262
5401 7780 262
6643 8566 257
2249 2237 139
5708 3063 238
2028 1757 175
8292 8683 234
3880 2657 238
9701 342 262
1390 8214 262
6757 7707 257
7256 9516 260
4935 4958 197
5243 218 238
4215 5797 236
4350 9709 262
3443 9937 262
9853 1522 262
6223 6245 187
8453 804 262
6884 2660 262
9852 529 262
9997 8039 260
3057 968 217
9468 286 262
1560 264 182
5978 7740 262
109 2611 209
9776 4759 262
3544 6641 262
6111 2303 238
1104 6907 262
6113 3113 238
1325 3438 217
9211 4355 262
8931 2021 262
7015 955 262
8582 6859 257
4269 4818 215
9919 9533 242
9028 5500 262
1930 7253 262
9350 2577 262
3344 7838 262
2212 7695 262
7556 6590 257
4156 5914 236
1860 8552 262
8558 9392 260
7310 2632 262
1264 8493 262
1295 3030 217
4526 2501 238
9435 6160 262
898 9442 262
5047 6775 262
4780 94 238
5299 4729 210
3963 646 238
7852 2498 262
3074 1283 217
9969 516 262
6130 2457 238
9902 4155 262
6224 8152 257
3214 9234 262
105 6147 238
7609 2991 262
4831 6392 262
2551 1407 209
8018 6322 257
5284 1075 238
8723 3371 262
8829 7906 252
3254 11 217
7402 6228 257
9814 5502 262
3674 5834 238
5402 4772 210
9655 2260 262
6660 9736 260
2236 5302 238
8534 3164 262
5853 1958 238
7998 2810 262
2042 4425 238
2062 6570 262
2413 3692 217
1254 473 182
9623 9332 198
4317 1082 238
8441 6300 257
7648 7261 239
7318 6313 257
2116 5660 238
5989 7650 262
9754 653 262
911 2434 183
1247 3649 217
1441 4689 238
3814 1274 238
9829 4483 262
5688 3271 238
7872 3453 262
838 5019 238
5727 8650 262
9649 3979 262
9938 691 262
7447 3237 262
9037 4905 262
6695 2472 262
3717 2298 238
1785 2031 175
7187 1724 262
5680 8128 262
7546 5635 262
1035 1035 125
3027 3027 67
1252 1252 133
5209 5209 42
5279 5279 78
4298 4298 26
71 71 103
4206 4206 96
3325 3325 137
3440 3440 106
4304 4304 34
9095 9095 141
3565 3565 49
3194 3194 124
581 581 119
3487 3487 132
6887 6887 169
3828 3828 57
5731 5731 29
8802 8802 141
4131 4131 127
6633 6633 76
376 376 108
8242 8242 66
1933 1933 25
9500 9500 167
3989 3989 52
4535 4535 91
316 316 38
1127 1127 138
