...............
----------------------------------------------------------------------
Ran 15 tests in 0.045s

OK
Name             Stmts   Miss Branch BrPart  Cover   Missing
------------------------------------------------------------
Collatz.py          35      0     14      0   100%
TestCollatz.py      68      0      0      0   100%
------------------------------------------------------------
TOTAL              103      0     14      0   100%
