{
    "git": {
        "description": "Git Commands",
        "command_candidates": [
            [
                "Git: Open Project Root",
                "let l:a=system('git rev-parse --show-toplevel') | execute printf('cd %s', l:a) | unlet l:a"
            ],
            [
                "Git: Commit Staged Files",
                "Gcommit"
            ],
            [
                "Git: Pull latest changes",
                "Git pull"
            ],
            [
                "Git: Push to origin",
                "Git push -u origin"
            ],
            [
                "Git: Status",
                "Gstatus"
            ],
            [
                "Git: View Blame History",
                "Gblame"
            ],
            [
                "Git: Write File",
                "Gwrite"
            ]
        ]
    },
    "snip": {
        "description": "Snippet Management Commands",
        "command_candidates": [
            [
                "Edit Snippets",
                "NeoSnippetEdit"
            ],
            [
                "Clear Snippet Markers",
                "NeoSnippetClearMarkers"
            ],
            [
                "Make Snippet Cache",
                "NeoSnippetMakeCache"
            ]
        ]
    },
    "vim": {
        "description": "Vim Configuration",
        "command_candidates": [
            [
                "Reload Vim Configs",
                "execute 'source ' . $MYVIMRC"
            ],
            [
                "Print Filetype",
                "echom 'previous file:  ' . bufname(bufnr('%'))"
            ],
            [
                "Colorscheme ...",
                "Denite colorscheme"
            ],
            [
                "Vim Help ...",
                "Denite help"
            ]
        ]
    },
    "root": {
        "description": "Top-Level Command Palette",
        "command_candidates": [
            [
                "Cmd:   Git Version Control ...",
                "Denite menu:git"
            ],
            [
                "Cmd:   Snippets ...",
                "Denite menu:snip"
            ],
            [
                "Vim:   Configuration ...",
                "Denite menu:vim"
            ],
            [
                "File:  Change History ...",
                "Denite change"
            ],
            [
                "Vim:   Available Commands ...",
                "Denite command"
            ],
            [
                "Vim:   Command History ...",
                "Denite command_history"
            ],
            [
                "File:  Find in Outline ...",
                "Denite outline"
            ],
            [
                "File:  Open Sidebar",
                "NERDTreeToggle"
            ],
            [
                "File:  Grep Project ...",
                "Denite grep"
            ],
            [
                "File:  Find Line in File ...",
                "Denite line"
            ],
            [
                "File:  Find Line in AlL Buffers ...",
                "Denite line"
            ],
            [
                "File:  Find Tag/Symbol ...",
                "Denite tag"
            ],
            [
                "Vim:   Buffers ...",
                "Denite buffer"
            ],
            [
                "Vim:   Help Documentation ...",
                "Denite help"
            ],
            [
                "Vim:   Jump History ...",
                "Denite jump"
            ],
            [
                "Vim:   Text Registers ...",
                "Denite register"
            ],
            [
                "Close This Menu",
                "return 0"
            ]
        ],
        "file_candidates": []
    }
}
