{
  "name": "LghsMqtt",
  "version": "1.0.0",
  "description": "a library to add high interface for mqtt",
  "keywords": "mqtt",
  "repository":
  {
    "type": "git",
    "url": "https://gitlab.com/lghs/embeddedlib/mqtt"
  },
  "authors":
  [
    {
      "name": "François Pelsser",
      "email": "dev@frol.be",
      "maintainer": true
    }
  ],
  "license": "gpl-3.0",
  "frameworks": "*",
  "platforms": "*"
}
