(kicad_sch (version 20211123) (generator eeschema)

  (uuid b995e0b8-d726-40cf-b1dd-29f3cd3271dd)

  (paper "A4")

  (lib_symbols
    (symbol "Connector_Generic:Conn_01x04" (pin_names (offset 1.016) hide) (in_bom yes) (on_board yes)
      (property "Reference" "J" (id 0) (at 0 5.08 0)
        (effects (font (size 1.27 1.27)))
      )
      (property "Value" "Conn_01x04" (id 1) (at 0 -7.62 0)
        (effects (font (size 1.27 1.27)))
      )
      (property "Footprint" "" (id 2) (at 0 0 0)
        (effects (font (size 1.27 1.27)) hide)
      )
      (property "Datasheet" "~" (id 3) (at 0 0 0)
        (effects (font (size 1.27 1.27)) hide)
      )
      (property "ki_keywords" "connector" (id 4) (at 0 0 0)
        (effects (font (size 1.27 1.27)) hide)
      )
      (property "ki_description" "Generic connector, single row, 01x04, script generated (kicad-library-utils/schlib/autogen/connector/)" (id 5) (at 0 0 0)
        (effects (font (size 1.27 1.27)) hide)
      )
      (property "ki_fp_filters" "Connector*:*_1x??_*" (id 6) (at 0 0 0)
        (effects (font (size 1.27 1.27)) hide)
      )
      (symbol "Conn_01x04_1_1"
        (rectangle (start -1.27 -4.953) (end 0 -5.207)
          (stroke (width 0.1524) (type default) (color 0 0 0 0))
          (fill (type none))
        )
        (rectangle (start -1.27 -2.413) (end 0 -2.667)
          (stroke (width 0.1524) (type default) (color 0 0 0 0))
          (fill (type none))
        )
        (rectangle (start -1.27 0.127) (end 0 -0.127)
          (stroke (width 0.1524) (type default) (color 0 0 0 0))
          (fill (type none))
        )
        (rectangle (start -1.27 2.667) (end 0 2.413)
          (stroke (width 0.1524) (type default) (color 0 0 0 0))
          (fill (type none))
        )
        (rectangle (start -1.27 3.81) (end 1.27 -6.35)
          (stroke (width 0.254) (type default) (color 0 0 0 0))
          (fill (type background))
        )
        (pin passive line (at -5.08 2.54 0) (length 3.81)
          (name "Pin_1" (effects (font (size 1.27 1.27))))
          (number "1" (effects (font (size 1.27 1.27))))
        )
        (pin passive line (at -5.08 0 0) (length 3.81)
          (name "Pin_2" (effects (font (size 1.27 1.27))))
          (number "2" (effects (font (size 1.27 1.27))))
        )
        (pin passive line (at -5.08 -2.54 0) (length 3.81)
          (name "Pin_3" (effects (font (size 1.27 1.27))))
          (number "3" (effects (font (size 1.27 1.27))))
        )
        (pin passive line (at -5.08 -5.08 0) (length 3.81)
          (name "Pin_4" (effects (font (size 1.27 1.27))))
          (number "4" (effects (font (size 1.27 1.27))))
        )
      )
    )
    (symbol "Device:C" (pin_numbers hide) (pin_names (offset 0.254)) (in_bom yes) (on_board yes)
      (property "Reference" "C" (id 0) (at 0.635 2.54 0)
        (effects (font (size 1.27 1.27)) (justify left))
      )
      (property "Value" "C" (id 1) (at 0.635 -2.54 0)
        (effects (font (size 1.27 1.27)) (justify left))
      )
      (property "Footprint" "" (id 2) (at 0.9652 -3.81 0)
        (effects (font (size 1.27 1.27)) hide)
      )
      (property "Datasheet" "~" (id 3) (at 0 0 0)
        (effects (font (size 1.27 1.27)) hide)
      )
      (property "ki_keywords" "cap capacitor" (id 4) (at 0 0 0)
        (effects (font (size 1.27 1.27)) hide)
      )
      (property "ki_description" "Unpolarized capacitor" (id 5) (at 0 0 0)
        (effects (font (size 1.27 1.27)) hide)
      )
      (property "ki_fp_filters" "C_*" (id 6) (at 0 0 0)
        (effects (font (size 1.27 1.27)) hide)
      )
      (symbol "C_0_1"
        (polyline
          (pts
            (xy -2.032 -0.762)
            (xy 2.032 -0.762)
          )
          (stroke (width 0.508) (type default) (color 0 0 0 0))
          (fill (type none))
        )
        (polyline
          (pts
            (xy -2.032 0.762)
            (xy 2.032 0.762)
          )
          (stroke (width 0.508) (type default) (color 0 0 0 0))
          (fill (type none))
        )
      )
      (symbol "C_1_1"
        (pin passive line (at 0 3.81 270) (length 2.794)
          (name "~" (effects (font (size 1.27 1.27))))
          (number "1" (effects (font (size 1.27 1.27))))
        )
        (pin passive line (at 0 -3.81 90) (length 2.794)
          (name "~" (effects (font (size 1.27 1.27))))
          (number "2" (effects (font (size 1.27 1.27))))
        )
      )
    )
    (symbol "Device:R" (pin_numbers hide) (pin_names (offset 0)) (in_bom yes) (on_board yes)
      (property "Reference" "R" (id 0) (at 2.032 0 90)
        (effects (font (size 1.27 1.27)))
      )
      (property "Value" "R" (id 1) (at 0 0 90)
        (effects (font (size 1.27 1.27)))
      )
      (property "Footprint" "" (id 2) (at -1.778 0 90)
        (effects (font (size 1.27 1.27)) hide)
      )
      (property "Datasheet" "~" (id 3) (at 0 0 0)
        (effects (font (size 1.27 1.27)) hide)
      )
      (property "ki_keywords" "R res resistor" (id 4) (at 0 0 0)
        (effects (font (size 1.27 1.27)) hide)
      )
      (property "ki_description" "Resistor" (id 5) (at 0 0 0)
        (effects (font (size 1.27 1.27)) hide)
      )
      (property "ki_fp_filters" "R_*" (id 6) (at 0 0 0)
        (effects (font (size 1.27 1.27)) hide)
      )
      (symbol "R_0_1"
        (rectangle (start -1.016 -2.54) (end 1.016 2.54)
          (stroke (width 0.254) (type default) (color 0 0 0 0))
          (fill (type none))
        )
      )
      (symbol "R_1_1"
        (pin passive line (at 0 3.81 270) (length 1.27)
          (name "~" (effects (font (size 1.27 1.27))))
          (number "1" (effects (font (size 1.27 1.27))))
        )
        (pin passive line (at 0 -3.81 90) (length 1.27)
          (name "~" (effects (font (size 1.27 1.27))))
          (number "2" (effects (font (size 1.27 1.27))))
        )
      )
    )
    (symbol "Diode:MBRA340" (pin_numbers hide) (pin_names hide) (in_bom yes) (on_board yes)
      (property "Reference" "D" (id 0) (at 0 2.54 0)
        (effects (font (size 1.27 1.27)))
      )
      (property "Value" "MBRA340" (id 1) (at 0 -2.54 0)
        (effects (font (size 1.27 1.27)))
      )
      (property "Footprint" "Diode_SMD:D_SMA" (id 2) (at 0 -4.445 0)
        (effects (font (size 1.27 1.27)) hide)
      )
      (property "Datasheet" "https://www.onsemi.com/pub/Collateral/MBRA340T3-D.PDF" (id 3) (at 0 0 0)
        (effects (font (size 1.27 1.27)) hide)
      )
      (property "ki_keywords" "diode Schottky" (id 4) (at 0 0 0)
        (effects (font (size 1.27 1.27)) hide)
      )
      (property "ki_description" "40V 3A Schottky Barrier Rectifier Diode, SMA(DO-214AC)" (id 5) (at 0 0 0)
        (effects (font (size 1.27 1.27)) hide)
      )
      (property "ki_fp_filters" "D*SMA*" (id 6) (at 0 0 0)
        (effects (font (size 1.27 1.27)) hide)
      )
      (symbol "MBRA340_0_1"
        (polyline
          (pts
            (xy 1.27 0)
            (xy -1.27 0)
          )
          (stroke (width 0) (type default) (color 0 0 0 0))
          (fill (type none))
        )
        (polyline
          (pts
            (xy 1.27 1.27)
            (xy 1.27 -1.27)
            (xy -1.27 0)
            (xy 1.27 1.27)
          )
          (stroke (width 0.254) (type default) (color 0 0 0 0))
          (fill (type none))
        )
        (polyline
          (pts
            (xy -1.905 0.635)
            (xy -1.905 1.27)
            (xy -1.27 1.27)
            (xy -1.27 -1.27)
            (xy -0.635 -1.27)
            (xy -0.635 -0.635)
          )
          (stroke (width 0.254) (type default) (color 0 0 0 0))
          (fill (type none))
        )
      )
      (symbol "MBRA340_1_1"
        (pin passive line (at -3.81 0 0) (length 2.54)
          (name "K" (effects (font (size 1.27 1.27))))
          (number "1" (effects (font (size 1.27 1.27))))
        )
        (pin passive line (at 3.81 0 180) (length 2.54)
          (name "A" (effects (font (size 1.27 1.27))))
          (number "2" (effects (font (size 1.27 1.27))))
        )
      )
    )
    (symbol "Jumper:SolderJumper_3_Open" (pin_names (offset 0) hide) (in_bom yes) (on_board yes)
      (property "Reference" "JP" (id 0) (at -2.54 -2.54 0)
        (effects (font (size 1.27 1.27)))
      )
      (property "Value" "SolderJumper_3_Open" (id 1) (at 0 2.794 0)
        (effects (font (size 1.27 1.27)))
      )
      (property "Footprint" "" (id 2) (at 0 0 0)
        (effects (font (size 1.27 1.27)) hide)
      )
      (property "Datasheet" "~" (id 3) (at 0 0 0)
        (effects (font (size 1.27 1.27)) hide)
      )
      (property "ki_keywords" "Solder Jumper SPDT" (id 4) (at 0 0 0)
        (effects (font (size 1.27 1.27)) hide)
      )
      (property "ki_description" "Solder Jumper, 3-pole, open" (id 5) (at 0 0 0)
        (effects (font (size 1.27 1.27)) hide)
      )
      (property "ki_fp_filters" "SolderJumper*Open*" (id 6) (at 0 0 0)
        (effects (font (size 1.27 1.27)) hide)
      )
      (symbol "SolderJumper_3_Open_0_1"
        (arc (start -1.016 1.016) (mid -2.032 0) (end -1.016 -1.016)
          (stroke (width 0) (type default) (color 0 0 0 0))
          (fill (type none))
        )
        (arc (start -1.016 1.016) (mid -2.032 0) (end -1.016 -1.016)
          (stroke (width 0) (type default) (color 0 0 0 0))
          (fill (type outline))
        )
        (rectangle (start -0.508 1.016) (end 0.508 -1.016)
          (stroke (width 0) (type default) (color 0 0 0 0))
          (fill (type outline))
        )
        (polyline
          (pts
            (xy -2.54 0)
            (xy -2.032 0)
          )
          (stroke (width 0) (type default) (color 0 0 0 0))
          (fill (type none))
        )
        (polyline
          (pts
            (xy -1.016 1.016)
            (xy -1.016 -1.016)
          )
          (stroke (width 0) (type default) (color 0 0 0 0))
          (fill (type none))
        )
        (polyline
          (pts
            (xy 0 -1.27)
            (xy 0 -1.016)
          )
          (stroke (width 0) (type default) (color 0 0 0 0))
          (fill (type none))
        )
        (polyline
          (pts
            (xy 1.016 1.016)
            (xy 1.016 -1.016)
          )
          (stroke (width 0) (type default) (color 0 0 0 0))
          (fill (type none))
        )
        (polyline
          (pts
            (xy 2.54 0)
            (xy 2.032 0)
          )
          (stroke (width 0) (type default) (color 0 0 0 0))
          (fill (type none))
        )
        (arc (start 1.016 -1.016) (mid 2.032 0) (end 1.016 1.016)
          (stroke (width 0) (type default) (color 0 0 0 0))
          (fill (type none))
        )
        (arc (start 1.016 -1.016) (mid 2.032 0) (end 1.016 1.016)
          (stroke (width 0) (type default) (color 0 0 0 0))
          (fill (type outline))
        )
      )
      (symbol "SolderJumper_3_Open_1_1"
        (pin passive line (at -5.08 0 0) (length 2.54)
          (name "A" (effects (font (size 1.27 1.27))))
          (number "1" (effects (font (size 1.27 1.27))))
        )
        (pin input line (at 0 -3.81 90) (length 2.54)
          (name "C" (effects (font (size 1.27 1.27))))
          (number "2" (effects (font (size 1.27 1.27))))
        )
        (pin passive line (at 5.08 0 180) (length 2.54)
          (name "B" (effects (font (size 1.27 1.27))))
          (number "3" (effects (font (size 1.27 1.27))))
        )
      )
    )
    (symbol "easyeda sym:AP2302B" (in_bom yes) (on_board yes)
      (property "Reference" "Q?" (id 0) (at 0 10.16 0)
        (effects (font (size 1.27 1.27)))
      )
      (property "Value" "AP2302B" (id 1) (at 0 -10.16 0)
        (effects (font (size 1.27 1.27)))
      )
      (property "Footprint" "easyeda2kicad:SOT-23_L2.9-W1.3-P1.90-LS2.4-BR" (id 2) (at 0 -12.7 0)
        (effects (font (size 1.27 1.27)) hide)
      )
      (property "Datasheet" "https://lcsc.com/product-detail/MOSFET_ShenZhen-Quan-Li-Semiconductor-AP2302B_C406812.html" (id 3) (at 0 -15.24 0)
        (effects (font (size 1.27 1.27)) hide)
      )
      (property "Manufacturer" "ShenZhen Quan Li Semiconductor" (id 4) (at 0 -17.78 0)
        (effects (font (size 1.27 1.27)) hide)
      )
      (property "LCSC Part" "C406812" (id 5) (at 0 -20.32 0)
        (effects (font (size 1.27 1.27)) hide)
      )
      (property "JLC Part" "Extended Part" (id 6) (at 0 -22.86 0)
        (effects (font (size 1.27 1.27)) hide)
      )
      (symbol "AP2302B_0_1"
        (polyline
          (pts
            (xy -3.05 2.29)
            (xy -3.05 -2.29)
          )
          (stroke (width 0) (type default) (color 0 0 0 0))
          (fill (type none))
        )
        (polyline
          (pts
            (xy -2.54 -2.29)
            (xy -2.54 -1.27)
          )
          (stroke (width 0) (type default) (color 0 0 0 0))
          (fill (type none))
        )
        (polyline
          (pts
            (xy -2.54 -0.51)
            (xy -2.54 0.51)
          )
          (stroke (width 0) (type default) (color 0 0 0 0))
          (fill (type none))
        )
        (polyline
          (pts
            (xy -2.54 2.29)
            (xy -2.54 1.27)
          )
          (stroke (width 0) (type default) (color 0 0 0 0))
          (fill (type none))
        )
        (polyline
          (pts
            (xy 0 -1.78)
            (xy -2.54 -1.78)
          )
          (stroke (width 0) (type default) (color 0 0 0 0))
          (fill (type none))
        )
        (polyline
          (pts
            (xy 1.52 0.76)
            (xy 3.3 0.76)
          )
          (stroke (width 0) (type default) (color 0 0 0 0))
          (fill (type none))
        )
        (polyline
          (pts
            (xy -2.54 0)
            (xy -1.02 -0.51)
            (xy -1.02 0.51)
            (xy -2.54 0)
          )
          (stroke (width 0) (type default) (color 0 0 0 0))
          (fill (type background))
        )
        (polyline
          (pts
            (xy 2.54 0.51)
            (xy 1.78 -0.76)
            (xy 3.3 -0.76)
            (xy 2.54 0.51)
          )
          (stroke (width 0) (type default) (color 0 0 0 0))
          (fill (type background))
        )
        (polyline
          (pts
            (xy -2.54 0)
            (xy 0 0)
            (xy 0 -2.54)
            (xy 2.54 -2.54)
            (xy 2.54 -0.76)
          )
          (stroke (width 0) (type default) (color 0 0 0 0))
          (fill (type none))
        )
        (polyline
          (pts
            (xy -2.54 1.78)
            (xy 0 1.78)
            (xy 0 2.54)
            (xy 2.54 2.54)
            (xy 2.54 0.51)
          )
          (stroke (width 0) (type default) (color 0 0 0 0))
          (fill (type none))
        )
        (pin unspecified line (at -5.59 0 0) (length 2.54)
          (name "G" (effects (font (size 1.27 1.27))))
          (number "1" (effects (font (size 1.27 1.27))))
        )
        (pin unspecified line (at 0 -5.08 90) (length 2.54)
          (name "S" (effects (font (size 1.27 1.27))))
          (number "2" (effects (font (size 1.27 1.27))))
        )
        (pin unspecified line (at 0 5.08 270) (length 2.54)
          (name "D" (effects (font (size 1.27 1.27))))
          (number "3" (effects (font (size 1.27 1.27))))
        )
      )
    )
    (symbol "power:+3.3V" (power) (pin_names (offset 0)) (in_bom yes) (on_board yes)
      (property "Reference" "#PWR" (id 0) (at 0 -3.81 0)
        (effects (font (size 1.27 1.27)) hide)
      )
      (property "Value" "+3.3V" (id 1) (at 0 3.556 0)
        (effects (font (size 1.27 1.27)))
      )
      (property "Footprint" "" (id 2) (at 0 0 0)
        (effects (font (size 1.27 1.27)) hide)
      )
      (property "Datasheet" "" (id 3) (at 0 0 0)
        (effects (font (size 1.27 1.27)) hide)
      )
      (property "ki_keywords" "power-flag" (id 4) (at 0 0 0)
        (effects (font (size 1.27 1.27)) hide)
      )
      (property "ki_description" "Power symbol creates a global label with name \"+3.3V\"" (id 5) (at 0 0 0)
        (effects (font (size 1.27 1.27)) hide)
      )
      (symbol "+3.3V_0_1"
        (polyline
          (pts
            (xy -0.762 1.27)
            (xy 0 2.54)
          )
          (stroke (width 0) (type default) (color 0 0 0 0))
          (fill (type none))
        )
        (polyline
          (pts
            (xy 0 0)
            (xy 0 2.54)
          )
          (stroke (width 0) (type default) (color 0 0 0 0))
          (fill (type none))
        )
        (polyline
          (pts
            (xy 0 2.54)
            (xy 0.762 1.27)
          )
          (stroke (width 0) (type default) (color 0 0 0 0))
          (fill (type none))
        )
      )
      (symbol "+3.3V_1_1"
        (pin power_in line (at 0 0 90) (length 0) hide
          (name "+3V3" (effects (font (size 1.27 1.27))))
          (number "1" (effects (font (size 1.27 1.27))))
        )
      )
    )
    (symbol "power:GNDREF" (power) (pin_names (offset 0)) (in_bom yes) (on_board yes)
      (property "Reference" "#PWR" (id 0) (at 0 -6.35 0)
        (effects (font (size 1.27 1.27)) hide)
      )
      (property "Value" "GNDREF" (id 1) (at 0 -3.81 0)
        (effects (font (size 1.27 1.27)))
      )
      (property "Footprint" "" (id 2) (at 0 0 0)
        (effects (font (size 1.27 1.27)) hide)
      )
      (property "Datasheet" "" (id 3) (at 0 0 0)
        (effects (font (size 1.27 1.27)) hide)
      )
      (property "ki_keywords" "power-flag" (id 4) (at 0 0 0)
        (effects (font (size 1.27 1.27)) hide)
      )
      (property "ki_description" "Power symbol creates a global label with name \"GNDREF\" , reference supply ground" (id 5) (at 0 0 0)
        (effects (font (size 1.27 1.27)) hide)
      )
      (symbol "GNDREF_0_1"
        (polyline
          (pts
            (xy -0.635 -1.905)
            (xy 0.635 -1.905)
          )
          (stroke (width 0) (type default) (color 0 0 0 0))
          (fill (type none))
        )
        (polyline
          (pts
            (xy -0.127 -2.54)
            (xy 0.127 -2.54)
          )
          (stroke (width 0) (type default) (color 0 0 0 0))
          (fill (type none))
        )
        (polyline
          (pts
            (xy 0 -1.27)
            (xy 0 0)
          )
          (stroke (width 0) (type default) (color 0 0 0 0))
          (fill (type none))
        )
        (polyline
          (pts
            (xy 1.27 -1.27)
            (xy -1.27 -1.27)
          )
          (stroke (width 0) (type default) (color 0 0 0 0))
          (fill (type none))
        )
      )
      (symbol "GNDREF_1_1"
        (pin power_in line (at 0 0 270) (length 0) hide
          (name "GNDREF" (effects (font (size 1.27 1.27))))
          (number "1" (effects (font (size 1.27 1.27))))
        )
      )
    )
    (symbol "power:VCC" (power) (pin_names (offset 0)) (in_bom yes) (on_board yes)
      (property "Reference" "#PWR" (id 0) (at 0 -3.81 0)
        (effects (font (size 1.27 1.27)) hide)
      )
      (property "Value" "VCC" (id 1) (at 0 3.81 0)
        (effects (font (size 1.27 1.27)))
      )
      (property "Footprint" "" (id 2) (at 0 0 0)
        (effects (font (size 1.27 1.27)) hide)
      )
      (property "Datasheet" "" (id 3) (at 0 0 0)
        (effects (font (size 1.27 1.27)) hide)
      )
      (property "ki_keywords" "power-flag" (id 4) (at 0 0 0)
        (effects (font (size 1.27 1.27)) hide)
      )
      (property "ki_description" "Power symbol creates a global label with name \"VCC\"" (id 5) (at 0 0 0)
        (effects (font (size 1.27 1.27)) hide)
      )
      (symbol "VCC_0_1"
        (polyline
          (pts
            (xy -0.762 1.27)
            (xy 0 2.54)
          )
          (stroke (width 0) (type default) (color 0 0 0 0))
          (fill (type none))
        )
        (polyline
          (pts
            (xy 0 0)
            (xy 0 2.54)
          )
          (stroke (width 0) (type default) (color 0 0 0 0))
          (fill (type none))
        )
        (polyline
          (pts
            (xy 0 2.54)
            (xy 0.762 1.27)
          )
          (stroke (width 0) (type default) (color 0 0 0 0))
          (fill (type none))
        )
      )
      (symbol "VCC_1_1"
        (pin power_in line (at 0 0 90) (length 0) hide
          (name "VCC" (effects (font (size 1.27 1.27))))
          (number "1" (effects (font (size 1.27 1.27))))
        )
      )
    )
  )

  (junction (at 82.55 97.79) (diameter 0) (color 0 0 0 0)
    (uuid 1e088b9e-6414-4b72-a17c-410a55f2379b)
  )
  (junction (at 82.55 107.95) (diameter 0) (color 0 0 0 0)
    (uuid 6d729e25-437e-4a56-addd-31cf8e76c135)
  )
  (junction (at 90.17 97.79) (diameter 0) (color 0 0 0 0)
    (uuid c93a455e-23c6-4b5e-8bd2-591f3ef20de2)
  )
  (junction (at 90.17 107.95) (diameter 0) (color 0 0 0 0)
    (uuid d60e94de-6a6e-4464-ba59-4c9a15981d31)
  )
  (junction (at 140.21 80.01) (diameter 0) (color 0 0 0 0)
    (uuid d9d51edd-1153-42e2-964d-e921c035d9b5)
  )
  (junction (at 71.12 97.79) (diameter 0) (color 0 0 0 0)
    (uuid e412cf78-7ede-4779-8c2e-3adc5fef6f59)
  )

  (wire (pts (xy 82.55 97.79) (xy 82.55 99.06))
    (stroke (width 0) (type default) (color 0 0 0 0))
    (uuid 04ca0694-636e-44d0-a4db-e018108c9a68)
  )
  (wire (pts (xy 140.21 71.12) (xy 140.21 67.31))
    (stroke (width 0) (type default) (color 0 0 0 0))
    (uuid 0ebd6fee-9a91-4066-ab93-f7d5140ec291)
  )
  (wire (pts (xy 87.63 72.39) (xy 85.09 72.39))
    (stroke (width 0) (type default) (color 0 0 0 0))
    (uuid 0fd9e7fd-239f-483c-a826-c2d13d20d042)
  )
  (wire (pts (xy 90.17 97.79) (xy 102.87 97.79))
    (stroke (width 0) (type default) (color 0 0 0 0))
    (uuid 1adbc742-7055-4b72-8ee4-9c376d21aeea)
  )
  (wire (pts (xy 138.94 74.93) (xy 140.21 74.93))
    (stroke (width 0) (type default) (color 0 0 0 0))
    (uuid 2d331825-439e-4208-9bad-e50d06ba3993)
  )
  (wire (pts (xy 78.74 97.79) (xy 82.55 97.79))
    (stroke (width 0) (type default) (color 0 0 0 0))
    (uuid 32bf2b48-0a2f-4f1b-a587-d38d0d6b27ed)
  )
  (wire (pts (xy 82.55 107.95) (xy 82.55 106.68))
    (stroke (width 0) (type default) (color 0 0 0 0))
    (uuid 39dfb6d5-208d-49af-80d8-e05c19296993)
  )
  (wire (pts (xy 90.17 62.23) (xy 93.98 62.23))
    (stroke (width 0) (type default) (color 0 0 0 0))
    (uuid 3e0452fb-b7f0-403d-9296-137c36668bdc)
  )
  (wire (pts (xy 145.29 72.39) (xy 145.29 67.31))
    (stroke (width 0) (type default) (color 0 0 0 0))
    (uuid 421c8b55-b003-46e1-af09-7627528a9581)
  )
  (wire (pts (xy 90.17 110.49) (xy 90.17 107.95))
    (stroke (width 0) (type default) (color 0 0 0 0))
    (uuid 4fae0412-5b01-4b59-b9df-f35c89d1d9b6)
  )
  (wire (pts (xy 68.58 97.79) (xy 71.12 97.79))
    (stroke (width 0) (type default) (color 0 0 0 0))
    (uuid 56abf8ba-720c-4e3b-bac5-5d11cfb0e392)
  )
  (wire (pts (xy 85.09 72.39) (xy 85.09 66.04))
    (stroke (width 0) (type default) (color 0 0 0 0))
    (uuid 656acfd1-316e-47c5-8e77-80f5b98fe3f3)
  )
  (wire (pts (xy 90.17 96.52) (xy 90.17 97.79))
    (stroke (width 0) (type default) (color 0 0 0 0))
    (uuid 6c1f4eb2-fbd4-429e-a2c5-54d40379c017)
  )
  (wire (pts (xy 82.55 107.95) (xy 90.17 107.95))
    (stroke (width 0) (type default) (color 0 0 0 0))
    (uuid 6ea90c81-fc62-4e6d-a423-23cf39ebdab6)
  )
  (wire (pts (xy 82.55 96.52) (xy 82.55 97.79))
    (stroke (width 0) (type default) (color 0 0 0 0))
    (uuid 72897ab6-1893-4b5c-9650-e41be0b0fafd)
  )
  (wire (pts (xy 140.21 80.01) (xy 140.21 85.09))
    (stroke (width 0) (type default) (color 0 0 0 0))
    (uuid 7a1fd153-90db-4b3b-b01e-d05d28a991cc)
  )
  (wire (pts (xy 101.6 95.25) (xy 102.87 95.25))
    (stroke (width 0) (type default) (color 0 0 0 0))
    (uuid 7c3bd596-7f4c-4d42-a77d-f208e142a4ff)
  )
  (wire (pts (xy 90.17 107.95) (xy 102.87 107.95))
    (stroke (width 0) (type default) (color 0 0 0 0))
    (uuid 8b6bc15f-bbac-4527-9213-b7a390be522a)
  )
  (wire (pts (xy 78.74 107.95) (xy 82.55 107.95))
    (stroke (width 0) (type default) (color 0 0 0 0))
    (uuid 8d44554a-888c-4d2c-8bfe-f4f40b431076)
  )
  (wire (pts (xy 82.55 97.79) (xy 90.17 97.79))
    (stroke (width 0) (type default) (color 0 0 0 0))
    (uuid 91cf122a-4c56-4882-8c7f-ee6032af3e01)
  )
  (wire (pts (xy 140.21 85.09) (xy 150.37 85.09))
    (stroke (width 0) (type default) (color 0 0 0 0))
    (uuid 95e88c62-bb19-43e4-b02b-f76307f8bd21)
  )
  (wire (pts (xy 71.12 107.95) (xy 71.12 97.79))
    (stroke (width 0) (type default) (color 0 0 0 0))
    (uuid 987c4ca1-1a37-4203-9599-6ce93f7361f4)
  )
  (wire (pts (xy 82.55 87.63) (xy 82.55 88.9))
    (stroke (width 0) (type default) (color 0 0 0 0))
    (uuid 9e852756-587c-427f-b147-6ddbcbe321fa)
  )
  (wire (pts (xy 102.87 100.33) (xy 102.87 107.95))
    (stroke (width 0) (type default) (color 0 0 0 0))
    (uuid aaacb3e6-ce3e-44bf-abb4-b1a8ae185eb7)
  )
  (wire (pts (xy 141.48 93.98) (xy 144.78 93.98))
    (stroke (width 0) (type default) (color 0 0 0 0))
    (uuid adcf158d-cdaf-46d6-9987-aca9a764fcd5)
  )
  (wire (pts (xy 138.94 71.12) (xy 140.21 71.12))
    (stroke (width 0) (type default) (color 0 0 0 0))
    (uuid af67826c-b974-47f9-8ca6-bd7aba33301a)
  )
  (wire (pts (xy 80.01 62.23) (xy 76.2 62.23))
    (stroke (width 0) (type default) (color 0 0 0 0))
    (uuid ba0e25ca-631b-4830-a5e5-0f539198b0f6)
  )
  (wire (pts (xy 101.6 92.71) (xy 102.87 92.71))
    (stroke (width 0) (type default) (color 0 0 0 0))
    (uuid ba141d84-636e-43aa-820b-c11d5e843ab4)
  )
  (wire (pts (xy 150.37 99.06) (xy 150.37 100.33))
    (stroke (width 0) (type default) (color 0 0 0 0))
    (uuid c81c4a76-4538-433c-b517-00f2954ef3e2)
  )
  (wire (pts (xy 140.21 74.93) (xy 140.21 80.01))
    (stroke (width 0) (type default) (color 0 0 0 0))
    (uuid de29ed1e-c6ae-422c-b0d1-197652b8306c)
  )
  (wire (pts (xy 140.21 80.01) (xy 145.29 80.01))
    (stroke (width 0) (type default) (color 0 0 0 0))
    (uuid e4196071-3afc-4ec2-a977-6d16e1fba79a)
  )
  (wire (pts (xy 150.37 85.09) (xy 150.37 88.9))
    (stroke (width 0) (type default) (color 0 0 0 0))
    (uuid e6c708d5-bce1-4373-bcd2-18eb14c502a0)
  )
  (wire (pts (xy 76.2 62.23) (xy 76.2 60.96))
    (stroke (width 0) (type default) (color 0 0 0 0))
    (uuid f0a42506-356e-46a0-935b-4fcedc51e42d)
  )
  (wire (pts (xy 145.29 67.31) (xy 140.21 67.31))
    (stroke (width 0) (type default) (color 0 0 0 0))
    (uuid fd32bc65-94ce-4c17-85b8-412d22504300)
  )

  (label "drain" (at 145.29 85.09 0)
    (effects (font (size 1.27 1.27)) (justify left bottom))
    (uuid c0e91e8f-9aad-42b6-86eb-b80b8110d5a8)
  )

  (hierarchical_label "power" (shape input) (at 87.63 72.39 0)
    (effects (font (size 1.27 1.27)) (justify left))
    (uuid 45265c7c-927c-44b4-9131-1e2780f7f746)
  )
  (hierarchical_label "mosfetGate" (shape input) (at 90.17 96.52 90)
    (effects (font (size 1.27 1.27)) (justify left))
    (uuid 7676787f-f247-4ce3-b572-58b8fc876185)
  )
  (hierarchical_label "power" (shape input) (at 138.94 71.12 180)
    (effects (font (size 1.27 1.27)) (justify right))
    (uuid 8154fffb-0925-4bab-8610-be0e9893377f)
  )
  (hierarchical_label "drain" (shape input) (at 138.94 74.93 180)
    (effects (font (size 1.27 1.27)) (justify right))
    (uuid 8b180470-af98-4c29-aab3-9f8350f10ea3)
  )
  (hierarchical_label "drain" (shape input) (at 101.6 95.25 180)
    (effects (font (size 1.27 1.27)) (justify right))
    (uuid aade12c8-e80b-47a8-b1b0-4d917219a3ac)
  )
  (hierarchical_label "power" (shape input) (at 101.6 92.71 180)
    (effects (font (size 1.27 1.27)) (justify right))
    (uuid b0ca9d37-88f2-405d-8638-ce513318e493)
  )
  (hierarchical_label "GPIO" (shape input) (at 68.58 97.79 180)
    (effects (font (size 1.27 1.27)) (justify right))
    (uuid e63ce35e-b650-4f94-a037-90a314d23926)
  )
  (hierarchical_label "mosfetGate" (shape input) (at 141.48 93.98 180)
    (effects (font (size 1.27 1.27)) (justify right))
    (uuid f40b0e0c-21f3-4215-909c-4e53b6815255)
  )

  (symbol (lib_id "power:VCC") (at 93.98 62.23 0)
    (in_bom yes) (on_board yes)
    (uuid 2d958099-6dfa-46ea-b41e-6037acd45247)
    (property "Reference" "#PWR0127" (id 0) (at 93.98 66.04 0)
      (effects (font (size 1.27 1.27)) hide)
    )
    (property "Value" "VCC" (id 1) (at 93.98 58.42 90)
      (effects (font (size 1.27 1.27)) (justify left))
    )
    (property "Footprint" "" (id 2) (at 93.98 62.23 0)
      (effects (font (size 1.27 1.27)) hide)
    )
    (property "Datasheet" "" (id 3) (at 93.98 62.23 0)
      (effects (font (size 1.27 1.27)) hide)
    )
    (pin "1" (uuid cddeb9c2-6e16-41e4-92be-8488b649cd0c))
  )

  (symbol (lib_id "Diode:MBRA340") (at 145.29 76.2 90) (mirror x)
    (in_bom yes) (on_board yes)
    (uuid 34d5a0ba-a240-4a71-b7d9-060f34d372cc)
    (property "Reference" "D4" (id 0) (at 150.37 76.2 0))
    (property "Value" "MBRA340" (id 1) (at 147.83 76.2 0))
    (property "Footprint" "Diode_SMD:D_SMA" (id 2) (at 149.735 76.2 0)
      (effects (font (size 1.27 1.27)) hide)
    )
    (property "Datasheet" "https://www.onsemi.com/pub/Collateral/MBRA340T3-D.PDF" (id 3) (at 145.29 76.2 0)
      (effects (font (size 1.27 1.27)) hide)
    )
    (pin "1" (uuid 86e9b42a-a8d6-414f-8b16-d94f8095a63d))
    (pin "2" (uuid 3a63d2a7-5267-4fad-b100-5654ecdc4142))
  )

  (symbol (lib_id "Device:R") (at 74.93 97.79 270)
    (in_bom yes) (on_board yes)
    (uuid 4c527fe5-954c-4c48-8208-9e96c652677c)
    (property "Reference" "R14" (id 0) (at 74.93 100.33 90)
      (effects (font (size 1.27 1.27)) (justify right))
    )
    (property "Value" "12k" (id 1) (at 74.93 102.87 90)
      (effects (font (size 1.27 1.27)) (justify right))
    )
    (property "Footprint" "Resistor_SMD:R_0603_1608Metric_Pad0.98x0.95mm_HandSolder" (id 2) (at 74.93 96.012 90)
      (effects (font (size 1.27 1.27)) hide)
    )
    (property "Datasheet" "~" (id 3) (at 74.93 97.79 0)
      (effects (font (size 1.27 1.27)) hide)
    )
    (pin "1" (uuid f0fe3988-460f-4adb-a395-bd20dc40d301))
    (pin "2" (uuid 7b484678-4d77-48ca-afb1-6ee93a919f6d))
  )

  (symbol (lib_id "power:GNDREF") (at 90.17 110.49 0)
    (in_bom yes) (on_board yes)
    (uuid 5165cb9b-e562-443a-9a69-4dff8b93550f)
    (property "Reference" "#PWR0125" (id 0) (at 90.17 116.84 0)
      (effects (font (size 1.27 1.27)) hide)
    )
    (property "Value" "GND" (id 1) (at 90.297 114.8842 0))
    (property "Footprint" "" (id 2) (at 90.17 110.49 0)
      (effects (font (size 1.27 1.27)) hide)
    )
    (property "Datasheet" "" (id 3) (at 90.17 110.49 0)
      (effects (font (size 1.27 1.27)) hide)
    )
    (pin "1" (uuid 67b692c9-63a1-4763-98f8-ab97ffd30065))
  )

  (symbol (lib_id "power:+3.3V") (at 82.55 87.63 0) (mirror y)
    (in_bom yes) (on_board yes)
    (uuid 6c2bc393-0c25-4846-9c60-eb8613d33365)
    (property "Reference" "#PWR0128" (id 0) (at 82.55 91.44 0)
      (effects (font (size 1.27 1.27)) hide)
    )
    (property "Value" "+3.3V" (id 1) (at 82.55 85.09 90)
      (effects (font (size 1.27 1.27)) (justify left))
    )
    (property "Footprint" "" (id 2) (at 82.55 87.63 0)
      (effects (font (size 1.27 1.27)) hide)
    )
    (property "Datasheet" "" (id 3) (at 82.55 87.63 0)
      (effects (font (size 1.27 1.27)) hide)
    )
    (pin "1" (uuid fee35e6a-1903-4e6c-b207-6d943ee96f6f))
  )

  (symbol (lib_id "Device:R") (at 82.55 102.87 180)
    (in_bom yes) (on_board yes)
    (uuid 7de17dad-74dc-4fe3-8a10-ffc8d71ed473)
    (property "Reference" "R18" (id 0) (at 77.47 101.6 0)
      (effects (font (size 1.27 1.27)) (justify right))
    )
    (property "Value" "12k" (id 1) (at 77.47 104.14 0)
      (effects (font (size 1.27 1.27)) (justify right))
    )
    (property "Footprint" "Resistor_SMD:R_0603_1608Metric_Pad0.98x0.95mm_HandSolder" (id 2) (at 84.328 102.87 90)
      (effects (font (size 1.27 1.27)) hide)
    )
    (property "Datasheet" "~" (id 3) (at 82.55 102.87 0)
      (effects (font (size 1.27 1.27)) hide)
    )
    (pin "1" (uuid f9a11413-eba8-4d9c-8bb3-fae582031fa7))
    (pin "2" (uuid cb8f8f82-ed6b-44d1-bda2-fc9053123434))
  )

  (symbol (lib_id "Device:R") (at 82.55 92.71 180)
    (in_bom yes) (on_board yes)
    (uuid af76aa23-650b-4e50-a713-435dd1081579)
    (property "Reference" "R15" (id 0) (at 77.47 91.44 0)
      (effects (font (size 1.27 1.27)) (justify right))
    )
    (property "Value" "12k" (id 1) (at 77.47 93.98 0)
      (effects (font (size 1.27 1.27)) (justify right))
    )
    (property "Footprint" "Resistor_SMD:R_0603_1608Metric_Pad0.98x0.95mm_HandSolder" (id 2) (at 84.328 92.71 90)
      (effects (font (size 1.27 1.27)) hide)
    )
    (property "Datasheet" "~" (id 3) (at 82.55 92.71 0)
      (effects (font (size 1.27 1.27)) hide)
    )
    (pin "1" (uuid 181f90eb-53ed-485c-8452-470b78fbae6f))
    (pin "2" (uuid 7946c5b1-c87c-448a-be8d-f9679f4d4299))
  )

  (symbol (lib_id "Connector_Generic:Conn_01x04") (at 107.95 97.79 0) (mirror x)
    (in_bom yes) (on_board yes)
    (uuid c98b6b93-a8bf-4e8e-9209-5193020a22ea)
    (property "Reference" "J10" (id 0) (at 107.95 86.36 0))
    (property "Value" "Conn_01x04" (id 1) (at 107.95 88.9 0))
    (property "Footprint" "Connector_JST:JST_XH_B4B-XH-A_1x04_P2.50mm_Vertical" (id 2) (at 107.95 97.79 0)
      (effects (font (size 1.27 1.27)) hide)
    )
    (property "Datasheet" "~" (id 3) (at 107.95 97.79 0)
      (effects (font (size 1.27 1.27)) hide)
    )
    (pin "1" (uuid 26848adc-c31e-4da3-8549-24a230c6c2eb))
    (pin "2" (uuid d8d04551-5dca-4c10-a227-c69f8709819d))
    (pin "3" (uuid 5964804a-9ffe-4905-9f1b-c960fc5465a3))
    (pin "4" (uuid bb9a8357-379f-40e9-8dc4-ae3af7f675f4))
  )

  (symbol (lib_id "power:GNDREF") (at 150.37 100.33 0)
    (in_bom yes) (on_board yes)
    (uuid e2d38fa5-a981-44b7-b2dc-a2296d41d1ed)
    (property "Reference" "#PWR0129" (id 0) (at 150.37 106.68 0)
      (effects (font (size 1.27 1.27)) hide)
    )
    (property "Value" "GND" (id 1) (at 150.497 104.7242 0))
    (property "Footprint" "" (id 2) (at 150.37 100.33 0)
      (effects (font (size 1.27 1.27)) hide)
    )
    (property "Datasheet" "" (id 3) (at 150.37 100.33 0)
      (effects (font (size 1.27 1.27)) hide)
    )
    (pin "1" (uuid e2a96a11-26fd-435b-aa4d-b9f802b462d7))
  )

  (symbol (lib_id "easyeda sym:AP2302B") (at 150.37 93.98 0)
    (in_bom yes) (on_board yes) (fields_autoplaced)
    (uuid e9201fda-1242-456a-93ed-c621c53b6105)
    (property "Reference" "Q5" (id 0) (at 155.45 92.7099 0)
      (effects (font (size 1.27 1.27)) (justify left))
    )
    (property "Value" "AP2302B" (id 1) (at 155.45 95.2499 0)
      (effects (font (size 1.27 1.27)) (justify left))
    )
    (property "Footprint" "easyeda2kicad:SOT-23_L2.9-W1.3-P1.90-LS2.4-BR" (id 2) (at 150.37 106.68 0)
      (effects (font (size 1.27 1.27)) hide)
    )
    (property "Datasheet" "https://lcsc.com/product-detail/MOSFET_ShenZhen-Quan-Li-Semiconductor-AP2302B_C406812.html" (id 3) (at 150.37 109.22 0)
      (effects (font (size 1.27 1.27)) hide)
    )
    (property "Manufacturer" "ShenZhen Quan Li Semiconductor" (id 4) (at 150.37 111.76 0)
      (effects (font (size 1.27 1.27)) hide)
    )
    (property "LCSC Part" "C406812" (id 5) (at 150.37 114.3 0)
      (effects (font (size 1.27 1.27)) hide)
    )
    (property "JLC Part" "Extended Part" (id 6) (at 150.37 116.84 0)
      (effects (font (size 1.27 1.27)) hide)
    )
    (pin "1" (uuid 685f9d9a-a368-4fa3-8b55-53436f251eff))
    (pin "2" (uuid 5986595d-abb6-4efc-9107-f50f81693930))
    (pin "3" (uuid 71da041a-0c2a-44d2-9fb1-e2e700b7027b))
  )

  (symbol (lib_id "Jumper:SolderJumper_3_Open") (at 85.09 62.23 0)
    (in_bom yes) (on_board yes) (fields_autoplaced)
    (uuid ed55f8c7-e2da-4444-98a4-c06ab970bf32)
    (property "Reference" "JP6" (id 0) (at 85.09 55.88 0))
    (property "Value" "power" (id 1) (at 85.09 58.42 0))
    (property "Footprint" "Jumper:SolderJumper-3_P1.3mm_Open_Pad1.0x1.5mm" (id 2) (at 85.09 62.23 0)
      (effects (font (size 1.27 1.27)) hide)
    )
    (property "Datasheet" "~" (id 3) (at 85.09 62.23 0)
      (effects (font (size 1.27 1.27)) hide)
    )
    (pin "1" (uuid 1f75a763-46e9-4c10-a783-6b7c55bcd301))
    (pin "2" (uuid 77151a43-6cc4-4811-8564-d69627bbbfe7))
    (pin "3" (uuid 3b06c384-4312-45e7-8aeb-371c19395aac))
  )

  (symbol (lib_id "Device:C") (at 74.93 107.95 90)
    (in_bom yes) (on_board yes)
    (uuid f2e5ea63-08f6-44f7-a38a-7e212a0391d2)
    (property "Reference" "C4" (id 0) (at 71.12 110.49 90)
      (effects (font (size 1.27 1.27)) (justify left))
    )
    (property "Value" "0.1µF" (id 1) (at 78.74 111.76 90)
      (effects (font (size 1.27 1.27)) (justify left))
    )
    (property "Footprint" "Capacitor_SMD:C_0603_1608Metric_Pad1.08x0.95mm_HandSolder" (id 2) (at 78.74 106.9848 0)
      (effects (font (size 1.27 1.27)) hide)
    )
    (property "Datasheet" "~" (id 3) (at 74.93 107.95 0)
      (effects (font (size 1.27 1.27)) hide)
    )
    (pin "1" (uuid f025a461-3387-4c46-86ae-e1280132f079))
    (pin "2" (uuid 9f0266f4-2666-436e-bcad-e53c03ff9fbe))
  )

  (symbol (lib_id "power:+3.3V") (at 76.2 60.96 0) (mirror y)
    (in_bom yes) (on_board yes)
    (uuid fb671ecc-adfe-458a-9a36-f8090a21202c)
    (property "Reference" "#PWR0126" (id 0) (at 76.2 64.77 0)
      (effects (font (size 1.27 1.27)) hide)
    )
    (property "Value" "+3.3V" (id 1) (at 76.2 58.42 90)
      (effects (font (size 1.27 1.27)) (justify left))
    )
    (property "Footprint" "" (id 2) (at 76.2 60.96 0)
      (effects (font (size 1.27 1.27)) hide)
    )
    (property "Datasheet" "" (id 3) (at 76.2 60.96 0)
      (effects (font (size 1.27 1.27)) hide)
    )
    (pin "1" (uuid fa7fe579-9b0d-4f49-a1ac-99f451b32675))
  )
)
