%TF.GenerationSoftware,KiCad,Pcbnew,6.0.0-d3dd2cf0fa~116~ubuntu20.04.1*%
%TF.CreationDate,2022-09-08T23:32:22+02:00*%
%TF.ProjectId,rfidLghsAccess,72666964-4c67-4687-9341-63636573732e,rev?*%
%TF.SameCoordinates,Original*%
%TF.FileFunction,Profile,NP*%
%FSLAX46Y46*%
G04 Gerber Fmt 4.6, Leading zero omitted, Abs format (unit mm)*
G04 Created by KiCad (PCBNEW 6.0.0-d3dd2cf0fa~116~ubuntu20.04.1) date 2022-09-08 23:32:22*
%MOMM*%
%LPD*%
G01*
G04 APERTURE LIST*
%TA.AperFunction,Profile*%
%ADD10C,0.100000*%
%TD*%
G04 APERTURE END LIST*
D10*
X90000000Y-100000000D02*
X20000000Y-100000000D01*
X20000000Y-100000000D02*
X20000000Y-20000000D01*
X20000000Y-20000000D02*
X90000000Y-20000000D01*
X90000000Y-20000000D02*
X90000000Y-100000000D01*
M02*
