%TF.GenerationSoftware,KiCad,Pcbnew,6.0.0-d3dd2cf0fa~116~ubuntu20.04.1*%
%TF.CreationDate,2022-09-08T23:32:21+02:00*%
%TF.ProjectId,rfidLghsAccess,72666964-4c67-4687-9341-63636573732e,rev?*%
%TF.SameCoordinates,Original*%
%TF.FileFunction,Paste,Top*%
%TF.FilePolarity,Positive*%
%FSLAX46Y46*%
G04 Gerber Fmt 4.6, Leading zero omitted, Abs format (unit mm)*
G04 Created by KiCad (PCBNEW 6.0.0-d3dd2cf0fa~116~ubuntu20.04.1) date 2022-09-08 23:32:21*
%MOMM*%
%LPD*%
G01*
G04 APERTURE LIST*
G04 Aperture macros list*
%AMRoundRect*
0 Rectangle with rounded corners*
0 $1 Rounding radius*
0 $2 $3 $4 $5 $6 $7 $8 $9 X,Y pos of 4 corners*
0 Add a 4 corners polygon primitive as box body*
4,1,4,$2,$3,$4,$5,$6,$7,$8,$9,$2,$3,0*
0 Add four circle primitives for the rounded corners*
1,1,$1+$1,$2,$3*
1,1,$1+$1,$4,$5*
1,1,$1+$1,$6,$7*
1,1,$1+$1,$8,$9*
0 Add four rect primitives between the rounded corners*
20,1,$1+$1,$2,$3,$4,$5,0*
20,1,$1+$1,$4,$5,$6,$7,0*
20,1,$1+$1,$6,$7,$8,$9,0*
20,1,$1+$1,$8,$9,$2,$3,0*%
G04 Aperture macros list end*
%ADD10R,2.500000X1.800000*%
%ADD11RoundRect,0.237500X0.250000X0.237500X-0.250000X0.237500X-0.250000X-0.237500X0.250000X-0.237500X0*%
%ADD12RoundRect,0.237500X-0.250000X-0.237500X0.250000X-0.237500X0.250000X0.237500X-0.250000X0.237500X0*%
%ADD13R,1.500000X2.000000*%
%ADD14R,3.800000X2.000000*%
%ADD15R,1.000000X0.800000*%
%ADD16RoundRect,0.237500X-0.237500X0.250000X-0.237500X-0.250000X0.237500X-0.250000X0.237500X0.250000X0*%
%ADD17RoundRect,0.237500X0.237500X-0.250000X0.237500X0.250000X-0.237500X0.250000X-0.237500X-0.250000X0*%
%ADD18RoundRect,0.237500X-0.237500X0.300000X-0.237500X-0.300000X0.237500X-0.300000X0.237500X0.300000X0*%
%ADD19RoundRect,0.150000X0.587500X0.150000X-0.587500X0.150000X-0.587500X-0.150000X0.587500X-0.150000X0*%
%ADD20RoundRect,0.237500X-0.300000X-0.237500X0.300000X-0.237500X0.300000X0.237500X-0.300000X0.237500X0*%
%ADD21R,0.700000X1.250000*%
%ADD22R,1.500000X1.000000*%
%ADD23O,1.300000X4.000000*%
%ADD24O,4.000000X1.300000*%
G04 APERTURE END LIST*
D10*
%TO.C,D5*%
X74703334Y-52185000D03*
X70703334Y-52185000D03*
%TD*%
D11*
%TO.C,R42*%
X74105000Y-98860000D03*
X72280000Y-98860000D03*
%TD*%
D12*
%TO.C,R17*%
X67815278Y-87760000D03*
X69640278Y-87760000D03*
%TD*%
D13*
%TO.C,U3*%
X21640000Y-58820000D03*
X23940000Y-58820000D03*
D14*
X23940000Y-52520000D03*
D13*
X26240000Y-58820000D03*
%TD*%
D15*
%TO.C,Q4*%
X68190000Y-45957500D03*
X68190000Y-44057500D03*
X65890000Y-45007500D03*
%TD*%
D16*
%TO.C,R18*%
X75500000Y-62437500D03*
X75500000Y-64262500D03*
%TD*%
D17*
%TO.C,R22*%
X73940000Y-56925000D03*
X73940000Y-55100000D03*
%TD*%
D18*
%TO.C,C1*%
X72380000Y-33137500D03*
X72380000Y-34862500D03*
%TD*%
D11*
%TO.C,R2*%
X62722500Y-87760000D03*
X60897500Y-87760000D03*
%TD*%
D18*
%TO.C,C4*%
X72380000Y-62487500D03*
X72380000Y-64212500D03*
%TD*%
D16*
%TO.C,R10*%
X75500000Y-33087500D03*
X75500000Y-34912500D03*
%TD*%
D17*
%TO.C,R9*%
X70820000Y-34912500D03*
X70820000Y-33087500D03*
%TD*%
D10*
%TO.C,D4*%
X74703334Y-66860000D03*
X70703334Y-66860000D03*
%TD*%
D18*
%TO.C,C8*%
X72380000Y-47812500D03*
X72380000Y-49537500D03*
%TD*%
D19*
%TO.C,Q3*%
X29887500Y-99040000D03*
X29887500Y-97140000D03*
X28012500Y-98090000D03*
%TD*%
D16*
%TO.C,R21*%
X75500000Y-47762500D03*
X75500000Y-49587500D03*
%TD*%
%TO.C,R8*%
X41700000Y-96800000D03*
X41700000Y-98625000D03*
%TD*%
D12*
%TO.C,R3*%
X50787500Y-84315000D03*
X52612500Y-84315000D03*
%TD*%
D17*
%TO.C,R20*%
X70820000Y-49587500D03*
X70820000Y-47762500D03*
%TD*%
%TO.C,R14*%
X73940000Y-64262500D03*
X73940000Y-62437500D03*
%TD*%
D20*
%TO.C,NeoPixelC1*%
X21957500Y-84000000D03*
X23682500Y-84000000D03*
%TD*%
D10*
%TO.C,D2*%
X74703334Y-37510000D03*
X70703334Y-37510000D03*
%TD*%
D16*
%TO.C,R13*%
X75500000Y-40425000D03*
X75500000Y-42250000D03*
%TD*%
D21*
%TO.C,Q1*%
X26810000Y-70620000D03*
X25860000Y-73120000D03*
X24910000Y-70620000D03*
%TD*%
D17*
%TO.C,R4*%
X73940000Y-34912500D03*
X73940000Y-33087500D03*
%TD*%
D18*
%TO.C,C9*%
X72380000Y-55150000D03*
X72380000Y-56875000D03*
%TD*%
D11*
%TO.C,R5*%
X26562500Y-91880000D03*
X24737500Y-91880000D03*
%TD*%
D22*
%TO.C,D1*%
X21810000Y-86060000D03*
X21810000Y-89260000D03*
X26710000Y-89260000D03*
X26710000Y-86060000D03*
%TD*%
D17*
%TO.C,R11*%
X73940000Y-42250000D03*
X73940000Y-40425000D03*
%TD*%
D18*
%TO.C,C3*%
X72380000Y-40475000D03*
X72380000Y-42200000D03*
%TD*%
D11*
%TO.C,R6*%
X22912500Y-91880000D03*
X21087500Y-91880000D03*
%TD*%
D10*
%TO.C,D3*%
X74703334Y-44847500D03*
X70703334Y-44847500D03*
%TD*%
D20*
%TO.C,C6*%
X28807500Y-70340000D03*
X30532500Y-70340000D03*
%TD*%
D11*
%TO.C,R16*%
X66181388Y-87760000D03*
X64356388Y-87760000D03*
%TD*%
D23*
%TO.C,DC1*%
X24700000Y-78230000D03*
X30700000Y-78230000D03*
D24*
X28200000Y-83030000D03*
%TD*%
D10*
%TO.C,D6*%
X74703334Y-59522500D03*
X70703334Y-59522500D03*
%TD*%
D17*
%TO.C,R19*%
X73940000Y-49587500D03*
X73940000Y-47762500D03*
%TD*%
D11*
%TO.C,R1*%
X59263612Y-87760000D03*
X57438612Y-87760000D03*
%TD*%
D15*
%TO.C,Q5*%
X68190000Y-67970000D03*
X68190000Y-66070000D03*
X65890000Y-67020000D03*
%TD*%
%TO.C,Q2*%
X68190000Y-38620000D03*
X68190000Y-36720000D03*
X65890000Y-37670000D03*
%TD*%
D17*
%TO.C,R7*%
X41700000Y-95122500D03*
X41700000Y-93297500D03*
%TD*%
%TO.C,R12*%
X70820000Y-42250000D03*
X70820000Y-40425000D03*
%TD*%
%TO.C,R15*%
X70820000Y-64262500D03*
X70820000Y-62437500D03*
%TD*%
%TO.C,R23*%
X70820000Y-56925000D03*
X70820000Y-55100000D03*
%TD*%
D15*
%TO.C,Q7*%
X68190000Y-60632500D03*
X68190000Y-58732500D03*
X65890000Y-59682500D03*
%TD*%
D20*
%TO.C,C5*%
X28807500Y-72240000D03*
X30532500Y-72240000D03*
%TD*%
D16*
%TO.C,R24*%
X75500000Y-55100000D03*
X75500000Y-56925000D03*
%TD*%
D15*
%TO.C,Q6*%
X68190000Y-53295000D03*
X68190000Y-51395000D03*
X65890000Y-52345000D03*
%TD*%
M02*
