M48
; DRILL file {KiCad 6.0.0-d3dd2cf0fa~116~ubuntu20.04.1} date Thu Sep  8 23:32:24 2022
; FORMAT={-:-/ absolute / inch / decimal}
; #@! TF.CreationDate,2022-09-08T23:32:24+02:00
; #@! TF.GenerationSoftware,Kicad,Pcbnew,6.0.0-d3dd2cf0fa~116~ubuntu20.04.1
; #@! TF.FileFunction,Plated,1,2,PTH
FMAT,2
INCH
; #@! TA.AperFunction,Plated,PTH,ViaDrill
T1C0.0157
; #@! TA.AperFunction,Plated,PTH,ComponentDrill
T2C0.0315
; #@! TA.AperFunction,Plated,PTH,ComponentDrill
T3C0.0315
; #@! TA.AperFunction,Plated,PTH,ComponentDrill
T4C0.0374
; #@! TA.AperFunction,Plated,PTH,ComponentDrill
T5C0.0394
; #@! TA.AperFunction,Plated,PTH,ComponentDrill
T6C0.0409
%
G90
G05
T1
X0.8441Y-2.9862
X0.8531Y-1.0665
X0.9469Y-3.3862
X0.974Y-3.5165
X0.985Y-2.7268
X1.0193Y-3.7858
X1.0252Y-2.9516
X1.0276Y-3.6862
X1.0512Y-3.4709
X1.0694Y-3.6841
X1.0744Y-2.8118
X1.0799Y-3.5535
X1.1047Y-3.3909
X1.2445Y-2.7681
X1.3591Y-3.2713
X1.415Y-3.5441
X1.4283Y-2.8039
X1.4642Y-1.6728
X1.6501Y-2.4655
X1.7469Y-2.3205
X1.7693Y-1.5201
X1.7846Y-0.8335
X1.8098Y-1.1181
X1.9423Y-2.5479
X2.0071Y-1.9626
X2.1043Y-1.5909
X2.1244Y-2.6969
X2.1705Y-1.8331
X2.1709Y-2.9098
X2.1807Y-1.9752
X2.2374Y-1.1043
X2.2669Y-2.2988
X2.374Y-3.1512
X2.3752Y-2.8642
X2.4024Y-2.1185
X2.4839Y-3.5209
X2.5343Y-3.4012
X2.5902Y-1.1071
X2.6067Y-2.5815
X2.6346Y-2.1147
X2.6409Y-2.3114
X2.6425Y-1.739
X2.6425Y-2.0252
X2.6445Y-1.4516
X2.6551Y-3.3846
X2.6583Y-2.9094
X2.6972Y-2.5445
X2.7028Y-2.5949
X2.7072Y-1.6954
X2.7213Y-2.2661
X2.7255Y-1.4195
X2.7268Y-1.9937
X2.7531Y-1.5748
X2.8311Y-2.2602
X2.8465Y-1.3732
X2.8575Y-1.976
X2.8626Y-2.5587
X2.8697Y-1.6925
X2.8992Y-1.8362
X2.9121Y-2.1434
X2.913Y-1.5409
X2.9984Y-1.2193
X3.0366Y-2.4634
X3.0465Y-1.9602
X3.0488Y-1.8831
X3.0504Y-1.3866
X3.0524Y-1.5961
X3.0535Y-1.6752
X3.0748Y-3.4878
X3.0752Y-2.1346
X3.4114Y-3.6122
X3.4169Y-2.7843
X3.4528Y-1.7902
T3
X1.3874Y-3.6802
X1.3874Y-3.818
X2.4713Y-2.813
X2.4713Y-3.313
X2.5713Y-2.813
X2.5713Y-3.313
X2.6713Y-2.813
X2.6713Y-3.313
X2.7713Y-2.813
X2.7713Y-3.313
X2.8713Y-2.813
X2.8713Y-3.313
X2.9713Y-2.813
X2.9713Y-3.313
X3.0713Y-2.813
X3.0713Y-3.313
X3.1713Y-2.813
X3.1713Y-3.313
X3.1783Y-2.9907
X3.1783Y-3.1285
T4
X0.9539Y-1.2051
X0.9539Y-1.3035
X0.9539Y-1.402
X0.9539Y-1.5004
X0.9539Y-1.5988
X0.9539Y-1.6972
X0.9539Y-1.7957
X0.9539Y-1.8941
X1.3508Y-3.4035
X1.4339Y-3.1104
X1.4492Y-3.4035
X1.5323Y-3.1104
X1.5476Y-3.4035
X1.6307Y-3.1104
X1.7291Y-3.1104
X1.8276Y-3.1104
X1.8293Y-3.5024
X1.8293Y-3.6008
X1.8293Y-3.6992
X1.8293Y-3.7976
X1.926Y-3.1104
X2.0244Y-3.1104
X2.1041Y-3.5024
X2.1041Y-3.6008
X2.1041Y-3.6992
X2.1041Y-3.7976
X2.1228Y-3.1104
X2.2213Y-3.1104
X2.3429Y-3.6081
X2.3429Y-3.7065
X2.3429Y-3.8049
X2.6141Y-3.6081
X2.6141Y-3.7065
X2.6141Y-3.8049
X3.1336Y-1.3902
X3.1336Y-1.679
X3.1336Y-1.9679
X3.1336Y-2.2568
X3.1336Y-2.5457
X3.2321Y-1.3902
X3.2321Y-1.679
X3.2321Y-1.9679
X3.2321Y-2.2568
X3.2321Y-2.5457
X3.3305Y-1.3902
X3.3305Y-1.679
X3.3305Y-1.9679
X3.3305Y-2.2568
X3.3305Y-2.5457
X3.4004Y-2.9626
X3.4004Y-3.061
X3.4004Y-3.1594
X3.4004Y-3.2579
X3.4289Y-1.3902
X3.4289Y-1.679
X3.4289Y-1.9679
X3.4289Y-2.2568
X3.4289Y-2.5457
T5
X0.953Y-2.4882
X0.953Y-2.5866
X1.1652Y-0.8657
X1.1652Y-0.9657
X1.1652Y-1.0657
X1.1652Y-1.1657
X1.1652Y-1.2657
X1.1652Y-1.3657
X1.1652Y-1.4657
X1.1652Y-1.5657
X1.1652Y-1.6657
X1.1652Y-1.7657
X1.1652Y-1.8657
X1.1652Y-1.9657
X1.1652Y-2.0657
X1.1652Y-2.1657
X1.1652Y-2.2657
X1.1652Y-2.3657
X1.1652Y-2.4657
X1.1652Y-2.5657
X1.1652Y-2.6657
X2.4779Y-0.8657
X2.4779Y-0.9657
X2.4779Y-1.0657
X2.4779Y-1.1657
X2.4779Y-1.2657
X2.4779Y-1.3657
X2.4779Y-1.4657
X2.4779Y-1.5657
X2.4779Y-1.6657
X2.4779Y-1.7657
X2.4779Y-1.8657
X2.4779Y-1.9657
X2.4779Y-2.0657
X2.4779Y-2.1657
X2.4779Y-2.2657
X2.4779Y-2.3657
X2.4779Y-2.4657
X2.4779Y-2.5657
X2.4779Y-2.6657
X2.9047Y-3.6358
X3.2039Y-3.6358
T6
X1.3148Y-0.863
X1.3148Y-0.963
X1.3148Y-1.063
X1.3148Y-1.163
X1.3148Y-1.263
X1.3148Y-1.363
X1.3148Y-1.463
X1.3148Y-1.563
X1.3148Y-1.663
X1.3148Y-1.763
X1.3148Y-1.863
X1.3148Y-1.963
X1.3148Y-2.063
X1.3148Y-2.163
X1.3148Y-2.263
X1.3148Y-2.363
X1.3148Y-2.463
X1.3148Y-2.563
X1.3148Y-2.663
X2.3148Y-0.863
X2.3148Y-0.963
X2.3148Y-1.063
X2.3148Y-1.163
X2.3148Y-1.263
X2.3148Y-1.363
X2.3148Y-1.463
X2.3148Y-1.563
X2.3148Y-1.663
X2.3148Y-1.763
X2.3148Y-1.863
X2.3148Y-1.963
X2.3148Y-2.063
X2.3148Y-2.163
X2.3148Y-2.263
X2.3148Y-2.363
X2.3148Y-2.463
X2.3148Y-2.563
X2.3148Y-2.663
T2
G00X0.9724Y-3.0268
M15
G01X0.9724Y-3.1331
M16
G05
G00X1.0571Y-3.2689
M15
G01X1.1634Y-3.2689
M16
G05
G00X1.2087Y-3.1331
M15
G01X1.2087Y-3.0268
M16
G05
T0
M30
