%TF.GenerationSoftware,KiCad,Pcbnew,6.0.0-d3dd2cf0fa~116~ubuntu20.04.1*%
%TF.CreationDate,2022-09-08T23:37:02+02:00*%
%TF.ProjectId,mix,6d69782e-6b69-4636-9164-5f7063625858,rev?*%
%TF.SameCoordinates,Original*%
%TF.FileFunction,Legend,Bot*%
%TF.FilePolarity,Positive*%
%FSLAX46Y46*%
G04 Gerber Fmt 4.6, Leading zero omitted, Abs format (unit mm)*
G04 Created by KiCad (PCBNEW 6.0.0-d3dd2cf0fa~116~ubuntu20.04.1) date 2022-09-08 23:37:02*
%MOMM*%
%LPD*%
G01*
G04 APERTURE LIST*
%ADD10C,0.150000*%
%ADD11C,0.120000*%
G04 APERTURE END LIST*
D10*
%TO.C,SW5*%
X218380952Y-101571428D02*
X217619047Y-101571428D01*
X218000000Y-101952380D02*
X218000000Y-101190476D01*
X218350952Y-98281428D02*
X217589047Y-98281428D01*
%TO.C,SW6*%
X260380952Y-101571428D02*
X259619047Y-101571428D01*
X260350952Y-98281428D02*
X259589047Y-98281428D01*
X259970000Y-98662380D02*
X259970000Y-97900476D01*
%TO.C,SW1*%
X50350952Y-98281428D02*
X49589047Y-98281428D01*
X49970000Y-98662380D02*
X49970000Y-97900476D01*
X50380952Y-101571428D02*
X49619047Y-101571428D01*
%TO.C,SW3*%
X134380952Y-101571428D02*
X133619047Y-101571428D01*
X134350952Y-98281428D02*
X133589047Y-98281428D01*
X133970000Y-98662380D02*
X133970000Y-97900476D01*
%TO.C,SW8*%
X344350952Y-98281428D02*
X343589047Y-98281428D01*
X343970000Y-98662380D02*
X343970000Y-97900476D01*
X344380952Y-101571428D02*
X343619047Y-101571428D01*
%TO.C,SW2*%
X92380952Y-101571428D02*
X91619047Y-101571428D01*
X92000000Y-101952380D02*
X92000000Y-101190476D01*
X92350952Y-98281428D02*
X91589047Y-98281428D01*
%TO.C,SW7*%
X302380952Y-101571428D02*
X301619047Y-101571428D01*
X302000000Y-101952380D02*
X302000000Y-101190476D01*
X302350952Y-98281428D02*
X301589047Y-98281428D01*
%TO.C,SW4*%
X176380952Y-101571428D02*
X175619047Y-101571428D01*
X176350952Y-98281428D02*
X175589047Y-98281428D01*
X175970000Y-98662380D02*
X175970000Y-97900476D01*
D11*
%TO.C,SW5*%
X211750000Y-105910000D02*
G75*
G03*
X211750000Y-105910000I0J0D01*
G01*
X226000000Y-100000000D02*
G75*
G03*
X226000000Y-100000000I-8000000J0D01*
G01*
%TO.C,SW6*%
X253750000Y-105910000D02*
G75*
G03*
X253750000Y-105910000I0J0D01*
G01*
X268000000Y-100000000D02*
G75*
G03*
X268000000Y-100000000I-8000000J0D01*
G01*
%TO.C,SW1*%
X43750000Y-105910000D02*
G75*
G03*
X43750000Y-105910000I0J0D01*
G01*
X58000000Y-100000000D02*
G75*
G03*
X58000000Y-100000000I-8000000J0D01*
G01*
%TO.C,SW3*%
X142000000Y-100000000D02*
G75*
G03*
X142000000Y-100000000I-8000000J0D01*
G01*
X127750000Y-105910000D02*
G75*
G03*
X127750000Y-105910000I0J0D01*
G01*
%TO.C,SW8*%
X337750000Y-105910000D02*
G75*
G03*
X337750000Y-105910000I0J0D01*
G01*
X352000000Y-100000000D02*
G75*
G03*
X352000000Y-100000000I-8000000J0D01*
G01*
%TO.C,SW2*%
X85750000Y-105910000D02*
G75*
G03*
X85750000Y-105910000I0J0D01*
G01*
X100000000Y-100000000D02*
G75*
G03*
X100000000Y-100000000I-8000000J0D01*
G01*
%TO.C,SW7*%
X310000000Y-100000000D02*
G75*
G03*
X310000000Y-100000000I-8000000J0D01*
G01*
X295750000Y-105910000D02*
G75*
G03*
X295750000Y-105910000I0J0D01*
G01*
%TO.C,SW4*%
X169750000Y-105910000D02*
G75*
G03*
X169750000Y-105910000I0J0D01*
G01*
X184000000Y-100000000D02*
G75*
G03*
X184000000Y-100000000I-8000000J0D01*
G01*
%TD*%
M02*
