%TF.GenerationSoftware,KiCad,Pcbnew,6.0.0-d3dd2cf0fa~116~ubuntu20.04.1*%
%TF.CreationDate,2022-09-08T23:37:02+02:00*%
%TF.ProjectId,mix,6d69782e-6b69-4636-9164-5f7063625858,rev?*%
%TF.SameCoordinates,Original*%
%TF.FileFunction,Paste,Top*%
%TF.FilePolarity,Positive*%
%FSLAX46Y46*%
G04 Gerber Fmt 4.6, Leading zero omitted, Abs format (unit mm)*
G04 Created by KiCad (PCBNEW 6.0.0-d3dd2cf0fa~116~ubuntu20.04.1) date 2022-09-08 23:37:02*
%MOMM*%
%LPD*%
G01*
G04 APERTURE LIST*
G04 Aperture macros list*
%AMRoundRect*
0 Rectangle with rounded corners*
0 $1 Rounding radius*
0 $2 $3 $4 $5 $6 $7 $8 $9 X,Y pos of 4 corners*
0 Add a 4 corners polygon primitive as box body*
4,1,4,$2,$3,$4,$5,$6,$7,$8,$9,$2,$3,0*
0 Add four circle primitives for the rounded corners*
1,1,$1+$1,$2,$3*
1,1,$1+$1,$4,$5*
1,1,$1+$1,$6,$7*
1,1,$1+$1,$8,$9*
0 Add four rect primitives between the rounded corners*
20,1,$1+$1,$2,$3,$4,$5,0*
20,1,$1+$1,$4,$5,$6,$7,0*
20,1,$1+$1,$6,$7,$8,$9,0*
20,1,$1+$1,$8,$9,$2,$3,0*%
G04 Aperture macros list end*
%ADD10R,1.000000X0.800000*%
%ADD11RoundRect,0.237500X-0.250000X-0.237500X0.250000X-0.237500X0.250000X0.237500X-0.250000X0.237500X0*%
%ADD12R,2.500000X1.800000*%
%ADD13RoundRect,0.237500X0.250000X0.237500X-0.250000X0.237500X-0.250000X-0.237500X0.250000X-0.237500X0*%
%ADD14RoundRect,0.237500X0.300000X0.237500X-0.300000X0.237500X-0.300000X-0.237500X0.300000X-0.237500X0*%
%ADD15R,0.450000X1.675000*%
G04 APERTURE END LIST*
D10*
%TO.C,Q14*%
X317910000Y-107280000D03*
X317910000Y-109180000D03*
X320210000Y-108230000D03*
%TD*%
D11*
%TO.C,R26*%
X233977500Y-96580000D03*
X235802500Y-96580000D03*
%TD*%
D10*
%TO.C,Q2*%
X65910000Y-107280000D03*
X65910000Y-109180000D03*
X68210000Y-108230000D03*
%TD*%
D12*
%TO.C,D1*%
X58290000Y-108010000D03*
X62290000Y-108010000D03*
%TD*%
D10*
%TO.C,Q6*%
X149910000Y-107280000D03*
X149910000Y-109180000D03*
X152210000Y-108230000D03*
%TD*%
D12*
%TO.C,D4*%
X184290000Y-108010000D03*
X188290000Y-108010000D03*
%TD*%
D10*
%TO.C,Q4*%
X107910000Y-107280000D03*
X107910000Y-109180000D03*
X110210000Y-108230000D03*
%TD*%
D11*
%TO.C,R32*%
X317977500Y-103000000D03*
X319802500Y-103000000D03*
%TD*%
D13*
%TO.C,R1*%
X181482500Y-90660000D03*
X179657500Y-90660000D03*
%TD*%
D11*
%TO.C,R22*%
X233977500Y-103000000D03*
X235802500Y-103000000D03*
%TD*%
%TO.C,R17*%
X191977500Y-103000000D03*
X193802500Y-103000000D03*
%TD*%
%TO.C,R36*%
X317977500Y-96580000D03*
X319802500Y-96580000D03*
%TD*%
D12*
%TO.C,D3*%
X142290000Y-108010000D03*
X146290000Y-108010000D03*
%TD*%
D11*
%TO.C,R31*%
X275977500Y-96580000D03*
X277802500Y-96580000D03*
%TD*%
%TO.C,R25*%
X233977500Y-101000000D03*
X235802500Y-101000000D03*
%TD*%
D13*
%TO.C,R28*%
X277802500Y-98840000D03*
X275977500Y-98840000D03*
%TD*%
%TO.C,R23*%
X235802500Y-98840000D03*
X233977500Y-98840000D03*
%TD*%
%TO.C,R8*%
X109802500Y-98840000D03*
X107977500Y-98840000D03*
%TD*%
D11*
%TO.C,R5*%
X65977500Y-101000000D03*
X67802500Y-101000000D03*
%TD*%
%TO.C,R15*%
X149977500Y-101000000D03*
X151802500Y-101000000D03*
%TD*%
D10*
%TO.C,Q8*%
X191910000Y-107280000D03*
X191910000Y-109180000D03*
X194210000Y-108230000D03*
%TD*%
D11*
%TO.C,R27*%
X275977500Y-103000000D03*
X277802500Y-103000000D03*
%TD*%
D13*
%TO.C,R13*%
X151802500Y-98840000D03*
X149977500Y-98840000D03*
%TD*%
D12*
%TO.C,D5*%
X226290000Y-108010000D03*
X230290000Y-108010000D03*
%TD*%
D11*
%TO.C,R41*%
X359977500Y-96580000D03*
X361802500Y-96580000D03*
%TD*%
%TO.C,R35*%
X317977500Y-101000000D03*
X319802500Y-101000000D03*
%TD*%
%TO.C,R30*%
X275977500Y-101000000D03*
X277802500Y-101000000D03*
%TD*%
%TO.C,R6*%
X65977500Y-96580000D03*
X67802500Y-96580000D03*
%TD*%
%TO.C,R12*%
X149977500Y-103000000D03*
X151802500Y-103000000D03*
%TD*%
D13*
%TO.C,R38*%
X361802500Y-98840000D03*
X359977500Y-98840000D03*
%TD*%
%TO.C,R18*%
X193802500Y-98840000D03*
X191977500Y-98840000D03*
%TD*%
D11*
%TO.C,R16*%
X149977500Y-96580000D03*
X151802500Y-96580000D03*
%TD*%
D10*
%TO.C,Q16*%
X359910000Y-107280000D03*
X359910000Y-109180000D03*
X362210000Y-108230000D03*
%TD*%
D11*
%TO.C,R7*%
X107977500Y-103000000D03*
X109802500Y-103000000D03*
%TD*%
D12*
%TO.C,D2*%
X100290000Y-108010000D03*
X104290000Y-108010000D03*
%TD*%
D11*
%TO.C,R11*%
X107977500Y-96580000D03*
X109802500Y-96580000D03*
%TD*%
D13*
%TO.C,R33*%
X319802500Y-98840000D03*
X317977500Y-98840000D03*
%TD*%
%TO.C,R3*%
X67802500Y-98840000D03*
X65977500Y-98840000D03*
%TD*%
D11*
%TO.C,R40*%
X359977500Y-101000000D03*
X361802500Y-101000000D03*
%TD*%
D14*
%TO.C,C3*%
X182862500Y-84000000D03*
X181137500Y-84000000D03*
%TD*%
D10*
%TO.C,Q10*%
X233910000Y-107280000D03*
X233910000Y-109180000D03*
X236210000Y-108230000D03*
%TD*%
%TO.C,Q12*%
X275910000Y-107280000D03*
X275910000Y-109180000D03*
X278210000Y-108230000D03*
%TD*%
D11*
%TO.C,R2*%
X65977500Y-103000000D03*
X67802500Y-103000000D03*
%TD*%
%TO.C,R10*%
X107977500Y-101000000D03*
X109802500Y-101000000D03*
%TD*%
D15*
%TO.C,IC1*%
X185460000Y-90853000D03*
X186110000Y-90853000D03*
X186760000Y-90853000D03*
X187410000Y-90853000D03*
X188060000Y-90853000D03*
X188710000Y-90853000D03*
X189360000Y-90853000D03*
X190010000Y-90853000D03*
X190660000Y-90853000D03*
X191310000Y-90853000D03*
X191960000Y-90853000D03*
X192610000Y-90853000D03*
X192610000Y-83877000D03*
X191960000Y-83877000D03*
X191310000Y-83877000D03*
X190660000Y-83877000D03*
X190010000Y-83877000D03*
X189360000Y-83877000D03*
X188710000Y-83877000D03*
X188060000Y-83877000D03*
X187410000Y-83877000D03*
X186760000Y-83877000D03*
X186110000Y-83877000D03*
X185460000Y-83877000D03*
%TD*%
D12*
%TO.C,D8*%
X352290000Y-108010000D03*
X356290000Y-108010000D03*
%TD*%
D11*
%TO.C,R21*%
X191977500Y-96580000D03*
X193802500Y-96580000D03*
%TD*%
D12*
%TO.C,D7*%
X310290000Y-108010000D03*
X314290000Y-108010000D03*
%TD*%
%TO.C,D6*%
X268290000Y-108010000D03*
X272290000Y-108010000D03*
%TD*%
D11*
%TO.C,R20*%
X191977500Y-101000000D03*
X193802500Y-101000000D03*
%TD*%
%TO.C,R37*%
X359977500Y-103000000D03*
X361802500Y-103000000D03*
%TD*%
M02*
