%YAML 1.1
%TAG !u! tag:unity3d.com,2011:
--- !u!114 &11400000
MonoBehaviour:
  m_ObjectHideFlags: 0
  m_CorrespondingSourceObject: {fileID: 0}
  m_PrefabInstance: {fileID: 0}
  m_PrefabAsset: {fileID: 0}
  m_GameObject: {fileID: 0}
  m_Enabled: 1
  m_EditorHideFlags: 0
  m_Script: {fileID: 11500000, guid: 848409ee8ba454f42a5ddff137688a27, type: 3}
  m_Name: ReferenceImageLibrary
  m_EditorClassIdentifier: 
  m_GuidLow: 5747141495492975750
  m_GuidHigh: 7169168509980158109
  m_Images:
  - m_SerializedGuid:
      m_GuidLow: 4765107858806787033
      m_GuidHigh: 6080515584987895192
    m_SerializedTextureGuid:
      m_GuidLow: 3239474264150229755
      m_GuidHigh: 17827785034629750249
    m_Size: {x: 0.06428571, y: 0.065}
    m_SpecifySize: 1
    m_Name: ArTag01
    m_Texture: {fileID: 2800000, guid: 05b1c2fbecae2cf4e99d2189080469f7, type: 3}
  - m_SerializedGuid:
      m_GuidLow: 4948960983840226758
      m_GuidHigh: 15554331746188804740
    m_SerializedTextureGuid:
      m_GuidLow: 1280261633119830512
      m_GuidHigh: 14083607403795228938
    m_Size: {x: 0.06428571, y: 0.065}
    m_SpecifySize: 1
    m_Name: ArTag02
    m_Texture: {fileID: 2800000, guid: 15ab41f0672c11c40aa946cb500673c3, type: 3}
  - m_SerializedGuid:
      m_GuidLow: 5673330201851102829
      m_GuidHigh: 6325849611603469455
    m_SerializedTextureGuid:
      m_GuidLow: 16993330452736969895
      m_GuidHigh: 1124944897493368569
    m_Size: {x: 0.06428571, y: 0.065}
    m_SpecifySize: 1
    m_Name: ArTag03
    m_Texture: {fileID: 2800000, guid: 22370ca77003ebd4f9fefa8e6c9b9c0f, type: 3}
  - m_SerializedGuid:
      m_GuidLow: 4961373531016715934
      m_GuidHigh: 6477606728375805620
    m_SerializedTextureGuid:
      m_GuidLow: 13597601982807778824
      m_GuidHigh: 6331903262106050313
    m_Size: {x: 0.06428571, y: 0.065}
    m_SpecifySize: 1
    m_Name: ArTag04
    m_Texture: {fileID: 2800000, guid: ce67a60862f5bcb409dff7117870df57, type: 3}
