<?xml version="1.0" encoding="UTF-8"?>
<svg id="Clean" xmlns="http://www.w3.org/2000/svg" viewBox="0 0 128 128">
  <rect id="Color_Background" width="128" height="128" rx="16" ry="16" fill="#17aa8e"/>
  <g id="Circle">
    <g id="Stroke">
      <circle cx="63.86" cy="64.35" r="41.2" fill="none" stroke="#e0e0e0" stroke-dasharray="0 0 8.79 11.11" stroke-linecap="round" stroke-linejoin="round" stroke-width="3.05"/>
    </g>
    <path id="Color_Clean" d="m103.73,53.66c-4.2-15.45-17.25-27.69-34.11-30.05-22.56-3.15-43.4,12.58-46.55,35.14-.79,5.67-.39,11.24,1.01,16.44,0,0,22.19,1.46,42.1-3.92,19.91-5.38,37.55-17.61,37.55-17.61Z" fill="none" stroke="#34f4aa" stroke-linecap="round" stroke-linejoin="round" stroke-width="4"/>
  </g>
</svg>