{
    "typescript.updateImportsOnFileMove.enabled": "never",
    "javascript.updateImportsOnFileMove.enabled": "never",
    "npm.packageManager": "yarn",
    "terminal.integrated.shell.windows": "C:\\Program Files\\Git\\bin\\bash.exe",
    "workbench.colorTheme": "Dracula",
    "editor.fontLigatures": true,
    "editor.fontSize": 15,
    "editor.lineHeight": 20,
    "workbench.iconTheme": "vscode-icons",
    "editor.formatOnSave": true,
    "editor.rulers": [
        80,
        120
    ],
    "workbench.settings.editor": "json",
    "editor.tabSize": 2,
    "terminal.integrated.fontSize": 14,
    "emmet.syntaxProfiles": {
        "javascript": "jsx"
    },
    "emmet.includeLanguages": {
        "javascript": "javascriptreact"
    },
    "breadcrumbs.enabled": true,
    "editor.parameterHints.enabled": false,
    "prettier.singleQuote": true,
    "editor.codeActionsOnSave": {
        "source.fixAll.eslint": true
    },
    "eslint.validate": [
        "javascript",
        "javascriptreact",
        "typescript",
        "typescriptreact"
    ],
    "timeline.excludeSources": [
        "git-history"
    ],
    "editor.suggestSelection": "first",
    "vsintellicode.modify.editor.suggestSelection": "automaticallyOverrodeDefaultValue",
}