module APSS

go 1.20

require github.com/consensys/gnark-crypto v0.10.0

require (
	github.com/bits-and-blooms/bitset v1.5.0 // indirect
	github.com/consensys/bavard v0.1.13 // indirect
	github.com/mmcloughlin/addchain v0.4.0 // indirect
	golang.org/x/crypto v0.0.0-20220722155217-630584e8d5aa // indirect
	golang.org/x/sys v0.2.0 // indirect
	rsc.io/tmplfunc v0.0.3 // indirect
)
