{
    "type": "module",
    "name": "classified",
    "version": "5.4.1",
    "revision": "10111",
    "path": "application\/modules\/Classified\/",
    "repository": null,
    "sku": null,
    "date": "Tue, 12 Jan 2021 12:03:56 +0000",
    "title": "Classifieds",
    "description": "Classifieds",
    "thumb": null,
    "developer": null,
    "authors": [
        "Webligo Developments"
    ],
    "meta": {
        "date": "Tue, 12 Jan 2021 12:03:56 +0000",
        "title": "Classifieds",
        "description": "Classifieds",
        "developer": null,
        "authors": [
            "Webligo Developments"
        ],
        "changeLog": null
    },
    "actions": [
        "install",
        "upgrade",
        "refresh",
        "enable",
        "disable"
    ],
    "callback": {
        "path": "application\/modules\/Classified\/settings\/install.php",
        "class": "Classified_Installer",
        "priority": 100
    },
    "dependencies": {
        "module-core": {
            "type": "module",
            "name": "core",
            "guid": "module-core",
            "minVersion": "5.0.0",
            "maxVersion": null,
            "excludeExcept": null
        }
    },
    "tests": [],
    "permissions": [],
    "structure": {
        "application\/modules\/Classified": {
            "type": "directory",
            "path": "application\/modules\/Classified",
            "structure": [
                {
                    "path": "settings",
                    "dir": true,
                    "file": false,
                    "perms": "0755",
                    "size": 672,
                    "sha1": null
                },
                {
                    "path": "settings\/my-upgrade-4.10.2-4.10.3.sql",
                    "dir": false,
                    "file": true,
                    "perms": "0644",
                    "size": 252,
                    "sha1": "316481d11e82a2624d42ecaacf0260c82e04d21e"
                },
                {
                    "path": "settings\/my-upgrade-4.1.0-4.1.1.sql",
                    "dir": false,
                    "file": true,
                    "perms": "0755",
                    "size": 144,
                    "sha1": "0345b0c2130bcfe5e2503e8a000223c2f6455eb4"
                },
                {
                    "path": "settings\/my-upgrade-4.0.3-4.0.4.sql",
                    "dir": false,
                    "file": true,
                    "perms": "0755",
                    "size": 3197,
                    "sha1": "72bfb7ad51f72f0299a77b2294e324092aa3ebbe"
                },
                {
                    "path": "settings\/install.php",
                    "dir": false,
                    "file": true,
                    "perms": "0755",
                    "size": 21981,
                    "sha1": "33dab4b5963c4ee3434bd9952c62954a70bf7b0a"
                },
                {
                    "path": "settings\/my-upgrade-4.10.5-5.0.0b1.sql",
                    "dir": false,
                    "file": true,
                    "perms": "0644",
                    "size": 863,
                    "sha1": "5a9a634f7c8e1df740cfe4594b0a978a187dedf3"
                },
                {
                    "path": "settings\/my-upgrade-4.1.1-4.1.2.sql",
                    "dir": false,
                    "file": true,
                    "perms": "0755",
                    "size": 235,
                    "sha1": "222e03998130282420073d8117bf702bad4a647d"
                },
                {
                    "path": "settings\/my-upgrade-4.0.5-4.1.0.sql",
                    "dir": false,
                    "file": true,
                    "perms": "0755",
                    "size": 1134,
                    "sha1": "0a3cf85989bc952ee134fadb784176008c511a7f"
                },
                {
                    "path": "settings\/my.sql",
                    "dir": false,
                    "file": true,
                    "perms": "0755",
                    "size": 19973,
                    "sha1": "4460e6bae8d5bcb2d9c70f941c56f5c7f0244471"
                },
                {
                    "path": "settings\/my-upgrade-4.9.0-4.9.1.sql",
                    "dir": false,
                    "file": true,
                    "perms": "0644",
                    "size": 176,
                    "sha1": "0cedd6cd05b3cfeb7b9d4fdefc9f9121a2302b36"
                },
                {
                    "path": "settings\/content.php",
                    "dir": false,
                    "file": true,
                    "perms": "0755",
                    "size": 4448,
                    "sha1": "38af1f11341fe9f50604479cb7320b98a1240f6d"
                },
                {
                    "path": "settings\/my-upgrade-4.0.2-4.0.3.sql",
                    "dir": false,
                    "file": true,
                    "perms": "0755",
                    "size": 520,
                    "sha1": "f13ebd62eccef8e58bacb0f6e8bbf4e149f42efd"
                },
                {
                    "path": "settings\/manifest.php",
                    "dir": false,
                    "file": true,
                    "perms": "0755",
                    "size": 3230,
                    "sha1": "a9af4a86f278848c9d3dde5999c034b675179ba3"
                },
                {
                    "path": "settings\/my-upgrade-4.0.4-4.0.5.sql",
                    "dir": false,
                    "file": true,
                    "perms": "0755",
                    "size": 126,
                    "sha1": "1c61a2e2c3450b4a822eece370bf492e127adfdb"
                },
                {
                    "path": "settings\/my-upgrade-4.8.11-4.9.0.sql",
                    "dir": false,
                    "file": true,
                    "perms": "0644",
                    "size": 2761,
                    "sha1": "e8751294192086abf9f108906bd9b657549882bc"
                },
                {
                    "path": "settings\/my-upgrade-4.2.7-4.2.8.sql",
                    "dir": false,
                    "file": true,
                    "perms": "0755",
                    "size": 383,
                    "sha1": "6db5a97677998ff3b1d929405b05a27277233434"
                },
                {
                    "path": "settings\/my-upgrade-5.1.0-5.2.0.sql",
                    "dir": false,
                    "file": true,
                    "perms": "0644",
                    "size": 449,
                    "sha1": "5528c340a89432d7d7afcfbc4f00daefae4865f7"
                },
                {
                    "path": "settings\/my-upgrade-4.0.1-4.0.2.sql",
                    "dir": false,
                    "file": true,
                    "perms": "0755",
                    "size": 5512,
                    "sha1": "2dc85cd03b2b5eeeac79d5dca2cdc6374704eefa"
                },
                {
                    "path": "settings\/my-upgrade-4.1.3-4.1.4.sql",
                    "dir": false,
                    "file": true,
                    "perms": "0755",
                    "size": 244,
                    "sha1": "563a1edd4a3d6f8d6b599e38d349059e540bffc0"
                },
                {
                    "path": "settings\/my-upgrade-4.10.4-4.10.5.sql",
                    "dir": false,
                    "file": true,
                    "perms": "0644",
                    "size": 610,
                    "sha1": "57fd0958929fd24df6c7e12c95293d39de89663f"
                },
                {
                    "path": "Form",
                    "dir": true,
                    "file": false,
                    "perms": "0755",
                    "size": 288,
                    "sha1": null
                },
                {
                    "path": "Form\/Admin",
                    "dir": true,
                    "file": false,
                    "perms": "0755",
                    "size": 160,
                    "sha1": null
                },
                {
                    "path": "Form\/Admin\/Category.php",
                    "dir": false,
                    "file": true,
                    "perms": "0755",
                    "size": 1949,
                    "sha1": "731c1b50d8b2607f4ca2613303988f62696f3a04"
                },
                {
                    "path": "Form\/Admin\/Settings",
                    "dir": true,
                    "file": false,
                    "perms": "0755",
                    "size": 96,
                    "sha1": null
                },
                {
                    "path": "Form\/Admin\/Settings\/Level.php",
                    "dir": false,
                    "file": true,
                    "perms": "0755",
                    "size": 8547,
                    "sha1": "57886d0748a548ff0a0d3c9f2d0aa33a8b885dc6"
                },
                {
                    "path": "Form\/Admin\/Global.php",
                    "dir": false,
                    "file": true,
                    "perms": "0755",
                    "size": 1761,
                    "sha1": "3d91ec38fdce343540fd81c489fc78982695d14e"
                },
                {
                    "path": "Form\/Create.php",
                    "dir": false,
                    "file": true,
                    "perms": "0755",
                    "size": 8663,
                    "sha1": "c42819fb31c6977786933eeb9856475ac06bdd19"
                },
                {
                    "path": "Form\/Search.php",
                    "dir": false,
                    "file": true,
                    "perms": "0755",
                    "size": 5013,
                    "sha1": "527c17e23fb1caf0bda4ec2cbf5c00f6343c3305"
                },
                {
                    "path": "Form\/Delete.php",
                    "dir": false,
                    "file": true,
                    "perms": "0755",
                    "size": 1501,
                    "sha1": "8ca30507b3cf55db925b5224fb97d3a8df387e2f"
                },
                {
                    "path": "Form\/Edit.php",
                    "dir": false,
                    "file": true,
                    "perms": "0755",
                    "size": 1155,
                    "sha1": "9a8e00446a72cd6e81848770432b107933e000cf"
                },
                {
                    "path": "Form\/Custom",
                    "dir": true,
                    "file": false,
                    "perms": "0755",
                    "size": 128,
                    "sha1": null
                },
                {
                    "path": "Form\/Custom\/Fields.php",
                    "dir": false,
                    "file": true,
                    "perms": "0755",
                    "size": 1209,
                    "sha1": "bd36fdd0962f9aaab3dc353222b2da311c213c81"
                },
                {
                    "path": "Form\/Custom\/Search.php",
                    "dir": false,
                    "file": true,
                    "perms": "0755",
                    "size": 2422,
                    "sha1": "c14e00627784634cd0420ce12d85c084b6e80d49"
                },
                {
                    "path": "Form\/Photo",
                    "dir": true,
                    "file": false,
                    "perms": "0755",
                    "size": 128,
                    "sha1": null
                },
                {
                    "path": "Form\/Photo\/Upload.php",
                    "dir": false,
                    "file": true,
                    "perms": "0755",
                    "size": 1858,
                    "sha1": "42b581c65246f49dfb70729a2f856d558eb579c8"
                },
                {
                    "path": "Form\/Photo\/Edit.php",
                    "dir": false,
                    "file": true,
                    "perms": "0755",
                    "size": 2057,
                    "sha1": "6ef9396d30dcabbd873f71fc9d340d04b29b7b79"
                },
                {
                    "path": "externals",
                    "dir": true,
                    "file": false,
                    "perms": "0755",
                    "size": 192,
                    "sha1": null
                },
                {
                    "path": "externals\/images",
                    "dir": true,
                    "file": false,
                    "perms": "0755",
                    "size": 224,
                    "sha1": null
                },
                {
                    "path": "externals\/images\/nophoto_classified_thumb_main.png",
                    "dir": false,
                    "file": true,
                    "perms": "0644",
                    "size": 2857,
                    "sha1": "74c171ec7f3c8318f47b0b5854c0e2de635ce21d"
                },
                {
                    "path": "externals\/images\/nophoto_classified_thumb_icon.png",
                    "dir": false,
                    "file": true,
                    "perms": "0755",
                    "size": 848,
                    "sha1": "9beb4388a3221a4ec5da5ab70c265016d43a39f0"
                },
                {
                    "path": "externals\/images\/transprant-bg.png",
                    "dir": false,
                    "file": true,
                    "perms": "0644",
                    "size": 932,
                    "sha1": "85045c213efb0c2d324e1783e40272e0f213fdff"
                },
                {
                    "path": "externals\/images\/nophoto_classified_thumb_profile.png",
                    "dir": false,
                    "file": true,
                    "perms": "0755",
                    "size": 2857,
                    "sha1": "74c171ec7f3c8318f47b0b5854c0e2de635ce21d"
                },
                {
                    "path": "externals\/images\/nophoto_classified_thumb_normal.png",
                    "dir": false,
                    "file": true,
                    "perms": "0644",
                    "size": 2857,
                    "sha1": "74c171ec7f3c8318f47b0b5854c0e2de635ce21d"
                },
                {
                    "path": "externals\/styles",
                    "dir": true,
                    "file": false,
                    "perms": "0755",
                    "size": 192,
                    "sha1": null
                },
                {
                    "path": "externals\/styles\/slick.css",
                    "dir": false,
                    "file": true,
                    "perms": "0644",
                    "size": 1776,
                    "sha1": "a94a059b3178b4adec09e3281ace2819a30095a4"
                },
                {
                    "path": "externals\/styles\/main.css",
                    "dir": false,
                    "file": true,
                    "perms": "0755",
                    "size": 13814,
                    "sha1": "c35f1b55d2e762895b3a16401b9d4290459f3545"
                },
                {
                    "path": "externals\/styles\/simpleLightbox.css",
                    "dir": false,
                    "file": true,
                    "perms": "0644",
                    "size": 6394,
                    "sha1": "6f6c746eb7e7054250e75edf87ec214612ae757b"
                },
                {
                    "path": "externals\/styles\/mobile.css",
                    "dir": false,
                    "file": true,
                    "perms": "0755",
                    "size": 5980,
                    "sha1": "476ead949808e71f2c90f4ba08423685b1c361f2"
                },
                {
                    "path": "externals\/scripts",
                    "dir": true,
                    "file": false,
                    "perms": "0755",
                    "size": 128,
                    "sha1": null
                },
                {
                    "path": "externals\/scripts\/simpleLightbox.js",
                    "dir": false,
                    "file": true,
                    "perms": "0644",
                    "size": 14363,
                    "sha1": "5f5675bf45afab007adc6cf0806c21826488664c"
                },
                {
                    "path": "externals\/scripts\/slick.min.js",
                    "dir": false,
                    "file": true,
                    "perms": "0644",
                    "size": 42863,
                    "sha1": "3b41b3bc956685015a347a2238e71db29dfa0dbb"
                },
                {
                    "path": "externals\/.htaccess",
                    "dir": false,
                    "file": true,
                    "perms": "0755",
                    "size": 1042,
                    "sha1": "6c835f103d253edf70bfd5ba2430ebe3fa8cacdd"
                },
                {
                    "path": "Plugin",
                    "dir": true,
                    "file": false,
                    "perms": "0755",
                    "size": 160,
                    "sha1": null
                },
                {
                    "path": "Plugin\/Menus.php",
                    "dir": false,
                    "file": true,
                    "perms": "0755",
                    "size": 3223,
                    "sha1": "abb778a8fe22c6803f500b8403e661d7f60a7db7"
                },
                {
                    "path": "Plugin\/Job",
                    "dir": true,
                    "file": false,
                    "perms": "0755",
                    "size": 96,
                    "sha1": null
                },
                {
                    "path": "Plugin\/Job\/Maintenance",
                    "dir": true,
                    "file": false,
                    "perms": "0755",
                    "size": 96,
                    "sha1": null
                },
                {
                    "path": "Plugin\/Job\/Maintenance\/RebuildPrivacy.php",
                    "dir": false,
                    "file": true,
                    "perms": "0755",
                    "size": 4056,
                    "sha1": "59bad8b6c51fb7ab9334fec283863fb0ada1edb1"
                },
                {
                    "path": "Plugin\/Core.php",
                    "dir": false,
                    "file": true,
                    "perms": "0755",
                    "size": 1333,
                    "sha1": "66281fb30770dbc72d1032ed13266b0dfe695898"
                },
                {
                    "path": "Bootstrap.php",
                    "dir": false,
                    "file": true,
                    "perms": "0755",
                    "size": 553,
                    "sha1": "4803a146c61aaaf0292142ab1d2a52b377a61a41"
                },
                {
                    "path": "Model",
                    "dir": true,
                    "file": false,
                    "perms": "0755",
                    "size": 256,
                    "sha1": null
                },
                {
                    "path": "Model\/Category.php",
                    "dir": false,
                    "file": true,
                    "perms": "0755",
                    "size": 1351,
                    "sha1": "f04d526523e40cfad765a2b27f58b785c8cc88db"
                },
                {
                    "path": "Model\/DbTable",
                    "dir": true,
                    "file": false,
                    "perms": "0755",
                    "size": 192,
                    "sha1": null
                },
                {
                    "path": "Model\/DbTable\/Albums.php",
                    "dir": false,
                    "file": true,
                    "perms": "0755",
                    "size": 587,
                    "sha1": "e50424e86dccbbce3cdc8147c015e3a7fd8f7d55"
                },
                {
                    "path": "Model\/DbTable\/Categories.php",
                    "dir": false,
                    "file": true,
                    "perms": "0755",
                    "size": 1879,
                    "sha1": "5893f48a768ea105ad2b7e4e1d61524f7bcbfd1d"
                },
                {
                    "path": "Model\/DbTable\/Photos.php",
                    "dir": false,
                    "file": true,
                    "perms": "0755",
                    "size": 587,
                    "sha1": "4cd37693bb23041166dbf90290a53c02f63eb0f6"
                },
                {
                    "path": "Model\/DbTable\/Classifieds.php",
                    "dir": false,
                    "file": true,
                    "perms": "0755",
                    "size": 5197,
                    "sha1": "5251f242c6f4e14d6ca344304c55aa63d9612c5f"
                },
                {
                    "path": "Model\/Photo.php",
                    "dir": false,
                    "file": true,
                    "perms": "0755",
                    "size": 5843,
                    "sha1": "567aa1c387ae3e7d52acdf77e62ebe64d38fa06e"
                },
                {
                    "path": "Model\/Album.php",
                    "dir": false,
                    "file": true,
                    "perms": "0755",
                    "size": 1370,
                    "sha1": "3485e5f9d277472ba07c193178d5ba1ed772d295"
                },
                {
                    "path": "Model\/Classified.php",
                    "dir": false,
                    "file": true,
                    "perms": "0755",
                    "size": 8164,
                    "sha1": "17acdf2857ab6a4d63d590edd309566ce730aef0"
                },
                {
                    "path": "Model\/Exception.php",
                    "dir": false,
                    "file": true,
                    "perms": "0755",
                    "size": 534,
                    "sha1": "f03cbd11cac44f7b6c1636f5c471d8a39191dee8"
                },
                {
                    "path": "Api",
                    "dir": true,
                    "file": false,
                    "perms": "0755",
                    "size": 96,
                    "sha1": null
                },
                {
                    "path": "Api\/Core.php",
                    "dir": false,
                    "file": true,
                    "perms": "0755",
                    "size": 2463,
                    "sha1": "e3ec291b821b922b40b281186715f376543ca4eb"
                },
                {
                    "path": "controllers",
                    "dir": true,
                    "file": false,
                    "perms": "0755",
                    "size": 256,
                    "sha1": null
                },
                {
                    "path": "controllers\/AdminLevelController.php",
                    "dir": false,
                    "file": true,
                    "perms": "0755",
                    "size": 2378,
                    "sha1": "cd7a51a241889fcf2be8cff5f930d8d6b38e1230"
                },
                {
                    "path": "controllers\/PhotoController.php",
                    "dir": false,
                    "file": true,
                    "perms": "0755",
                    "size": 8620,
                    "sha1": "ae6017a0b46e534677c7d445fab80ba96476ee47"
                },
                {
                    "path": "controllers\/AdminManageController.php",
                    "dir": false,
                    "file": true,
                    "perms": "0755",
                    "size": 2247,
                    "sha1": "c5003e36be6fff964fc5d8fe382701c1f4f74d21"
                },
                {
                    "path": "controllers\/AdminFieldsController.php",
                    "dir": false,
                    "file": true,
                    "perms": "0755",
                    "size": 2422,
                    "sha1": "f41e9361957ecbc4bee6a2f22ad60d9b980cb250"
                },
                {
                    "path": "controllers\/IndexController.php",
                    "dir": false,
                    "file": true,
                    "perms": "0755",
                    "size": 30989,
                    "sha1": "dada8fb8d07a39aa6ec59de0e319b21ba49c2f91"
                },
                {
                    "path": "controllers\/AdminSettingsController.php",
                    "dir": false,
                    "file": true,
                    "perms": "0755",
                    "size": 5693,
                    "sha1": "1c3970249cfae782aa9b247feb4a2949a6bbe61f"
                },
                {
                    "path": "views",
                    "dir": true,
                    "file": false,
                    "perms": "0755",
                    "size": 96,
                    "sha1": null
                },
                {
                    "path": "views\/scripts",
                    "dir": true,
                    "file": false,
                    "perms": "0755",
                    "size": 288,
                    "sha1": null
                },
                {
                    "path": "views\/scripts\/_FancyUpload.tpl",
                    "dir": false,
                    "file": true,
                    "perms": "0755",
                    "size": 10354,
                    "sha1": "76373dbce836e1b3a5983995605984fa4dd476c4"
                },
                {
                    "path": "views\/scripts\/index",
                    "dir": true,
                    "file": false,
                    "perms": "0755",
                    "size": 320,
                    "sha1": null
                },
                {
                    "path": "views\/scripts\/index\/index.tpl",
                    "dir": false,
                    "file": true,
                    "perms": "0755",
                    "size": 3430,
                    "sha1": "77d88dadadb61af82d7576b4a0bfaa81b5e26bb9"
                },
                {
                    "path": "views\/scripts\/index\/create.tpl",
                    "dir": false,
                    "file": true,
                    "perms": "0755",
                    "size": 2653,
                    "sha1": "fc156866a902dbd581e367bc91874fe755fb6540"
                },
                {
                    "path": "views\/scripts\/index\/view.tpl",
                    "dir": false,
                    "file": true,
                    "perms": "0755",
                    "size": 10522,
                    "sha1": "e27802d09da75b02ded19b75a4a831b030c2d548"
                },
                {
                    "path": "views\/scripts\/index\/delete.tpl",
                    "dir": false,
                    "file": true,
                    "perms": "0755",
                    "size": 339,
                    "sha1": "cade065e7a2a392b5968bbce5122db9da75eb6b1"
                },
                {
                    "path": "views\/scripts\/index\/success.tpl",
                    "dir": false,
                    "file": true,
                    "perms": "0755",
                    "size": 1204,
                    "sha1": "c6794ea30045992030c796175648ad93f381dfc4"
                },
                {
                    "path": "views\/scripts\/index\/manage.tpl",
                    "dir": false,
                    "file": true,
                    "perms": "0755",
                    "size": 6490,
                    "sha1": "cd3d1f8ff0899d5617f0b88acd1e9b9b37c1f99d"
                },
                {
                    "path": "views\/scripts\/index\/upload-photo.tpl",
                    "dir": false,
                    "file": true,
                    "perms": "0755",
                    "size": 1075,
                    "sha1": "acc19bdeef7bc5bf7c2ac78ed061c606b1810c45"
                },
                {
                    "path": "views\/scripts\/index\/edit.tpl",
                    "dir": false,
                    "file": true,
                    "perms": "0755",
                    "size": 5676,
                    "sha1": "7de6e8136e956bba63b0b077bec9d2078ce9e9c6"
                },
                {
                    "path": "views\/scripts\/admin-settings",
                    "dir": true,
                    "file": false,
                    "perms": "0755",
                    "size": 192,
                    "sha1": null
                },
                {
                    "path": "views\/scripts\/admin-settings\/index.tpl",
                    "dir": false,
                    "file": true,
                    "perms": "0755",
                    "size": 715,
                    "sha1": "dcb206f3e37044e474d20943041abc5d4f44dd97"
                },
                {
                    "path": "views\/scripts\/admin-settings\/delete.tpl",
                    "dir": false,
                    "file": true,
                    "perms": "0755",
                    "size": 1059,
                    "sha1": "8455cfce24412b597a24e5a9033b2c21f9ca3a20"
                },
                {
                    "path": "views\/scripts\/admin-settings\/categories.tpl",
                    "dir": false,
                    "file": true,
                    "perms": "0755",
                    "size": 2909,
                    "sha1": "5e757ade4ca4189d636d64de8b96ea27c7d38426"
                },
                {
                    "path": "views\/scripts\/admin-settings\/form.tpl",
                    "dir": false,
                    "file": true,
                    "perms": "0755",
                    "size": 485,
                    "sha1": "6e014b8d80dcea9559208aaca8752de1559675c1"
                },
                {
                    "path": "views\/scripts\/admin-manage",
                    "dir": true,
                    "file": false,
                    "perms": "0755",
                    "size": 128,
                    "sha1": null
                },
                {
                    "path": "views\/scripts\/admin-manage\/index.tpl",
                    "dir": false,
                    "file": true,
                    "perms": "0755",
                    "size": 3595,
                    "sha1": "4da8201bcfa7181bf52a5a491af9026251aca19e"
                },
                {
                    "path": "views\/scripts\/admin-manage\/delete.tpl",
                    "dir": false,
                    "file": true,
                    "perms": "0755",
                    "size": 1065,
                    "sha1": "82aee1f9c3e4e3a25b88c0493c3fa6a7894e9aad"
                },
                {
                    "path": "views\/scripts\/admin-fields",
                    "dir": true,
                    "file": false,
                    "perms": "0755",
                    "size": 96,
                    "sha1": null
                },
                {
                    "path": "views\/scripts\/admin-fields\/index.tpl",
                    "dir": false,
                    "file": true,
                    "perms": "0755",
                    "size": 1362,
                    "sha1": "e1f176fa9447186e21eedf1a874e6dce22ba2e69"
                },
                {
                    "path": "views\/scripts\/photo",
                    "dir": true,
                    "file": false,
                    "perms": "0755",
                    "size": 96,
                    "sha1": null
                },
                {
                    "path": "views\/scripts\/photo\/upload.tpl",
                    "dir": false,
                    "file": true,
                    "perms": "0755",
                    "size": 1088,
                    "sha1": "ac1a33642fdd6ca1523fa1c138d8b644d7523332"
                },
                {
                    "path": "views\/scripts\/admin-level",
                    "dir": true,
                    "file": false,
                    "perms": "0755",
                    "size": 96,
                    "sha1": null
                },
                {
                    "path": "views\/scripts\/admin-level\/index.tpl",
                    "dir": false,
                    "file": true,
                    "perms": "0755",
                    "size": 900,
                    "sha1": "e9b28932f01a885bce478249f5f96f6e7db44424"
                },
                {
                    "path": "widgets",
                    "dir": true,
                    "file": false,
                    "perms": "0755",
                    "size": 320,
                    "sha1": null
                },
                {
                    "path": "widgets\/hashtag-search-results",
                    "dir": true,
                    "file": false,
                    "perms": "0755",
                    "size": 128,
                    "sha1": null
                },
                {
                    "path": "widgets\/hashtag-search-results\/index.tpl",
                    "dir": false,
                    "file": true,
                    "perms": "0644",
                    "size": 2254,
                    "sha1": "7569eddc8b2103e6568aecc79c6a7f7747071777"
                },
                {
                    "path": "widgets\/hashtag-search-results\/Controller.php",
                    "dir": false,
                    "file": true,
                    "perms": "0644",
                    "size": 2133,
                    "sha1": "5dfa6abb9375f4bf98e20b9ca5416f75795f7955"
                },
                {
                    "path": "widgets\/list-recent-classifieds",
                    "dir": true,
                    "file": false,
                    "perms": "0755",
                    "size": 128,
                    "sha1": null
                },
                {
                    "path": "widgets\/list-recent-classifieds\/index.tpl",
                    "dir": false,
                    "file": true,
                    "perms": "0755",
                    "size": 1978,
                    "sha1": "50a9972ee101324eda15dbfbe0d0eeb0036f9ecc"
                },
                {
                    "path": "widgets\/list-recent-classifieds\/Controller.php",
                    "dir": false,
                    "file": true,
                    "perms": "0755",
                    "size": 2478,
                    "sha1": "a9a57eec276a497248da8c591b9e9377b415f9fc"
                },
                {
                    "path": "widgets\/browse-search",
                    "dir": true,
                    "file": false,
                    "perms": "0755",
                    "size": 128,
                    "sha1": null
                },
                {
                    "path": "widgets\/browse-search\/index.tpl",
                    "dir": false,
                    "file": true,
                    "perms": "0755",
                    "size": 1744,
                    "sha1": "c2eba1444d33a70763c4c3dc3e5bf75bc1951fde"
                },
                {
                    "path": "widgets\/browse-search\/Controller.php",
                    "dir": false,
                    "file": true,
                    "perms": "0755",
                    "size": 2771,
                    "sha1": "fabb90585e5cab76a9d38de0d98e48d73243f6be"
                },
                {
                    "path": "widgets\/browse-menu-quick",
                    "dir": true,
                    "file": false,
                    "perms": "0755",
                    "size": 128,
                    "sha1": null
                },
                {
                    "path": "widgets\/browse-menu-quick\/index.tpl",
                    "dir": false,
                    "file": true,
                    "perms": "0755",
                    "size": 272,
                    "sha1": "13fa164e7bca3d55c3015cf51214e75785618753"
                },
                {
                    "path": "widgets\/browse-menu-quick\/Controller.php",
                    "dir": false,
                    "file": true,
                    "perms": "0755",
                    "size": 871,
                    "sha1": "e8b01f212f4254f31137cb3dc36915f442e7154a"
                },
                {
                    "path": "widgets\/list-categories",
                    "dir": true,
                    "file": false,
                    "perms": "0755",
                    "size": 128,
                    "sha1": null
                },
                {
                    "path": "widgets\/list-categories\/index.tpl",
                    "dir": false,
                    "file": true,
                    "perms": "0644",
                    "size": 406,
                    "sha1": "faf343099100590c76d66ec192319b7e163532c0"
                },
                {
                    "path": "widgets\/list-categories\/Controller.php",
                    "dir": false,
                    "file": true,
                    "perms": "0644",
                    "size": 812,
                    "sha1": "a5ae0ee2a4dd6049f360180f837bca9473f6c02c"
                },
                {
                    "path": "widgets\/profile-classifieds",
                    "dir": true,
                    "file": false,
                    "perms": "0755",
                    "size": 128,
                    "sha1": null
                },
                {
                    "path": "widgets\/profile-classifieds\/index.tpl",
                    "dir": false,
                    "file": true,
                    "perms": "0755",
                    "size": 3330,
                    "sha1": "7a31efa3199b81dddac9b69dee9dd085ab8ba547"
                },
                {
                    "path": "widgets\/profile-classifieds\/Controller.php",
                    "dir": false,
                    "file": true,
                    "perms": "0755",
                    "size": 1974,
                    "sha1": "3c934c69ef1ae852d29b0ee905823ba7a9180b9e"
                },
                {
                    "path": "widgets\/list-popular-classifieds",
                    "dir": true,
                    "file": false,
                    "perms": "0755",
                    "size": 128,
                    "sha1": null
                },
                {
                    "path": "widgets\/list-popular-classifieds\/index.tpl",
                    "dir": false,
                    "file": true,
                    "perms": "0755",
                    "size": 1993,
                    "sha1": "f875821cf31369614a005d22fc062ffc4bfbf21f"
                },
                {
                    "path": "widgets\/list-popular-classifieds\/Controller.php",
                    "dir": false,
                    "file": true,
                    "perms": "0755",
                    "size": 2279,
                    "sha1": "07d6a38bcc3bea459baee1726e9797080b3aaf4e"
                },
                {
                    "path": "widgets\/browse-menu",
                    "dir": true,
                    "file": false,
                    "perms": "0755",
                    "size": 128,
                    "sha1": null
                },
                {
                    "path": "widgets\/browse-menu\/index.tpl",
                    "dir": false,
                    "file": true,
                    "perms": "0755",
                    "size": 301,
                    "sha1": "75ec65ca96450fdb656a20f7a911822977f59d4e"
                },
                {
                    "path": "widgets\/browse-menu\/Controller.php",
                    "dir": false,
                    "file": true,
                    "perms": "0755",
                    "size": 875,
                    "sha1": "8e63786c6d4a6c457632c1cebdd29d4dbb855fa3"
                }
            ]
        },
        "application\/languages\/en\/classified.csv": {
            "type": "file",
            "path": "application\/languages\/en\/classified.csv",
            "structure": {
                "path": "classified.csv",
                "dir": false,
                "file": true,
                "perms": "0755",
                "size": 18785,
                "sha1": "623a7418c055e0266bd6550b9a6ad346e6653de8"
            }
        }
    }
}