{
  "type": "theme",
  "name": "serenity",
  "version": "5.4.1",
  "revision": "10113",
  "path": "application\/themes\/serenity",
  "repository": null,
  "sku": null,
  "date": "Tue, 12 Jan 2021 12:04:10 +0000",
  "title": "Serenity",
  "description": "Serenity",
  "thumb": "theme.jpg",
  "developer": null,
  "authors": [
    "Webligo Developments"
  ],
  "meta": {
    "date": "Tue, 12 Jan 2021 12:04:10 +0000",
    "title": "Serenity",
    "description": "Serenity",
    "developer": null,
    "authors": [
      "Webligo Developments"
    ],
    "changeLog": null
  },
  "actions": [
    "install",
    "upgrade",
    "refresh",
    "remove"
  ],
  "callback": {
    "path": null,
    "class": "Engine_Package_Installer_Theme",
    "priority": 100
  },
  "dependencies": null,
  "tests": [
    
  ],
  "permissions": [
    
  ],
  "structure": {
    "application\/themes\/serenity": {
      "type": "directory",
      "path": "application\/themes\/serenity",
      "structure": [
        {
          "path": "theme.css",
          "dir": false,
          "file": true,
          "perms": "0644",
          "size": 76614,
          "sha1": "56bf17bbc38773f40317330ce287e3be8107c980"
        },
        {
          "path": "images",
          "dir": true,
          "file": false,
          "perms": "0755",
          "size": 256,
          "sha1": null
        },
        {
          "path": "images\/bullet.png",
          "dir": false,
          "file": true,
          "perms": "0644",
          "size": 177,
          "sha1": "88d5bbc5e895b976c41778c8eb37eb456b84908c"
        },
        {
          "path": "images\/topbar_bg.png",
          "dir": false,
          "file": true,
          "perms": "0644",
          "size": 13285,
          "sha1": "189deb8f84195b62aa20afb1c9433503cf44534f"
        },
        {
          "path": "images\/bullet_active.png",
          "dir": false,
          "file": true,
          "perms": "0644",
          "size": 173,
          "sha1": "7eab9cf04e67034273d6532fe89a47ae58445e2f"
        },
        {
          "path": "images\/buttonbg.png",
          "dir": false,
          "file": true,
          "perms": "0644",
          "size": 105,
          "sha1": "bfbe9d72ee9861006d0538d7a4c9d9c3e0ebc6c4"
        },
        {
          "path": "images\/topbar_menu_bg.png",
          "dir": false,
          "file": true,
          "perms": "0644",
          "size": 170,
          "sha1": "565dda63d0039d02852e14ef58766797f25ee2f7"
        },
        {
          "path": "images\/bullet_hover.png",
          "dir": false,
          "file": true,
          "perms": "0644",
          "size": 179,
          "sha1": "932a55bc938965bc94a48ea2a7d540a0e35dccaf"
        },
        {
          "path": "theme.jpg",
          "dir": false,
          "file": true,
          "perms": "0644",
          "size": 6730,
          "sha1": "24d9f509541191a642ee1be3e145c7ceab60f186"
        },
        {
          "path": "manifest.php",
          "dir": false,
          "file": true,
          "perms": "0644",
          "size": 754,
          "sha1": "aeee9e952c95088287c3333147eb8a783f0d2a19"
        },
        {
          "path": "constants.css",
          "dir": false,
          "file": true,
          "perms": "0644",
          "size": 9719,
          "sha1": "1c6cd53b2b1e698c5c84495430e51c263a3fcc3f"
        },
        {
          "path": "mobile.css",
          "dir": false,
          "file": true,
          "perms": "0644",
          "size": 19931,
          "sha1": "b37bfe35e3cd557b80babfb6d481730ec8206272"
        }
      ]
    }
  }
}