{
  "type": "module",
  "name": "user",
  "version": "5.4.1",
  "revision": "10271",
  "path": "application\/modules\/User",
  "repository": null,
  "sku": null,
  "date": "Tue, 12 Jan 2021 12:04:09 +0000",
  "title": "Members",
  "description": "Members",
  "thumb": null,
  "developer": null,
  "authors": [
    "Webligo Developments"
  ],
  "meta": {
    "date": "Tue, 12 Jan 2021 12:04:09 +0000",
    "title": "Members",
    "description": "Members",
    "developer": null,
    "authors": [
      "Webligo Developments"
    ],
    "changeLog": null
  },
  "actions": [
    "install",
    "upgrade",
    "refresh"
  ],
  "callback": {
    "path": "application\/modules\/User\/settings\/install.php",
    "class": "User_Installer",
    "priority": 3000
  },
  "dependencies": {
    "module-core": {
      "type": "module",
      "name": "core",
      "guid": "module-core",
      "minVersion": "5.0.0",
      "maxVersion": null,
      "excludeExcept": null
    }
  },
  "tests": [
    
  ],
  "permissions": [
    
  ],
  "structure": {
    "application\/modules\/User": {
      "type": "directory",
      "path": "application\/modules\/User",
      "structure": [
        {
          "path": "settings",
          "dir": true,
          "file": false,
          "perms": "0755",
          "size": 1024,
          "sha1": null
        },
        {
          "path": "settings\/my-upgrade-4.8.13-4.9.0.sql",
          "dir": false,
          "file": true,
          "perms": "0644",
          "size": 2611,
          "sha1": "26b6077b3d20ac96be2accc7a351a3cd960ee6b8"
        },
        {
          "path": "settings\/my-upgrade-4.1.0-4.1.1.sql",
          "dir": false,
          "file": true,
          "perms": "0644",
          "size": 181,
          "sha1": "ba4ce23d836d99a1836f853620745aedbbb976e3"
        },
        {
          "path": "settings\/my-upgrade-5.0.1-5.1.0.sql",
          "dir": false,
          "file": true,
          "perms": "0644",
          "size": 81,
          "sha1": "6d90777c9637fc8be3a8428d94268d99c8811a26"
        },
        {
          "path": "settings\/install.php",
          "dir": false,
          "file": true,
          "perms": "0644",
          "size": 32640,
          "sha1": "42c5bafc9ca13398b8ca50ba2b781cd72f25aa6e"
        },
        {
          "path": "settings\/my-upgrade-4.2.0-4.2.1.sql",
          "dir": false,
          "file": true,
          "perms": "0644",
          "size": 106,
          "sha1": "0dc90afdb175910e800aeff7d898457b7a40adf9"
        },
        {
          "path": "settings\/my-upgrade-5.2.0p2-5.2.1.sql.sql",
          "dir": false,
          "file": true,
          "perms": "0644",
          "size": 4388,
          "sha1": "c706fe5e7816c2daae80cde78c17cdd8d78acd57"
        },
        {
          "path": "settings\/my-upgrade-4.10.5-5.0.0b1.sql",
          "dir": false,
          "file": true,
          "perms": "0644",
          "size": 10628,
          "sha1": "96742e90b8f8a6feda0695f0b786cdff9cab9eb1"
        },
        {
          "path": "settings\/my-upgrade-4.1.1-4.1.2.sql",
          "dir": false,
          "file": true,
          "perms": "0644",
          "size": 415,
          "sha1": "6011da7faaebe830fb371a0b6d564e2c2544769e"
        },
        {
          "path": "settings\/my-upgrade-4.0.5-4.1.0.sql",
          "dir": false,
          "file": true,
          "perms": "0644",
          "size": 1189,
          "sha1": "8ee1b5660879e0329a9eb244bf2c9f40f5621e82"
        },
        {
          "path": "settings\/my.sql",
          "dir": false,
          "file": true,
          "perms": "0755",
          "size": 47031,
          "sha1": "7e6d49df3291fc3e4724db1f3e2fac076109cd02"
        },
        {
          "path": "settings\/content.php",
          "dir": false,
          "file": true,
          "perms": "0644",
          "size": 7397,
          "sha1": "8664181468c6410250efac617991630f33926b92"
        },
        {
          "path": "settings\/my-upgrade-4.0.2-4.0.3.sql",
          "dir": false,
          "file": true,
          "perms": "0644",
          "size": 752,
          "sha1": "3ab8ef4c77c286cbcd4791f1d7dc9b7fec7700c6"
        },
        {
          "path": "settings\/manifest.php",
          "dir": false,
          "file": true,
          "perms": "0644",
          "size": 5134,
          "sha1": "e456f38cfdc8b8eb2a1d2a961270e50ae5a72490"
        },
        {
          "path": "settings\/my-upgrade-4.0.4-4.0.5.sql",
          "dir": false,
          "file": true,
          "perms": "0644",
          "size": 436,
          "sha1": "e1e28d4fb43b7b5ccc503944787c40bee171ffd9"
        },
        {
          "path": "settings\/my-upgrade-4.0.0rc1-4.0.0rc2.sql",
          "dir": false,
          "file": true,
          "perms": "0644",
          "size": 449,
          "sha1": "8bee2d1317cfb662d700897761200b09b9c4595b"
        },
        {
          "path": "settings\/my-upgrade-4.8.6-4.8.7.sql",
          "dir": false,
          "file": true,
          "perms": "0644",
          "size": 410,
          "sha1": "b8a45ecb8fa88e464ac42013f34531e4c7af324d"
        },
        {
          "path": "settings\/my-upgrade-4.1.4-4.1.5.sql",
          "dir": false,
          "file": true,
          "perms": "0644",
          "size": 186,
          "sha1": "68a1848472842c50a4045b6db3039553533badd6"
        },
        {
          "path": "settings\/my-upgrade-4.2.8-4.3.0.sql",
          "dir": false,
          "file": true,
          "perms": "0644",
          "size": 92,
          "sha1": "16a97f1e6bce73c58b87aad635842e3009a69684"
        },
        {
          "path": "settings\/my-upgrade-4.1.2-4.1.3.sql",
          "dir": false,
          "file": true,
          "perms": "0644",
          "size": 107,
          "sha1": "ab603e933999f0e546da2c61b5a5560482342470"
        },
        {
          "path": "settings\/my-upgrade-4.10.0beta1-4.10.0beta2.sql",
          "dir": false,
          "file": true,
          "perms": "0644",
          "size": 84,
          "sha1": "15657276df867f79277e8566fca05550903cd70a"
        },
        {
          "path": "settings\/my-upgrade-4.0.1-4.0.2.sql",
          "dir": false,
          "file": true,
          "perms": "0644",
          "size": 6017,
          "sha1": "a22ef68b392cfbcdd365e2335f8dff8648149044"
        },
        {
          "path": "settings\/my-upgrade-5.3.3-5.4.0.sql",
          "dir": false,
          "file": true,
          "perms": "0644",
          "size": 606,
          "sha1": "727dc6d4cc1b149116eae80704aa003918db9ea8"
        },
        {
          "path": "settings\/my-upgrade-4.9.4p4-4.10.0beta1.sql",
          "dir": false,
          "file": true,
          "perms": "0644",
          "size": 722,
          "sha1": "8b615eb4003a5e3083417a322a02519967c3c257"
        },
        {
          "path": "settings\/my-upgrade-4.1.5-4.1.6.sql",
          "dir": false,
          "file": true,
          "perms": "0644",
          "size": 1679,
          "sha1": "7fa9d43497e564240e006c9f7e63001e13955650"
        },
        {
          "path": "settings\/my-upgrade-4.0.3p1-4.0.4.sql",
          "dir": false,
          "file": true,
          "perms": "0644",
          "size": 2482,
          "sha1": "03bdad12757cc428712b94459e19405f3d9109d2"
        },
        {
          "path": "settings\/my-upgrade-4.10.0rc1-4.10.0.sql",
          "dir": false,
          "file": true,
          "perms": "0644",
          "size": 231,
          "sha1": "7f290050ea01625114aa3089456c3f62673960d1"
        },
        {
          "path": "settings\/my-upgrade-4.1.3-4.1.4.sql",
          "dir": false,
          "file": true,
          "perms": "0644",
          "size": 1005,
          "sha1": "3141293bea4a991651635b20cdeecfbe2756c85e"
        },
        {
          "path": "settings\/my-upgrade-4.1.8p1-4.2.0.sql",
          "dir": false,
          "file": true,
          "perms": "0644",
          "size": 227,
          "sha1": "828124395fef9f330af889271932d5b1d4a7f90d"
        },
        {
          "path": "settings\/my-upgrade-5.2.1-5.3.0.sql",
          "dir": false,
          "file": true,
          "perms": "0644",
          "size": 1012,
          "sha1": "919edbd0a49da55f27c61b807bd2b85fcf759d9c"
        },
        {
          "path": "settings\/my-upgrade-4.10.4-4.10.5.sql",
          "dir": false,
          "file": true,
          "perms": "0644",
          "size": 566,
          "sha1": "458310d1a88345188a6fcdde4874e3227d4c27c8"
        },
        {
          "path": "Form",
          "dir": true,
          "file": false,
          "perms": "0755",
          "size": 448,
          "sha1": null
        },
        {
          "path": "Form\/Settings",
          "dir": true,
          "file": false,
          "perms": "0755",
          "size": 224,
          "sha1": null
        },
        {
          "path": "Form\/Settings\/Privacy.php",
          "dir": false,
          "file": true,
          "perms": "0644",
          "size": 19606,
          "sha1": "fe0c5e6aa4c04878549f139936dc2efa0f59981c"
        },
        {
          "path": "Form\/Settings\/Password.php",
          "dir": false,
          "file": true,
          "perms": "0644",
          "size": 4259,
          "sha1": "44bdb3ba899016a7da352f091bd324d6830dd07a"
        },
        {
          "path": "Form\/Settings\/Delete.php",
          "dir": false,
          "file": true,
          "perms": "0644",
          "size": 1983,
          "sha1": "897cdb659a0cfd02a76e6e191189b4a240f40351"
        },
        {
          "path": "Form\/Settings\/Network.php",
          "dir": false,
          "file": true,
          "perms": "0644",
          "size": 1115,
          "sha1": "bd422500187c8b0dbae9bb406473bbd4b00dc539"
        },
        {
          "path": "Form\/Settings\/General.php",
          "dir": false,
          "file": true,
          "perms": "0644",
          "size": 8911,
          "sha1": "f4293bc7ca461fa900baa4b9caee6c2ae043bfd3"
        },
        {
          "path": "Form\/Login.php",
          "dir": false,
          "file": true,
          "perms": "0644",
          "size": 4317,
          "sha1": "3771d9fae043d2980340b6b62e049f3b69250eca"
        },
        {
          "path": "Form\/Auth",
          "dir": true,
          "file": false,
          "perms": "0755",
          "size": 128,
          "sha1": null
        },
        {
          "path": "Form\/Auth\/Reset.php",
          "dir": false,
          "file": true,
          "perms": "0644",
          "size": 4376,
          "sha1": "123b2e4fe837d34542e2c31b831bcb2759796be8"
        },
        {
          "path": "Form\/Auth\/Forgot.php",
          "dir": false,
          "file": true,
          "perms": "0644",
          "size": 1820,
          "sha1": "deca3af466f2f0fa7131483b5c20b3da004c8933"
        },
        {
          "path": "Form\/Activity",
          "dir": true,
          "file": false,
          "perms": "0755",
          "size": 96,
          "sha1": null
        },
        {
          "path": "Form\/Activity\/Post.php",
          "dir": false,
          "file": true,
          "perms": "0644",
          "size": 1932,
          "sha1": "2e57b0aff6b941501bf66247aac8ba43ecc1cfde"
        },
        {
          "path": "Form\/Signup",
          "dir": true,
          "file": false,
          "perms": "0755",
          "size": 224,
          "sha1": null
        },
        {
          "path": "Form\/Signup\/Fields.php",
          "dir": false,
          "file": true,
          "perms": "0644",
          "size": 754,
          "sha1": "4ccc31d48d9c33ded173ff3cb139745cffb143da"
        },
        {
          "path": "Form\/Signup\/Otp.php",
          "dir": false,
          "file": true,
          "perms": "0644",
          "size": 1203,
          "sha1": "7051e9a72d13dcbc5e980c365e171096cfc3e422"
        },
        {
          "path": "Form\/Signup\/Account.php",
          "dir": false,
          "file": true,
          "perms": "0644",
          "size": 18479,
          "sha1": "cfa831e64936ce2a362999146b517d355cbdc6f1"
        },
        {
          "path": "Form\/Signup\/Invite.php",
          "dir": false,
          "file": true,
          "perms": "0644",
          "size": 3658,
          "sha1": "dada3bcbcb24e0cd280b3c1ecaa5be6f5e83c770"
        },
        {
          "path": "Form\/Signup\/Photo.php",
          "dir": false,
          "file": true,
          "perms": "0644",
          "size": 2437,
          "sha1": "d80e72e183825e5fad6f4d7b8a9437114d7df74e"
        },
        {
          "path": "Form\/Admin",
          "dir": true,
          "file": false,
          "perms": "0755",
          "size": 224,
          "sha1": null
        },
        {
          "path": "Form\/Admin\/Settings",
          "dir": true,
          "file": false,
          "perms": "0755",
          "size": 128,
          "sha1": null
        },
        {
          "path": "Form\/Admin\/Settings\/Friends.php",
          "dir": false,
          "file": true,
          "perms": "0644",
          "size": 8289,
          "sha1": "59e6d150bc6e8bfa1ad041b753785dc292325f43"
        },
        {
          "path": "Form\/Admin\/Settings\/Level.php",
          "dir": false,
          "file": true,
          "perms": "0644",
          "size": 4297,
          "sha1": "abba82fe5acc8d58b23ca2d225f56ec58c3f0b63"
        },
        {
          "path": "Form\/Admin\/Signup",
          "dir": true,
          "file": false,
          "perms": "0755",
          "size": 224,
          "sha1": null
        },
        {
          "path": "Form\/Admin\/Signup\/Fields.php",
          "dir": false,
          "file": true,
          "perms": "0644",
          "size": 1586,
          "sha1": "dcbbd6572fb9fd64f1b0bbe8bc0acd8c712dae09"
        },
        {
          "path": "Form\/Admin\/Signup\/Otp.php",
          "dir": false,
          "file": true,
          "perms": "0644",
          "size": 1627,
          "sha1": "4d7422b9eeded93f94904fa221d2f84528b700f2"
        },
        {
          "path": "Form\/Admin\/Signup\/Account.php",
          "dir": false,
          "file": true,
          "perms": "0644",
          "size": 6440,
          "sha1": "894ad0184232f89043af503156ef203f17b79a49"
        },
        {
          "path": "Form\/Admin\/Signup\/Invite.php",
          "dir": false,
          "file": true,
          "perms": "0644",
          "size": 1819,
          "sha1": "33e7e3e219adb4893484452ef0961c6e238b48c1"
        },
        {
          "path": "Form\/Admin\/Signup\/Photo.php",
          "dir": false,
          "file": true,
          "perms": "0644",
          "size": 2447,
          "sha1": "d3087f81297adbaeedaebeb2f8a3852b1dff9377"
        },
        {
          "path": "Form\/Admin\/Twitter.php",
          "dir": false,
          "file": true,
          "perms": "0644",
          "size": 2690,
          "sha1": "5119183cc29c81083d587ecacb18f678eb5a0469"
        },
        {
          "path": "Form\/Admin\/Manage",
          "dir": true,
          "file": false,
          "perms": "0755",
          "size": 224,
          "sha1": null
        },
        {
          "path": "Form\/Admin\/Manage\/Login.php",
          "dir": false,
          "file": true,
          "perms": "0644",
          "size": 3843,
          "sha1": "e6dd941a14a0606888f0ff9763193950367a1d11"
        },
        {
          "path": "Form\/Admin\/Manage\/Resendemail.php",
          "dir": false,
          "file": true,
          "perms": "0644",
          "size": 1359,
          "sha1": "5856f39d893714420be5dd7919700b78b3954d5d"
        },
        {
          "path": "Form\/Admin\/Manage\/Filter.php",
          "dir": false,
          "file": true,
          "perms": "0644",
          "size": 3799,
          "sha1": "46dbbeabe41ed83c4089e1991d4c4e3d6650e6d3"
        },
        {
          "path": "Form\/Admin\/Manage\/Delete.php",
          "dir": false,
          "file": true,
          "perms": "0644",
          "size": 1357,
          "sha1": "7df181f47f51a79bbb5c345d031ae097af755aab"
        },
        {
          "path": "Form\/Admin\/Manage\/Edit.php",
          "dir": false,
          "file": true,
          "perms": "0644",
          "size": 4500,
          "sha1": "872f02f80a54b6ef53e337c8bda6cca3d5f38d0b"
        },
        {
          "path": "Form\/Admin\/Facebook.php",
          "dir": false,
          "file": true,
          "perms": "0644",
          "size": 2671,
          "sha1": "6ab2fb528aeee6aebad5d7f7cbafd92499e6bde2"
        },
        {
          "path": "Form\/Search.php",
          "dir": false,
          "file": true,
          "perms": "0644",
          "size": 3574,
          "sha1": "d55a70ff82d2e2820eac69034686f561d63057d5"
        },
        {
          "path": "Form\/Friends.php",
          "dir": false,
          "file": true,
          "perms": "0644",
          "size": 726,
          "sha1": "1bddb91f0f5576bb1990843965ea623566d7e98f"
        },
        {
          "path": "Form\/Edit",
          "dir": true,
          "file": false,
          "perms": "0755",
          "size": 192,
          "sha1": null
        },
        {
          "path": "Form\/Edit\/Photo.php",
          "dir": false,
          "file": true,
          "perms": "0644",
          "size": 2121,
          "sha1": "0c8bdea991a56ae79f5748aaeadf3597f8006c25"
        },
        {
          "path": "Form\/Edit\/RemovePhoto.php",
          "dir": false,
          "file": true,
          "perms": "0644",
          "size": 1451,
          "sha1": "f0256f6cad6ad68c3008e1eb651890fc6d497cd9"
        },
        {
          "path": "Form\/Edit\/Style.php",
          "dir": false,
          "file": true,
          "perms": "0644",
          "size": 920,
          "sha1": "f83fd585c1ce7ea0a0149375bf34fa928a5721d9"
        },
        {
          "path": "Form\/Edit\/ExternalPhoto.php",
          "dir": false,
          "file": true,
          "perms": "0644",
          "size": 1255,
          "sha1": "256085576ee5cd319dba5a2f2d2d58834cb5a681"
        },
        {
          "path": "Form\/Friends",
          "dir": true,
          "file": false,
          "perms": "0755",
          "size": 224,
          "sha1": null
        },
        {
          "path": "Form\/Friends\/Add.php",
          "dir": false,
          "file": true,
          "perms": "0644",
          "size": 1328,
          "sha1": "56c88806c123a3c5b684816c59bad85ae506d276"
        },
        {
          "path": "Form\/Friends\/Cancel.php",
          "dir": false,
          "file": true,
          "perms": "0644",
          "size": 1345,
          "sha1": "e8230ac3668da90ddb86017e736bdceb75852448"
        },
        {
          "path": "Form\/Friends\/Confirm.php",
          "dir": false,
          "file": true,
          "perms": "0644",
          "size": 1348,
          "sha1": "88ac2936bd4c55d35f03263044ce11b6aae4289a"
        },
        {
          "path": "Form\/Friends\/Reject.php",
          "dir": false,
          "file": true,
          "perms": "0644",
          "size": 1343,
          "sha1": "14acfa3d1a84aabd3ad2103a62f9c1f0b5751ae5"
        },
        {
          "path": "Form\/Friends\/Remove.php",
          "dir": false,
          "file": true,
          "perms": "0644",
          "size": 1349,
          "sha1": "073e1007c78a85948b3d38b8d19a46186d478ae0"
        },
        {
          "path": "Form\/CoverPhoto",
          "dir": true,
          "file": false,
          "perms": "0755",
          "size": 96,
          "sha1": null
        },
        {
          "path": "Form\/CoverPhoto\/Cover.php",
          "dir": false,
          "file": true,
          "perms": "0644",
          "size": 1111,
          "sha1": "67b703993c6603348e0237d5f0e03c9687cbec1d"
        },
        {
          "path": "Form\/Block",
          "dir": true,
          "file": false,
          "perms": "0755",
          "size": 128,
          "sha1": null
        },
        {
          "path": "Form\/Block\/Add.php",
          "dir": false,
          "file": true,
          "perms": "0644",
          "size": 1372,
          "sha1": "af8ef84e10375d4db57de35e5e3a66a70cce14f7"
        },
        {
          "path": "Form\/Block\/Remove.php",
          "dir": false,
          "file": true,
          "perms": "0644",
          "size": 1385,
          "sha1": "bc407f0aeb73ed2c8e548f25b2f91a0c0ab4703c"
        },
        {
          "path": "externals",
          "dir": true,
          "file": false,
          "perms": "0755",
          "size": 224,
          "sha1": null
        },
        {
          "path": "externals\/images",
          "dir": true,
          "file": false,
          "perms": "0755",
          "size": 384,
          "sha1": null
        },
        {
          "path": "externals\/images\/admin",
          "dir": true,
          "file": false,
          "perms": "0755",
          "size": 96,
          "sha1": null
        },
        {
          "path": "externals\/images\/admin\/friends",
          "dir": true,
          "file": false,
          "perms": "0755",
          "size": 128,
          "sha1": null
        },
        {
          "path": "externals\/images\/admin\/friends\/add.png",
          "dir": false,
          "file": true,
          "perms": "0644",
          "size": 746,
          "sha1": "56a6f12c36ef9e5220b070830a3d36b23450ff22"
        },
        {
          "path": "externals\/images\/admin\/friends\/remove.png",
          "dir": false,
          "file": true,
          "perms": "0644",
          "size": 767,
          "sha1": "7c9dfd9e984a91c5c56f0ec9b77bebcf6da3f9a2"
        },
        {
          "path": "externals\/images\/nophoto_user_thumb_profile.png",
          "dir": false,
          "file": true,
          "perms": "0644",
          "size": 19892,
          "sha1": "5feb60d54b7703ca627c99943ac7ab5b48acb46e"
        },
        {
          "path": "externals\/images\/janrain",
          "dir": true,
          "file": false,
          "perms": "0755",
          "size": 864,
          "sha1": null
        },
        {
          "path": "externals\/images\/janrain\/orkut.png",
          "dir": false,
          "file": true,
          "perms": "0644",
          "size": 688,
          "sha1": "666a95126d1b4439e608e21e27d92ff4630f447f"
        },
        {
          "path": "externals\/images\/janrain\/salesforce.png",
          "dir": false,
          "file": true,
          "perms": "0644",
          "size": 698,
          "sha1": "c69e7e3d1fad0c25e0bad4ac2227d852ae2aa78b"
        },
        {
          "path": "externals\/images\/janrain\/blogger.png",
          "dir": false,
          "file": true,
          "perms": "0644",
          "size": 273,
          "sha1": "085cf8851aa7d486b728f5fe42e82e0cf765bb7e"
        },
        {
          "path": "externals\/images\/janrain\/mixi.png",
          "dir": false,
          "file": true,
          "perms": "0644",
          "size": 668,
          "sha1": "5ce7a44a1e1b36855bcb0ce7e03026e2d559b753"
        },
        {
          "path": "externals\/images\/janrain\/myspace.png",
          "dir": false,
          "file": true,
          "perms": "0644",
          "size": 362,
          "sha1": "134df9b0f0842e9d5dcdaf0d2f3a2023f64988b9"
        },
        {
          "path": "externals\/images\/janrain\/openid.png",
          "dir": false,
          "file": true,
          "perms": "0644",
          "size": 393,
          "sha1": "4a6ea6373c1642270058cd419ed5eccf9cdeee4d"
        },
        {
          "path": "externals\/images\/janrain\/vzn.png",
          "dir": false,
          "file": true,
          "perms": "0644",
          "size": 854,
          "sha1": "336214a505c712f6100fef2ed24342d621d156ec"
        },
        {
          "path": "externals\/images\/janrain\/myopenid.png",
          "dir": false,
          "file": true,
          "perms": "0644",
          "size": 556,
          "sha1": "fca1bb3e19a68ffaf7c7508b1a41c0a09a35c4f6"
        },
        {
          "path": "externals\/images\/janrain\/foursquare.png",
          "dir": false,
          "file": true,
          "perms": "0644",
          "size": 819,
          "sha1": "7f3172e7e45c9d11880313676925c3073571f78a"
        },
        {
          "path": "externals\/images\/janrain\/google_old.png",
          "dir": false,
          "file": true,
          "perms": "0755",
          "size": 909,
          "sha1": "806c808b11d76df7c2eefcb88820d8aa5980b9e4"
        },
        {
          "path": "externals\/images\/janrain\/flickr.png",
          "dir": false,
          "file": true,
          "perms": "0644",
          "size": 329,
          "sha1": "8716644768a536eb00eb95b3e49f740d8ea46105"
        },
        {
          "path": "externals\/images\/janrain\/wordpress.png",
          "dir": false,
          "file": true,
          "perms": "0644",
          "size": 355,
          "sha1": "4ae94ae7045b3ee852e52c409cecb1c8869ed378"
        },
        {
          "path": "externals\/images\/janrain\/twitter.png",
          "dir": false,
          "file": true,
          "perms": "0644",
          "size": 653,
          "sha1": "62b0e2e3f9649b210991c99e9033b9ddf282842e"
        },
        {
          "path": "externals\/images\/janrain\/linkedin.png",
          "dir": false,
          "file": true,
          "perms": "0644",
          "size": 757,
          "sha1": "3490188cf023cd0312cff3161100c3e375180955"
        },
        {
          "path": "externals\/images\/janrain\/aol.png",
          "dir": false,
          "file": true,
          "perms": "0644",
          "size": 425,
          "sha1": "e6ea2c5fc4cb8e47fc23f96be512162efd42ce6c"
        },
        {
          "path": "externals\/images\/janrain\/live_id.png",
          "dir": false,
          "file": true,
          "perms": "0644",
          "size": 794,
          "sha1": "8a78c0cf086217612f1b37a670c57a1e7999d8e9"
        },
        {
          "path": "externals\/images\/janrain\/verisign.png",
          "dir": false,
          "file": true,
          "perms": "0644",
          "size": 762,
          "sha1": "71450ff9f548310efe507e0ba0d6c8d68d296ccd"
        },
        {
          "path": "externals\/images\/janrain\/yahoo.png",
          "dir": false,
          "file": true,
          "perms": "0644",
          "size": 270,
          "sha1": "799c8b72d739241350442a87870d629073bc4a35"
        },
        {
          "path": "externals\/images\/janrain\/livejournal.png",
          "dir": false,
          "file": true,
          "perms": "0644",
          "size": 556,
          "sha1": "7379f4ba26da996f42c7bdc15e91b92ffd437677"
        },
        {
          "path": "externals\/images\/janrain\/google.png",
          "dir": false,
          "file": true,
          "perms": "0644",
          "size": 4205,
          "sha1": "a0f490a6656de68853e2ba4121bf718f286d8230"
        },
        {
          "path": "externals\/images\/janrain\/facebook.png",
          "dir": false,
          "file": true,
          "perms": "0644",
          "size": 219,
          "sha1": "9ee14460bd612bef65ba62ba3bf0a0d41df995b7"
        },
        {
          "path": "externals\/images\/janrain\/paypal.png",
          "dir": false,
          "file": true,
          "perms": "0644",
          "size": 490,
          "sha1": "9522f1b99a05dcd42cf453cd5f59e6867c3d8ace"
        },
        {
          "path": "externals\/images\/janrain\/googleplus.png",
          "dir": false,
          "file": true,
          "perms": "0644",
          "size": 788,
          "sha1": "98c6f12f82ecfcccd6c3d53c2730bfdbf2301d74"
        },
        {
          "path": "externals\/images\/janrain\/hyves.png",
          "dir": false,
          "file": true,
          "perms": "0644",
          "size": 678,
          "sha1": "f78b73141242dc10367bef90a37f28dceeb0ae37"
        },
        {
          "path": "externals\/images\/janrain\/netlog.png",
          "dir": false,
          "file": true,
          "perms": "0644",
          "size": 293,
          "sha1": "42a15b4bc9d1cd4791e27f9fc6fbc34c86296ae5"
        },
        {
          "path": "externals\/images\/login-bg.jpg",
          "dir": false,
          "file": true,
          "perms": "0644",
          "size": 64469,
          "sha1": "8a7759649e731fb64df7ab8c9197a6828f97b93f"
        },
        {
          "path": "externals\/images\/nophoto_user_thumb_icon.png",
          "dir": false,
          "file": true,
          "perms": "0644",
          "size": 712,
          "sha1": "8816a51ff81ea44adbd621079c14f5870393ec17"
        },
        {
          "path": "externals\/images\/facebook-sign-in.png",
          "dir": false,
          "file": true,
          "perms": "0644",
          "size": 3630,
          "sha1": "223da5a7319ea1bc2d9faddbfc6c1d35f22b1c41"
        },
        {
          "path": "externals\/images\/nophoto_user_thumb_icon.bak.png",
          "dir": false,
          "file": true,
          "perms": "0644",
          "size": 712,
          "sha1": "8816a51ff81ea44adbd621079c14f5870393ec17"
        },
        {
          "path": "externals\/images\/twitter-sign-in.png",
          "dir": false,
          "file": true,
          "perms": "0644",
          "size": 3524,
          "sha1": "884a1aa9920271b956a36e05c7ead0575f2b57af"
        },
        {
          "path": "externals\/images\/google-sign-in.png",
          "dir": false,
          "file": true,
          "perms": "0644",
          "size": 8756,
          "sha1": "4d629a69cf84c1405a09d0b19b91a3ee564e3a8b"
        },
        {
          "path": "externals\/images\/privatephoto_user_thumb_profile.png",
          "dir": false,
          "file": true,
          "perms": "0644",
          "size": 28771,
          "sha1": "78b9d6489f19b29feffca97b046dbb82c33095d5"
        },
        {
          "path": "externals\/html",
          "dir": true,
          "file": false,
          "perms": "0755",
          "size": 96,
          "sha1": null
        },
        {
          "path": "externals\/html\/channel.html",
          "dir": false,
          "file": true,
          "perms": "0644",
          "size": 59,
          "sha1": "78919e3cff76f1012bf7077351e890bdf481273b"
        },
        {
          "path": "externals\/styles",
          "dir": true,
          "file": false,
          "perms": "0755",
          "size": 160,
          "sha1": null
        },
        {
          "path": "externals\/styles\/admin",
          "dir": true,
          "file": false,
          "perms": "0755",
          "size": 96,
          "sha1": null
        },
        {
          "path": "externals\/styles\/admin\/main.css",
          "dir": false,
          "file": true,
          "perms": "0644",
          "size": 387,
          "sha1": "dd28fa6f9dafeca7ec3da5ad877b5b9a7bc26bf3"
        },
        {
          "path": "externals\/styles\/main.css",
          "dir": false,
          "file": true,
          "perms": "0644",
          "size": 35610,
          "sha1": "ea0a966e79f1925b6c198f415a4b6d6d33b3ab83"
        },
        {
          "path": "externals\/styles\/mobile.css",
          "dir": false,
          "file": true,
          "perms": "0644",
          "size": 20183,
          "sha1": "a586908f7a09b6e26d42beb3269eafc0b6f51c65"
        },
        {
          "path": "externals\/scripts",
          "dir": true,
          "file": false,
          "perms": "0755",
          "size": 160,
          "sha1": null
        },
        {
          "path": "externals\/scripts\/core.js",
          "dir": false,
          "file": true,
          "perms": "0755",
          "size": 8649,
          "sha1": "fcee0f52238982dee97f2f65493778b8c8e819c5"
        },
        {
          "path": "externals\/scripts\/composer_facebook.js",
          "dir": false,
          "file": true,
          "perms": "0644",
          "size": 2031,
          "sha1": "0ebf8be3e860b6875d6cd796d64392a458c66c50"
        },
        {
          "path": "externals\/scripts\/composer_twitter.js",
          "dir": false,
          "file": true,
          "perms": "0644",
          "size": 1974,
          "sha1": "4ff4b2165b94fc905dc27ca1eb36b82375eed776"
        },
        {
          "path": "externals\/.htaccess",
          "dir": false,
          "file": true,
          "perms": "0644",
          "size": 1042,
          "sha1": "6c835f103d253edf70bfd5ba2430ebe3fa8cacdd"
        },
        {
          "path": "Plugin",
          "dir": true,
          "file": false,
          "perms": "0755",
          "size": 256,
          "sha1": null
        },
        {
          "path": "Plugin\/Activity",
          "dir": true,
          "file": false,
          "perms": "0755",
          "size": 96,
          "sha1": null
        },
        {
          "path": "Plugin\/Activity\/Request.php",
          "dir": false,
          "file": true,
          "perms": "0644",
          "size": 908,
          "sha1": "9b980a892db781871627bdf8e46dfdae3cf492fd"
        },
        {
          "path": "Plugin\/Signup",
          "dir": true,
          "file": false,
          "perms": "0755",
          "size": 224,
          "sha1": null
        },
        {
          "path": "Plugin\/Signup\/Fields.php",
          "dir": false,
          "file": true,
          "perms": "0644",
          "size": 7688,
          "sha1": "3017b6a2cda8785ac7ec61cf699f14f33b0fdb5c"
        },
        {
          "path": "Plugin\/Signup\/Otp.php",
          "dir": false,
          "file": true,
          "perms": "0644",
          "size": 1971,
          "sha1": "a5a8dd3854c485566b36237f17c6fc2774666aa0"
        },
        {
          "path": "Plugin\/Signup\/Account.php",
          "dir": false,
          "file": true,
          "perms": "0644",
          "size": 14559,
          "sha1": "09a7a6d4e57f29d273fe859fdcb7f02c10439679"
        },
        {
          "path": "Plugin\/Signup\/Invite.php",
          "dir": false,
          "file": true,
          "perms": "0644",
          "size": 2616,
          "sha1": "ebc494beabb2ea2b61b3caba6bb495fca0368324"
        },
        {
          "path": "Plugin\/Signup\/Photo.php",
          "dir": false,
          "file": true,
          "perms": "0644",
          "size": 11149,
          "sha1": "982f68ada69c018dee70e60455f938b5b4bb4aad"
        },
        {
          "path": "Plugin\/Menus.php",
          "dir": false,
          "file": true,
          "perms": "0644",
          "size": 14681,
          "sha1": "5b14f8b1f53b8b35f54746ed45fd2304b9a7eb84"
        },
        {
          "path": "Plugin\/Task",
          "dir": true,
          "file": false,
          "perms": "0755",
          "size": 96,
          "sha1": null
        },
        {
          "path": "Plugin\/Task\/Cleanup.php",
          "dir": false,
          "file": true,
          "perms": "0644",
          "size": 953,
          "sha1": "b495ddbba68490aaec1b643b05836cc354c930e6"
        },
        {
          "path": "Plugin\/Job",
          "dir": true,
          "file": false,
          "perms": "0755",
          "size": 96,
          "sha1": null
        },
        {
          "path": "Plugin\/Job\/Maintenance",
          "dir": true,
          "file": false,
          "perms": "0755",
          "size": 96,
          "sha1": null
        },
        {
          "path": "Plugin\/Job\/Maintenance\/RebuildPrivacy.php",
          "dir": false,
          "file": true,
          "perms": "0644",
          "size": 4062,
          "sha1": "f6da6c67abd3b5d465f5e877a8dcb9d93278d39a"
        },
        {
          "path": "Plugin\/Core.php",
          "dir": false,
          "file": true,
          "perms": "0644",
          "size": 7972,
          "sha1": "4eb22256f7beee775ee4490c506f038c6d2668bf"
        },
        {
          "path": "Bootstrap.php",
          "dir": false,
          "file": true,
          "perms": "0644",
          "size": 1406,
          "sha1": "c252167cdaf606afd90e2d4c0ae78aa834f7ca20"
        },
        {
          "path": "Model",
          "dir": true,
          "file": false,
          "perms": "0755",
          "size": 224,
          "sha1": null
        },
        {
          "path": "Model\/DbTable",
          "dir": true,
          "file": false,
          "perms": "0755",
          "size": 576,
          "sha1": null
        },
        {
          "path": "Model\/DbTable\/Codes.php",
          "dir": false,
          "file": true,
          "perms": "0644",
          "size": 1076,
          "sha1": "8fde05f5eca98dda517a1755381c1a2d79047065"
        },
        {
          "path": "Model\/DbTable\/Settings.php",
          "dir": false,
          "file": true,
          "perms": "0644",
          "size": 2876,
          "sha1": "2855be0b53b122db9e927bd21e6c633fb845760c"
        },
        {
          "path": "Model\/DbTable\/Comments.php",
          "dir": false,
          "file": true,
          "perms": "0644",
          "size": 513,
          "sha1": "c546d3705062b0a8a756c4e890a0b11eb431fd73"
        },
        {
          "path": "Model\/DbTable\/EmailSettings.php",
          "dir": false,
          "file": true,
          "perms": "0644",
          "size": 2985,
          "sha1": "406cd8484bb3db0ccfd59a16080f8397b085042e"
        },
        {
          "path": "Model\/DbTable\/Logins.php",
          "dir": false,
          "file": true,
          "perms": "0644",
          "size": 509,
          "sha1": "8aeff05beced09fee341c3dc21e92319b86a12d5"
        },
        {
          "path": "Model\/DbTable\/Block.php",
          "dir": false,
          "file": true,
          "perms": "0644",
          "size": 507,
          "sha1": "2d1f534c3eb7129d2e174b638d31b7e3a7baa852"
        },
        {
          "path": "Model\/DbTable\/Users.php",
          "dir": false,
          "file": true,
          "perms": "0644",
          "size": 1028,
          "sha1": "fd7abe7c84c093790fbecbcd24e102c4b5595991"
        },
        {
          "path": "Model\/DbTable\/Signup.php",
          "dir": false,
          "file": true,
          "perms": "0644",
          "size": 562,
          "sha1": "2264068b400f20afded051fd6da653df65f5bd73"
        },
        {
          "path": "Model\/DbTable\/Lists.php",
          "dir": false,
          "file": true,
          "perms": "0644",
          "size": 1915,
          "sha1": "0e27c5003fab92aebb08cfaef08110ce7574784e"
        },
        {
          "path": "Model\/DbTable\/Membership.php",
          "dir": false,
          "file": true,
          "perms": "0644",
          "size": 3508,
          "sha1": "5a24fb7f9260e1f8a3ee22f56433a13693915a10"
        },
        {
          "path": "Model\/DbTable\/Twitter.php",
          "dir": false,
          "file": true,
          "perms": "0644",
          "size": 4181,
          "sha1": "fbde5ad2a86738c3e41544fd7dfe3e4c689e209c"
        },
        {
          "path": "Model\/DbTable\/ListItems.php",
          "dir": false,
          "file": true,
          "perms": "0644",
          "size": 560,
          "sha1": "2fc6775c1f8f440793ea69b39159c86e8bcc9e31"
        },
        {
          "path": "Model\/DbTable\/Online.php",
          "dir": false,
          "file": true,
          "perms": "0644",
          "size": 2129,
          "sha1": "5f78ef891123333b34c101a0cd665a93d2899269"
        },
        {
          "path": "Model\/DbTable\/Verify.php",
          "dir": false,
          "file": true,
          "perms": "0644",
          "size": 1375,
          "sha1": "55570887c5882f6fbc7a6ae8b44dd1db5c94273e"
        },
        {
          "path": "Model\/DbTable\/Facebook.php",
          "dir": false,
          "file": true,
          "perms": "0644",
          "size": 4351,
          "sha1": "e1fd88f424ee1bb7ec4c39fe19831897c29b6281"
        },
        {
          "path": "Model\/DbTable\/Forgot.php",
          "dir": false,
          "file": true,
          "perms": "0644",
          "size": 700,
          "sha1": "191ba43e52b56953878a011866198c8335a1394e"
        },
        {
          "path": "Model\/User.php",
          "dir": false,
          "file": true,
          "perms": "0755",
          "size": 19495,
          "sha1": "b16369496b50ea7d6a8379a4e966bdd7657d717b"
        },
        {
          "path": "Model\/List.php",
          "dir": false,
          "file": true,
          "perms": "0644",
          "size": 790,
          "sha1": "8f6b43d606fcf2ef0ef9567c6b8e1acf01adb109"
        },
        {
          "path": "Model\/Exception.php",
          "dir": false,
          "file": true,
          "perms": "0644",
          "size": 504,
          "sha1": "0ef5a591675833278aea2046bf0461f0340189b0"
        },
        {
          "path": "Model\/ListItem.php",
          "dir": false,
          "file": true,
          "perms": "0644",
          "size": 509,
          "sha1": "8d2d5f5b38c50f73864f4733bae13a8bba344d80"
        },
        {
          "path": "View",
          "dir": true,
          "file": false,
          "perms": "0755",
          "size": 96,
          "sha1": null
        },
        {
          "path": "View\/Helper",
          "dir": true,
          "file": false,
          "perms": "0755",
          "size": 192,
          "sha1": null
        },
        {
          "path": "View\/Helper\/User.php",
          "dir": false,
          "file": true,
          "perms": "0644",
          "size": 716,
          "sha1": "5553f4c90a2bf3d762a206ac37ad10bb6b2fee3c"
        },
        {
          "path": "View\/Helper\/Friends.php",
          "dir": false,
          "file": true,
          "perms": "0644",
          "size": 3736,
          "sha1": "3433557e5b2c400811250294c1429e93a49b643a"
        },
        {
          "path": "View\/Helper\/UserFriendship.php",
          "dir": false,
          "file": true,
          "perms": "0644",
          "size": 4349,
          "sha1": "9ef5c039f159b361f852be021e1d018f4e137ea7"
        },
        {
          "path": "View\/Helper\/Viewer.php",
          "dir": false,
          "file": true,
          "perms": "0644",
          "size": 598,
          "sha1": "ddc024bc35f75246b21d1dfd11bc6e9976296fa7"
        },
        {
          "path": "Api",
          "dir": true,
          "file": false,
          "perms": "0755",
          "size": 96,
          "sha1": null
        },
        {
          "path": "Api\/Core.php",
          "dir": false,
          "file": true,
          "perms": "0644",
          "size": 8757,
          "sha1": "232260abe29aa1a28f18617bfed2ba7eaefe8d85"
        },
        {
          "path": "controllers",
          "dir": true,
          "file": false,
          "perms": "0755",
          "size": 544,
          "sha1": null
        },
        {
          "path": "controllers\/AuthController.php",
          "dir": false,
          "file": true,
          "perms": "0644",
          "size": 43942,
          "sha1": "178ad484395d42304813578489b698990a3df52e"
        },
        {
          "path": "controllers\/EditController.php",
          "dir": false,
          "file": true,
          "perms": "0755",
          "size": 25213,
          "sha1": "5ae3241e8d308b0f472f03e18f73cc3d1b010c7c"
        },
        {
          "path": "controllers\/AdminLoginsController.php",
          "dir": false,
          "file": true,
          "perms": "0644",
          "size": 4096,
          "sha1": "76e1bb5a59e8f262c25d272b87482ec8ab5ca2d0"
        },
        {
          "path": "controllers\/ProfileController.php",
          "dir": false,
          "file": true,
          "perms": "0644",
          "size": 2918,
          "sha1": "f11d176f76d6756a2a24814c70c114c5d8055934"
        },
        {
          "path": "controllers\/CoverphotoController.php",
          "dir": false,
          "file": true,
          "perms": "0644",
          "size": 27074,
          "sha1": "30173e0a06c45d897d93cab384cd00bc6b01b475"
        },
        {
          "path": "controllers\/AjaxController.php",
          "dir": false,
          "file": true,
          "perms": "0644",
          "size": 3370,
          "sha1": "1438240026cc9d03656612d4307efd859e34eab2"
        },
        {
          "path": "controllers\/AdminManageController.php",
          "dir": false,
          "file": true,
          "perms": "0644",
          "size": 14826,
          "sha1": "db815a33e1ee6e3f6e1c15a7981199c6c9286a15"
        },
        {
          "path": "controllers\/AdminFieldsController.php",
          "dir": false,
          "file": true,
          "perms": "0755",
          "size": 650,
          "sha1": "0592adfd570e001657116ff1087a82c225cfcab3"
        },
        {
          "path": "controllers\/AdminSignupController.php",
          "dir": false,
          "file": true,
          "perms": "0644",
          "size": 2691,
          "sha1": "d578017f792254220c2dc0f5739e494dd3f2b507"
        },
        {
          "path": "controllers\/IndexController.php",
          "dir": false,
          "file": true,
          "perms": "0644",
          "size": 7025,
          "sha1": "4c8017c1c8d110f8c40136262fb7078e1035b82f"
        },
        {
          "path": "controllers\/SettingsController.php",
          "dir": false,
          "file": true,
          "perms": "0644",
          "size": 31018,
          "sha1": "4e344b69606a9cc066b95845ee47efb8ed2c2adf"
        },
        {
          "path": "controllers\/FriendsController.php",
          "dir": false,
          "file": true,
          "perms": "0644",
          "size": 27966,
          "sha1": "6fb5a868c3732e864471bdecbc30d0191e5e812c"
        },
        {
          "path": "controllers\/BlockController.php",
          "dir": false,
          "file": true,
          "perms": "0644",
          "size": 4929,
          "sha1": "c167fdc31548d1bfb90bbee0ad375215e841d726"
        },
        {
          "path": "controllers\/SignupController.php",
          "dir": false,
          "file": true,
          "perms": "0644",
          "size": 12395,
          "sha1": "127a4d08c1df9d112a2e061f278e1678fd19e903"
        },
        {
          "path": "controllers\/AdminSettingsController.php",
          "dir": false,
          "file": true,
          "perms": "0644",
          "size": 7385,
          "sha1": "339a0d2b87650d5884b1b1ceb5f8381b9839c66d"
        },
        {
          "path": "views",
          "dir": true,
          "file": false,
          "perms": "0755",
          "size": 96,
          "sha1": null
        },
        {
          "path": "views\/scripts",
          "dir": true,
          "file": false,
          "perms": "0755",
          "size": 640,
          "sha1": null
        },
        {
          "path": "views\/scripts\/settings",
          "dir": true,
          "file": false,
          "perms": "0755",
          "size": 320,
          "sha1": null
        },
        {
          "path": "views\/scripts\/settings\/require-password.tpl",
          "dir": false,
          "file": true,
          "perms": "0644",
          "size": 426,
          "sha1": "ad42657ca7f472ce02911531cdd2d9da2c546a2d"
        },
        {
          "path": "views\/scripts\/settings\/notifications.tpl",
          "dir": false,
          "file": true,
          "perms": "0644",
          "size": 331,
          "sha1": "fb8b2a80bd69d166494c1b87f13905026d5649f2"
        },
        {
          "path": "views\/scripts\/settings\/delete.tpl",
          "dir": false,
          "file": true,
          "perms": "0644",
          "size": 555,
          "sha1": "72ffb4606396fedda5084e3d637550a9fcbc297f"
        },
        {
          "path": "views\/scripts\/settings\/privacy.tpl",
          "dir": false,
          "file": true,
          "perms": "0644",
          "size": 963,
          "sha1": "39570e8bbd5b094df6440e7e8f8ca1d2f631e955"
        },
        {
          "path": "views\/scripts\/settings\/password.tpl",
          "dir": false,
          "file": true,
          "perms": "0644",
          "size": 2224,
          "sha1": "43880207dc16f57bce8c2603881c46cace382184"
        },
        {
          "path": "views\/scripts\/settings\/network.tpl",
          "dir": false,
          "file": true,
          "perms": "0644",
          "size": 6108,
          "sha1": "dca5f2050e86de78b9f4475739ddef3758b8934c"
        },
        {
          "path": "views\/scripts\/settings\/emails.tpl",
          "dir": false,
          "file": true,
          "perms": "0644",
          "size": 925,
          "sha1": "ce95e5f83d146c09386313244f4953b7cfd4ea3a"
        },
        {
          "path": "views\/scripts\/settings\/general.tpl",
          "dir": false,
          "file": true,
          "perms": "0644",
          "size": 946,
          "sha1": "1cdb9e7ab2a7f48ab82419ea8b355a8f702a7735"
        },
        {
          "path": "views\/scripts\/admin-signup",
          "dir": true,
          "file": false,
          "perms": "0755",
          "size": 320,
          "sha1": null
        },
        {
          "path": "views\/scripts\/admin-signup\/fields.tpl",
          "dir": false,
          "file": true,
          "perms": "0644",
          "size": 353,
          "sha1": "581689c9fcfc486193a74420c37397fe33d3c3ae"
        },
        {
          "path": "views\/scripts\/admin-signup\/index.tpl",
          "dir": false,
          "file": true,
          "perms": "0644",
          "size": 3437,
          "sha1": "47468d4cca6b4fb9776484d875c678d4b76b4cd2"
        },
        {
          "path": "views\/scripts\/admin-signup\/enable.tpl",
          "dir": false,
          "file": true,
          "perms": "0644",
          "size": 391,
          "sha1": "a0aa46c5a9f2eb961a1262094eb40a62eb13c5bc"
        },
        {
          "path": "views\/scripts\/admin-signup\/account.tpl",
          "dir": false,
          "file": true,
          "perms": "0644",
          "size": 355,
          "sha1": "9bafc383b716525d6969cc412cdc055919c941c3"
        },
        {
          "path": "views\/scripts\/admin-signup\/invite.tpl",
          "dir": false,
          "file": true,
          "perms": "0644",
          "size": 353,
          "sha1": "03193b550797cbdfaae493ea5c3fb7dabb157344"
        },
        {
          "path": "views\/scripts\/admin-signup\/disable.tpl",
          "dir": false,
          "file": true,
          "perms": "0644",
          "size": 392,
          "sha1": "1d03af4a50708b5caaa115ddb348ea0e32378c79"
        },
        {
          "path": "views\/scripts\/admin-signup\/otp.tpl",
          "dir": false,
          "file": true,
          "perms": "0644",
          "size": 351,
          "sha1": "31b5e4b4ea6554559e4fa0ad23fd40f05f385ec5"
        },
        {
          "path": "views\/scripts\/admin-signup\/photo.tpl",
          "dir": false,
          "file": true,
          "perms": "0644",
          "size": 353,
          "sha1": "060853312159ac71132ff86d5604059a46b85b7c"
        },
        {
          "path": "views\/scripts\/auth",
          "dir": true,
          "file": false,
          "perms": "0755",
          "size": 256,
          "sha1": null
        },
        {
          "path": "views\/scripts\/auth\/login.tpl",
          "dir": false,
          "file": true,
          "perms": "0644",
          "size": 955,
          "sha1": "f37edad0985b74126ba51f09f7291351aed6d4eb"
        },
        {
          "path": "views\/scripts\/auth\/reset.tpl",
          "dir": false,
          "file": true,
          "perms": "0644",
          "size": 2380,
          "sha1": "341402af40f5f3b284f73449ef5160e08241cbe0"
        },
        {
          "path": "views\/scripts\/auth\/logout.tpl",
          "dir": false,
          "file": true,
          "perms": "0644",
          "size": 1918,
          "sha1": "f3f00735ae0db397f74b842bb676b8c0a1a5c79b"
        },
        {
          "path": "views\/scripts\/auth\/twitter.tpl",
          "dir": false,
          "file": true,
          "perms": "0644",
          "size": 375,
          "sha1": "a6c8c6b5eb2467f6187132115ba0770973e56bee"
        },
        {
          "path": "views\/scripts\/auth\/forgot.tpl",
          "dir": false,
          "file": true,
          "perms": "0644",
          "size": 528,
          "sha1": "e4e9455893de3bc0061aa6355cee6501d90ceda7"
        },
        {
          "path": "views\/scripts\/auth\/google.tpl",
          "dir": false,
          "file": true,
          "perms": "0644",
          "size": 291,
          "sha1": "03957745c9e7baf47a1625369e5de1c43d7fa1d5"
        },
        {
          "path": "views\/scripts\/signup",
          "dir": true,
          "file": false,
          "perms": "0755",
          "size": 256,
          "sha1": null
        },
        {
          "path": "views\/scripts\/signup\/index.tpl",
          "dir": false,
          "file": true,
          "perms": "0644",
          "size": 737,
          "sha1": "7a19d79b1146137330ee970bf75379bdad506046"
        },
        {
          "path": "views\/scripts\/signup\/form",
          "dir": true,
          "file": false,
          "perms": "0755",
          "size": 256,
          "sha1": null
        },
        {
          "path": "views\/scripts\/signup\/form\/fields.tpl",
          "dir": false,
          "file": true,
          "perms": "0644",
          "size": 585,
          "sha1": "5b16d84b9e4e462f37e3c9ad165216cbe3910bad"
        },
        {
          "path": "views\/scripts\/signup\/form\/account.tpl",
          "dir": false,
          "file": true,
          "perms": "0644",
          "size": 3059,
          "sha1": "32866788916e92ab341462aba43272c0a70f4c46"
        },
        {
          "path": "views\/scripts\/signup\/form\/invite.tpl",
          "dir": false,
          "file": true,
          "perms": "0644",
          "size": 357,
          "sha1": "3434b6da8f0b0318bb25abbe3b4ef705ba1700a2"
        },
        {
          "path": "views\/scripts\/signup\/form\/admin",
          "dir": true,
          "file": false,
          "perms": "0755",
          "size": 192,
          "sha1": null
        },
        {
          "path": "views\/scripts\/signup\/form\/admin\/fields.tpl",
          "dir": false,
          "file": true,
          "perms": "0644",
          "size": 489,
          "sha1": "b12bea7eeda85936d54a343ea763b23f401268aa"
        },
        {
          "path": "views\/scripts\/signup\/form\/admin\/account.tpl",
          "dir": false,
          "file": true,
          "perms": "0644",
          "size": 322,
          "sha1": "c17c278a3173882bd34715b5f1992f04cd97b9f2"
        },
        {
          "path": "views\/scripts\/signup\/form\/admin\/invite.tpl",
          "dir": false,
          "file": true,
          "perms": "0644",
          "size": 321,
          "sha1": "82f327da1ed698f2109735619f9f2d8ef5ce8f09"
        },
        {
          "path": "views\/scripts\/signup\/form\/admin\/photo.tpl",
          "dir": false,
          "file": true,
          "perms": "0644",
          "size": 321,
          "sha1": "fce001a2b6a05e24ef7629aacbdc6aaf9423c488"
        },
        {
          "path": "views\/scripts\/signup\/form\/otp.tpl",
          "dir": false,
          "file": true,
          "perms": "0644",
          "size": 326,
          "sha1": "48d043978fe8622adce0da575597ac98d3e4085d"
        },
        {
          "path": "views\/scripts\/signup\/form\/photo.tpl",
          "dir": false,
          "file": true,
          "perms": "0644",
          "size": 322,
          "sha1": "3ca355c5e5f6f6669c3bcfac9c6794e7439ee333"
        },
        {
          "path": "views\/scripts\/signup\/resend.tpl",
          "dir": false,
          "file": true,
          "perms": "0644",
          "size": 957,
          "sha1": "8d1d4a469bc57d7a753212f3b23b6012af79f271"
        },
        {
          "path": "views\/scripts\/signup\/complete.tpl",
          "dir": false,
          "file": true,
          "perms": "0644",
          "size": 334,
          "sha1": "0d3803d019f1c077f051edc0e096c65641e8f46c"
        },
        {
          "path": "views\/scripts\/signup\/confirm.tpl",
          "dir": false,
          "file": true,
          "perms": "0644",
          "size": 1207,
          "sha1": "31368f02dbd12fea0bd657037ef9d498bd966384"
        },
        {
          "path": "views\/scripts\/signup\/verify.tpl",
          "dir": false,
          "file": true,
          "perms": "0644",
          "size": 831,
          "sha1": "ed729df5d83daa0a5ab9ef21d09318d72553cff3"
        },
        {
          "path": "views\/scripts\/_formSignupImage.tpl",
          "dir": false,
          "file": true,
          "perms": "0644",
          "size": 4224,
          "sha1": "a265ffc0facae21bc1ec89d3e7b4fcc601907975"
        },
        {
          "path": "views\/scripts\/edit",
          "dir": true,
          "file": false,
          "perms": "0755",
          "size": 320,
          "sha1": null
        },
        {
          "path": "views\/scripts\/edit\/profile-photos.tpl",
          "dir": false,
          "file": true,
          "perms": "0644",
          "size": 5624,
          "sha1": "4fba9684de6e7fce8a67358af32d6db58340000b"
        },
        {
          "path": "views\/scripts\/edit\/post.tpl",
          "dir": false,
          "file": true,
          "perms": "0644",
          "size": 319,
          "sha1": "6d780fb6b6da8cce40b8877e92e38c8b47ae503a"
        },
        {
          "path": "views\/scripts\/edit\/remove-photo.tpl",
          "dir": false,
          "file": true,
          "perms": "0644",
          "size": 328,
          "sha1": "2e35d03f1d49eaefdc8fb74fd79fb4fc2caea7af"
        },
        {
          "path": "views\/scripts\/edit\/profile.tpl",
          "dir": false,
          "file": true,
          "perms": "0644",
          "size": 1560,
          "sha1": "98415988d928372586111b7650e32ec809a43499"
        },
        {
          "path": "views\/scripts\/edit\/photo.tpl",
          "dir": false,
          "file": true,
          "perms": "0644",
          "size": 1805,
          "sha1": "c3a1f82b2e8f2193c3f8486a88d030b5c3fd7d53"
        },
        {
          "path": "views\/scripts\/edit\/external-photo.tpl",
          "dir": false,
          "file": true,
          "perms": "0644",
          "size": 456,
          "sha1": "ed62bb7f98498c6c6dbde26f48f86ea427513c39"
        },
        {
          "path": "views\/scripts\/edit\/status.tpl",
          "dir": false,
          "file": true,
          "perms": "0644",
          "size": 321,
          "sha1": "54d66d1791b9050763b5494689a117ff4d205339"
        },
        {
          "path": "views\/scripts\/edit\/style.tpl",
          "dir": false,
          "file": true,
          "perms": "0644",
          "size": 981,
          "sha1": "41a2cda67478f400ae66ba6dd73dacfb97d3a31e"
        },
        {
          "path": "views\/scripts\/admin-logins",
          "dir": true,
          "file": false,
          "perms": "0755",
          "size": 128,
          "sha1": null
        },
        {
          "path": "views\/scripts\/admin-logins\/index.tpl",
          "dir": false,
          "file": true,
          "perms": "0644",
          "size": 5390,
          "sha1": "39c3d4e6ef1a484aea6a87f7a0f9eab577f1607e"
        },
        {
          "path": "views\/scripts\/admin-logins\/clear.tpl",
          "dir": false,
          "file": true,
          "perms": "0644",
          "size": 362,
          "sha1": "0ce303af939d0817794329883fd3c98e7d5a54a0"
        },
        {
          "path": "views\/scripts\/_formEditImage.tpl",
          "dir": false,
          "file": true,
          "perms": "0644",
          "size": 3664,
          "sha1": "6ff230643e69e4788c49dbccd6f55ac8a5265490"
        },
        {
          "path": "views\/scripts\/index",
          "dir": true,
          "file": false,
          "perms": "0755",
          "size": 192,
          "sha1": null
        },
        {
          "path": "views\/scripts\/index\/index.tpl",
          "dir": false,
          "file": true,
          "perms": "0644",
          "size": 279,
          "sha1": "07402060910d662bfdf22764a6ece11450c4d7c0"
        },
        {
          "path": "views\/scripts\/index\/home.tpl",
          "dir": false,
          "file": true,
          "perms": "0644",
          "size": 278,
          "sha1": "e2e0ffbd6e3e85c40c79b571436f6e1c6af3150e"
        },
        {
          "path": "views\/scripts\/index\/search.tpl",
          "dir": false,
          "file": true,
          "perms": "0644",
          "size": 5444,
          "sha1": "b10ebc10948f00430cb2808e35fba530b9c26408"
        },
        {
          "path": "views\/scripts\/index\/browse.tpl",
          "dir": false,
          "file": true,
          "perms": "0644",
          "size": 2400,
          "sha1": "dc0dfbda12274ba868067f9dffa2d9ffa8da2260"
        },
        {
          "path": "views\/scripts\/friends",
          "dir": true,
          "file": false,
          "perms": "0755",
          "size": 384,
          "sha1": null
        },
        {
          "path": "views\/scripts\/friends\/follow.tpl",
          "dir": false,
          "file": true,
          "perms": "0644",
          "size": 322,
          "sha1": "695681002442d5e3d65a3622620a2ca047db3d8c"
        },
        {
          "path": "views\/scripts\/friends\/add.tpl",
          "dir": false,
          "file": true,
          "perms": "0644",
          "size": 319,
          "sha1": "0954dff17e16c14d50b4a85f38a9906cb5de745a"
        },
        {
          "path": "views\/scripts\/friends\/list.tpl",
          "dir": false,
          "file": true,
          "perms": "0644",
          "size": 2929,
          "sha1": "f5d7d49bb36af6c32d5945ba02fbff94c4e5111b"
        },
        {
          "path": "views\/scripts\/friends\/cancel.tpl",
          "dir": false,
          "file": true,
          "perms": "0644",
          "size": 347,
          "sha1": "3f97de06421038e66cfbb03a0154d83fcac46b7a"
        },
        {
          "path": "views\/scripts\/friends\/remove.tpl",
          "dir": false,
          "file": true,
          "perms": "0644",
          "size": 322,
          "sha1": "c75e329c5b135d156590f4bcc3078682efdb61db"
        },
        {
          "path": "views\/scripts\/friends\/request-friend.tpl",
          "dir": false,
          "file": true,
          "perms": "0644",
          "size": 2229,
          "sha1": "eb32513f6050abf14e097563d0ee7b94acabde6a"
        },
        {
          "path": "views\/scripts\/friends\/assign.tpl",
          "dir": false,
          "file": true,
          "perms": "0644",
          "size": 280,
          "sha1": "318f0472b22fab067aa0ea1f552cf9260d499e52"
        },
        {
          "path": "views\/scripts\/friends\/confirm.tpl",
          "dir": false,
          "file": true,
          "perms": "0644",
          "size": 323,
          "sha1": "f6f1d9db20924eb1ad107efcfaa3f44e67194837"
        },
        {
          "path": "views\/scripts\/friends\/reject.tpl",
          "dir": false,
          "file": true,
          "perms": "0644",
          "size": 322,
          "sha1": "4d647ff2cfa353cff369cbd481587551eb8bb151"
        },
        {
          "path": "views\/scripts\/friends\/request-follow.tpl",
          "dir": false,
          "file": true,
          "perms": "0644",
          "size": 2281,
          "sha1": "25811a220583ffc7eb0de761f3e0fd30a8fd5724"
        },
        {
          "path": "views\/scripts\/_browseUsers.tpl",
          "dir": false,
          "file": true,
          "perms": "0644",
          "size": 4461,
          "sha1": "ab579f08e1375fef3aaa842f93e780776a54edb9"
        },
        {
          "path": "views\/scripts\/admin-settings",
          "dir": true,
          "file": false,
          "perms": "0755",
          "size": 288,
          "sha1": null
        },
        {
          "path": "views\/scripts\/admin-settings\/index.tpl",
          "dir": false,
          "file": true,
          "perms": "0644",
          "size": 574,
          "sha1": "4e8fa18ac7f2f87a2fa63c300e576e3a5d8525d3"
        },
        {
          "path": "views\/scripts\/admin-settings\/twitter.tpl",
          "dir": false,
          "file": true,
          "perms": "0644",
          "size": 498,
          "sha1": "afd53a7472f7633a246d34f05db1bac9120c27ad"
        },
        {
          "path": "views\/scripts\/admin-settings\/friends.tpl",
          "dir": false,
          "file": true,
          "perms": "0644",
          "size": 521,
          "sha1": "b5ed4d4f49a1a106d76afdae16e54b8343c22bb2"
        },
        {
          "path": "views\/scripts\/admin-settings\/level.tpl",
          "dir": false,
          "file": true,
          "perms": "0644",
          "size": 928,
          "sha1": "c75873e3160269d40fca579c6f07958caaed4aae"
        },
        {
          "path": "views\/scripts\/admin-settings\/facebook.tpl",
          "dir": false,
          "file": true,
          "perms": "0644",
          "size": 520,
          "sha1": "a0b589573304bc258d8135c2aadc9bed0db727a5"
        },
        {
          "path": "views\/scripts\/admin-settings\/emails.tpl",
          "dir": false,
          "file": true,
          "perms": "0644",
          "size": 357,
          "sha1": "06d77b4667f32202849bc8fb43becadfdb003192"
        },
        {
          "path": "views\/scripts\/admin-settings\/google.tpl",
          "dir": false,
          "file": true,
          "perms": "0644",
          "size": 518,
          "sha1": "0f422be9faae5546629abf90dfdbd02a1e4b9a6b"
        },
        {
          "path": "views\/scripts\/_composeFacebook.tpl",
          "dir": false,
          "file": true,
          "perms": "0644",
          "size": 1173,
          "sha1": "10726b94718cb898b1ca3e6fa1d02df6cda8cc4a"
        },
        {
          "path": "views\/scripts\/admin-manage",
          "dir": true,
          "file": false,
          "perms": "0755",
          "size": 224,
          "sha1": null
        },
        {
          "path": "views\/scripts\/admin-manage\/index.tpl",
          "dir": false,
          "file": true,
          "perms": "0644",
          "size": 8906,
          "sha1": "c7981af746fae9dbab7b19f6f5712ff473f6d083"
        },
        {
          "path": "views\/scripts\/admin-manage\/resend-email.tpl",
          "dir": false,
          "file": true,
          "perms": "0644",
          "size": 363,
          "sha1": "e70b5d2b4b0af8031c601eea3953dab8f2b22aa2"
        },
        {
          "path": "views\/scripts\/admin-manage\/delete.tpl",
          "dir": false,
          "file": true,
          "perms": "0644",
          "size": 363,
          "sha1": "e70b5d2b4b0af8031c601eea3953dab8f2b22aa2"
        },
        {
          "path": "views\/scripts\/admin-manage\/stats.tpl",
          "dir": false,
          "file": true,
          "perms": "0644",
          "size": 3529,
          "sha1": "ab61e7c728882b7978d48af75e25f8025b3e21f7"
        },
        {
          "path": "views\/scripts\/admin-manage\/edit.tpl",
          "dir": false,
          "file": true,
          "perms": "0644",
          "size": 385,
          "sha1": "9cc952b50149a467ae3b78b38dc8ecb80f3bb23a"
        },
        {
          "path": "views\/scripts\/admin-fields",
          "dir": true,
          "file": false,
          "perms": "0755",
          "size": 96,
          "sha1": null
        },
        {
          "path": "views\/scripts\/admin-fields\/index.tpl",
          "dir": false,
          "file": true,
          "perms": "0644",
          "size": 2942,
          "sha1": "798864abe85e5d5873c311129bd6a9fa29b9012d"
        },
        {
          "path": "views\/scripts\/_composeTwitter.tpl",
          "dir": false,
          "file": true,
          "perms": "0644",
          "size": 1043,
          "sha1": "8e114661ba3aad2b871c7ef8abeea5b256c73938"
        },
        {
          "path": "views\/scripts\/coverphoto",
          "dir": true,
          "file": false,
          "perms": "0755",
          "size": 224,
          "sha1": null
        },
        {
          "path": "views\/scripts\/coverphoto\/get-main-photo.tpl",
          "dir": false,
          "file": true,
          "perms": "0644",
          "size": 5405,
          "sha1": "6ee3799971bf7f8f8dd7a7876bd2b2e84a07face"
        },
        {
          "path": "views\/scripts\/coverphoto\/remove-cover-photo.tpl",
          "dir": false,
          "file": true,
          "perms": "0644",
          "size": 1529,
          "sha1": "902b92224033efa709d1b316816925c17082f287"
        },
        {
          "path": "views\/scripts\/coverphoto\/get-cover-photo.tpl",
          "dir": false,
          "file": true,
          "perms": "0644",
          "size": 7956,
          "sha1": "78595f36cadef6783f166034caae7bb0b4b1bc3c"
        },
        {
          "path": "views\/scripts\/coverphoto\/upload-cover-photo.tpl",
          "dir": false,
          "file": true,
          "perms": "0644",
          "size": 2285,
          "sha1": "73d09fa3297be328ffc28e9aa8eb544b25f0d3ca"
        },
        {
          "path": "views\/scripts\/coverphoto\/choose-from-albums.tpl",
          "dir": false,
          "file": true,
          "perms": "0644",
          "size": 5040,
          "sha1": "5db06bcfc3dca98631b1facbbb89eda9d9c6a895"
        },
        {
          "path": "views\/scripts\/block",
          "dir": true,
          "file": false,
          "perms": "0755",
          "size": 128,
          "sha1": null
        },
        {
          "path": "views\/scripts\/block\/add.tpl",
          "dir": false,
          "file": true,
          "perms": "0644",
          "size": 343,
          "sha1": "f50c9401ff4efd4ea9bc1993c03e51134b54fbdf"
        },
        {
          "path": "views\/scripts\/block\/remove.tpl",
          "dir": false,
          "file": true,
          "perms": "0644",
          "size": 346,
          "sha1": "f351f52f02b84700dd7d054cfe78cb4bba79ace1"
        },
        {
          "path": "widgets",
          "dir": true,
          "file": false,
          "perms": "0755",
          "size": 736,
          "sha1": null
        },
        {
          "path": "widgets\/login-page",
          "dir": true,
          "file": false,
          "perms": "0755",
          "size": 128,
          "sha1": null
        },
        {
          "path": "widgets\/login-page\/index.tpl",
          "dir": false,
          "file": true,
          "perms": "0644",
          "size": 1814,
          "sha1": "76ea9a8f7c8cde2fc0df3191e3ac7c76fd5d6c9f"
        },
        {
          "path": "widgets\/login-page\/Controller.php",
          "dir": false,
          "file": true,
          "perms": "0644",
          "size": 1880,
          "sha1": "9a4ceef86833c6ae6241886e22cfb223a563b3b4"
        },
        {
          "path": "widgets\/settings-menu",
          "dir": true,
          "file": false,
          "perms": "0755",
          "size": 128,
          "sha1": null
        },
        {
          "path": "widgets\/settings-menu\/index.tpl",
          "dir": false,
          "file": true,
          "perms": "0644",
          "size": 586,
          "sha1": "0d22f4269ab991850475d44231a62bb8a1a08cfd"
        },
        {
          "path": "widgets\/settings-menu\/Controller.php",
          "dir": false,
          "file": true,
          "perms": "0644",
          "size": 1325,
          "sha1": "a8d75d90a96e7fa0b55b7044b25e672d0542f417"
        },
        {
          "path": "widgets\/profile-options",
          "dir": true,
          "file": false,
          "perms": "0755",
          "size": 128,
          "sha1": null
        },
        {
          "path": "widgets\/profile-options\/index.tpl",
          "dir": false,
          "file": true,
          "perms": "0644",
          "size": 555,
          "sha1": "8b3db32b9abf514509f59c86f719207b2f2e0114"
        },
        {
          "path": "widgets\/profile-options\/Controller.php",
          "dir": false,
          "file": true,
          "perms": "0644",
          "size": 1138,
          "sha1": "185922054c50302b7315f26653d5e47659070a55"
        },
        {
          "path": "widgets\/profile-fields",
          "dir": true,
          "file": false,
          "perms": "0755",
          "size": 128,
          "sha1": null
        },
        {
          "path": "widgets\/profile-fields\/index.tpl",
          "dir": false,
          "file": true,
          "perms": "0644",
          "size": 1062,
          "sha1": "0baac11e0b636d6a2c232bd9d6438ecd830c9bd2"
        },
        {
          "path": "widgets\/profile-fields\/Controller.php",
          "dir": false,
          "file": true,
          "perms": "0644",
          "size": 1380,
          "sha1": "b0cc5e999c156f46d37b0d6f980107195bd86a16"
        },
        {
          "path": "widgets\/list-online",
          "dir": true,
          "file": false,
          "perms": "0755",
          "size": 128,
          "sha1": null
        },
        {
          "path": "widgets\/list-online\/index.tpl",
          "dir": false,
          "file": true,
          "perms": "0644",
          "size": 876,
          "sha1": "e278fba925de556cd9e58d736f211d1c02af86ae"
        },
        {
          "path": "widgets\/list-online\/Controller.php",
          "dir": false,
          "file": true,
          "perms": "0644",
          "size": 3135,
          "sha1": "8636b1d4101b07ef84a686464a8bb71c19f89ae7"
        },
        {
          "path": "widgets\/browse-search",
          "dir": true,
          "file": false,
          "perms": "0755",
          "size": 128,
          "sha1": null
        },
        {
          "path": "widgets\/browse-search\/index.tpl",
          "dir": false,
          "file": true,
          "perms": "0644",
          "size": 1480,
          "sha1": "4bbbf15df5dcb02e7a6860fb2a26ef58641a7c02"
        },
        {
          "path": "widgets\/browse-search\/Controller.php",
          "dir": false,
          "file": true,
          "perms": "0644",
          "size": 972,
          "sha1": "c2d8c63b1b081a31a9a9bf12d8cb27375d315915"
        },
        {
          "path": "widgets\/list-popular",
          "dir": true,
          "file": false,
          "perms": "0755",
          "size": 128,
          "sha1": null
        },
        {
          "path": "widgets\/list-popular\/index.tpl",
          "dir": false,
          "file": true,
          "perms": "0644",
          "size": 1363,
          "sha1": "36ab4fb4feb4d6c0144277d028cb57896b3cbbd2"
        },
        {
          "path": "widgets\/list-popular\/Controller.php",
          "dir": false,
          "file": true,
          "perms": "0644",
          "size": 1852,
          "sha1": "53f4c3c25b1ea3c81f82d432e743396a8338586c"
        },
        {
          "path": "widgets\/profile-friends-following",
          "dir": true,
          "file": false,
          "perms": "0755",
          "size": 128,
          "sha1": null
        },
        {
          "path": "widgets\/profile-friends-following\/index.tpl",
          "dir": false,
          "file": true,
          "perms": "0644",
          "size": 8069,
          "sha1": "a9874d5c3be4580ff3c161200ea34c9a7a0a0903"
        },
        {
          "path": "widgets\/profile-friends-following\/Controller.php",
          "dir": false,
          "file": true,
          "perms": "0644",
          "size": 3701,
          "sha1": "870ab6c31b26089c0fc81578193b821a6da22a4b"
        },
        {
          "path": "widgets\/list-signups",
          "dir": true,
          "file": false,
          "perms": "0755",
          "size": 128,
          "sha1": null
        },
        {
          "path": "widgets\/list-signups\/index.tpl",
          "dir": false,
          "file": true,
          "perms": "0644",
          "size": 1277,
          "sha1": "a570d595f1689de54d41e84416793e5b51fd7206"
        },
        {
          "path": "widgets\/list-signups\/Controller.php",
          "dir": false,
          "file": true,
          "perms": "0644",
          "size": 1521,
          "sha1": "9bd7e2d87b5d5b08ee090b41383f230f346f5a6c"
        },
        {
          "path": "widgets\/profile-status",
          "dir": true,
          "file": false,
          "perms": "0755",
          "size": 128,
          "sha1": null
        },
        {
          "path": "widgets\/profile-status\/index.tpl",
          "dir": false,
          "file": true,
          "perms": "0644",
          "size": 1075,
          "sha1": "44a5dd51a3d11d506d0cd474dfe308298a902146"
        },
        {
          "path": "widgets\/profile-status\/Controller.php",
          "dir": false,
          "file": true,
          "perms": "0644",
          "size": 1052,
          "sha1": "54fbcd54b31a36e55651c360b3e4b9aa427d5576"
        },
        {
          "path": "widgets\/profile-friends-followers",
          "dir": true,
          "file": false,
          "perms": "0755",
          "size": 128,
          "sha1": null
        },
        {
          "path": "widgets\/profile-friends-followers\/index.tpl",
          "dir": false,
          "file": true,
          "perms": "0644",
          "size": 8071,
          "sha1": "5a11700892d9e53860881e7d102888d88e159356"
        },
        {
          "path": "widgets\/profile-friends-followers\/Controller.php",
          "dir": false,
          "file": true,
          "perms": "0644",
          "size": 3695,
          "sha1": "a6a471ec17fdffebd328bafe40730af53df30c40"
        },
        {
          "path": "widgets\/profile-friends-common",
          "dir": true,
          "file": false,
          "perms": "0755",
          "size": 128,
          "sha1": null
        },
        {
          "path": "widgets\/profile-friends-common\/index.tpl",
          "dir": false,
          "file": true,
          "perms": "0644",
          "size": 518,
          "sha1": "5e521e3365f66ad45fb87e3cd512bfa03db365ef"
        },
        {
          "path": "widgets\/profile-friends-common\/Controller.php",
          "dir": false,
          "file": true,
          "perms": "0644",
          "size": 3332,
          "sha1": "a39e690833bbaabe5f69311f0c33f9529e556015"
        },
        {
          "path": "widgets\/home-links",
          "dir": true,
          "file": false,
          "perms": "0755",
          "size": 128,
          "sha1": null
        },
        {
          "path": "widgets\/home-links\/index.tpl",
          "dir": false,
          "file": true,
          "perms": "0644",
          "size": 879,
          "sha1": "66a9d6549d4af5e6740d9c19f8846f31c7ff46f0"
        },
        {
          "path": "widgets\/home-links\/Controller.php",
          "dir": false,
          "file": true,
          "perms": "0644",
          "size": 1250,
          "sha1": "7fc2c260f489a1da11c86bbc8bb7d127756f7886"
        },
        {
          "path": "widgets\/cover-photo",
          "dir": true,
          "file": false,
          "perms": "0755",
          "size": 128,
          "sha1": null
        },
        {
          "path": "widgets\/cover-photo\/index.tpl",
          "dir": false,
          "file": true,
          "perms": "0644",
          "size": 3572,
          "sha1": "7cfd070abf916ceebd1f79fcc4bd2836b3a8a435"
        },
        {
          "path": "widgets\/cover-photo\/Controller.php",
          "dir": false,
          "file": true,
          "perms": "0644",
          "size": 2212,
          "sha1": "2e28c4817f3f30cf6b9158093944a9e14b3f2539"
        },
        {
          "path": "widgets\/login-or-signup",
          "dir": true,
          "file": false,
          "perms": "0755",
          "size": 128,
          "sha1": null
        },
        {
          "path": "widgets\/login-or-signup\/index.tpl",
          "dir": false,
          "file": true,
          "perms": "0644",
          "size": 1433,
          "sha1": "b06df7bd70e435f54fb93bf8712cf037250f6c62"
        },
        {
          "path": "widgets\/login-or-signup\/Controller.php",
          "dir": false,
          "file": true,
          "perms": "0755",
          "size": 1809,
          "sha1": "8ea432a85139b34e37b73fb6413fda28c48b0922"
        },
        {
          "path": "widgets\/profile-photo",
          "dir": true,
          "file": false,
          "perms": "0755",
          "size": 128,
          "sha1": null
        },
        {
          "path": "widgets\/profile-photo\/index.tpl",
          "dir": false,
          "file": true,
          "perms": "0644",
          "size": 363,
          "sha1": "48a00a5a93d2acce2fa2d770c5e863c79ae2dd2d"
        },
        {
          "path": "widgets\/profile-photo\/Controller.php",
          "dir": false,
          "file": true,
          "perms": "0644",
          "size": 1005,
          "sha1": "37655f56f2249ce048f53d6c29ed0a514020a45c"
        },
        {
          "path": "widgets\/home-photo",
          "dir": true,
          "file": false,
          "perms": "0755",
          "size": 128,
          "sha1": null
        },
        {
          "path": "widgets\/home-photo\/index.tpl",
          "dir": false,
          "file": true,
          "perms": "0644",
          "size": 491,
          "sha1": "2e79d165c80e909d057abdf7fa6c4ddb60bf51d8"
        },
        {
          "path": "widgets\/home-photo\/Controller.php",
          "dir": false,
          "file": true,
          "perms": "0644",
          "size": 742,
          "sha1": "eaf9adc766514f41d3b87750f9675df0eb3d8e3e"
        },
        {
          "path": "widgets\/profile-friends",
          "dir": true,
          "file": false,
          "perms": "0755",
          "size": 128,
          "sha1": null
        },
        {
          "path": "widgets\/profile-friends\/index.tpl",
          "dir": false,
          "file": true,
          "perms": "0644",
          "size": 7961,
          "sha1": "b85ffd38931ee1bb2b40d2a7b0bdc5fa3e28036a"
        },
        {
          "path": "widgets\/profile-friends\/Controller.php",
          "dir": false,
          "file": true,
          "perms": "0644",
          "size": 3633,
          "sha1": "27919d6da70ad4838a042ebe8dcbec8854659cd6"
        },
        {
          "path": "widgets\/profile-tags",
          "dir": true,
          "file": false,
          "perms": "0755",
          "size": 128,
          "sha1": null
        },
        {
          "path": "widgets\/profile-tags\/index.tpl",
          "dir": false,
          "file": true,
          "perms": "0644",
          "size": 2617,
          "sha1": "acabe22823acaaa39d055305028e58b716f1cfbc"
        },
        {
          "path": "widgets\/profile-tags\/Controller.php",
          "dir": false,
          "file": true,
          "perms": "0644",
          "size": 1582,
          "sha1": "0281a0591bd016e51de228f1bf5a9b690c80543f"
        },
        {
          "path": "widgets\/profile-info",
          "dir": true,
          "file": false,
          "perms": "0755",
          "size": 128,
          "sha1": null
        },
        {
          "path": "widgets\/profile-info\/index.tpl",
          "dir": false,
          "file": true,
          "perms": "0644",
          "size": 3803,
          "sha1": "8ce208f63f1e101165ef94c4439bab41a1685bd1"
        },
        {
          "path": "widgets\/profile-info\/Controller.php",
          "dir": false,
          "file": true,
          "perms": "0644",
          "size": 3555,
          "sha1": "d653fb49d39b868a57260ae9bd0048a81c92088c"
        },
        {
          "path": "widgets\/browse-menu",
          "dir": true,
          "file": false,
          "perms": "0755",
          "size": 128,
          "sha1": null
        },
        {
          "path": "widgets\/browse-menu\/index.tpl",
          "dir": false,
          "file": true,
          "perms": "0644",
          "size": 296,
          "sha1": "64299a73186b2743bd0f742d069b96681795126b"
        },
        {
          "path": "widgets\/browse-menu\/Controller.php",
          "dir": false,
          "file": true,
          "perms": "0644",
          "size": 752,
          "sha1": "8ab84db5b6e67cc484547ab8ca91077fc41b8768"
        }
      ]
    },
    "application\/languages\/en\/user.csv": {
      "type": "file",
      "path": "application\/languages\/en\/user.csv",
      "structure": {
        "path": "user.csv",
        "dir": false,
        "file": true,
        "perms": "0755",
        "size": 51121,
        "sha1": "692927ad5ac7ad14eef80fa3088ef1b454b335c8"
      }
    }
  }
}