{
  "type": "widget",
  "name": "branding",
  "version": "5.4.1",
  "revision": "9747",
  "path": "application\/widgets\/branding",
  "repository": null,
  "sku": null,
  "date": "Tue, 12 Jan 2021 12:04:10 +0000",
  "title": "SocialEngine Branding",
  "description": "Displays a \"powered by SocialEngine\" link.",
  "thumb": null,
  "developer": null,
  "authors": [
    "Webligo Developments"
  ],
  "meta": {
    "date": "Tue, 12 Jan 2021 12:04:10 +0000",
    "title": "SocialEngine Branding",
    "description": "Displays a \"powered by SocialEngine\" link.",
    "developer": null,
    "authors": [
      "Webligo Developments"
    ],
    "changeLog": null
  },
  "actions": [
    
  ],
  "callback": null,
  "dependencies": null,
  "tests": [
    
  ],
  "permissions": [
    
  ],
  "structure": {
    "application\/widgets\/branding": {
      "type": "directory",
      "path": "application\/widgets\/branding",
      "structure": [
        {
          "path": "index.tpl",
          "dir": false,
          "file": true,
          "perms": "0644",
          "size": 445,
          "sha1": "30c575eb28b0b52c9a9589bd3b4c4e1836dc79e0"
        },
        {
          "path": "Controller.php",
          "dir": false,
          "file": true,
          "perms": "0644",
          "size": 582,
          "sha1": "e447894e72122f914b193aeddc16eb67c0500746"
        },
        {
          "path": "manifest.php",
          "dir": false,
          "file": true,
          "perms": "0644",
          "size": 996,
          "sha1": "94af85f976adc30a5cf3828ed6bc34d3f0f823b2"
        }
      ]
    }
  }
}