<svg id="Down_arrow" data-name="Down arrow" xmlns="http://www.w3.org/2000/svg" width="19" height="10.802" viewBox="0 0 19 10.802">
  <g id="XMLID_13_">
    <path id="XMLID_17_" d="M59.184,257.027l-.868.91-2.077,2.178-2.511,2.633-2.17,2.275c-.351.368-.711.73-1.056,1.107l-.014.015h1.143l-.868-.91-2.077-2.178-2.511-2.633L44,258.149c-.351-.368-.7-.743-1.056-1.107l-.014-.015a.792.792,0,0,0-1.143,0,.892.892,0,0,0,0,1.2l.868.91,2.077,2.178,2.511,2.633,2.17,2.275c.351.368.7.743,1.056,1.107l.014.015a.793.793,0,0,0,1.143,0l.868-.91,2.077-2.178,2.511-2.633,2.17-2.275c.351-.368.709-.732,1.056-1.107l.014-.015a.888.888,0,0,0,0-1.2.8.8,0,0,0-1.143,0Z" transform="translate(-41.559 -256.784)"/>
  </g>
</svg>
