<svg xmlns="http://www.w3.org/2000/svg" width="15.485" height="19.95" viewBox="0 0 15.485 19.95">
    <g>
        <g>
            <g>
                <path fill-rule="evenodd" stroke="#000" stroke-width="0.25px" d="M16.8 10.427h2.914a.511.511 0 0 1 .51.468l1.011 13.2a.464.464 0 0 1-.128.384.518.518 0 0 1-.373.163H6.52a.513.513 0 0 1-.51-.547L7.03 10.9a.5.5 0 0 1 .5-.468h2.924V8.5a3.19 3.19 0 1 1 6.349 0zm-1.011 0V8.5a2.174 2.174 0 1 0-4.327 0v1.93zM7.07 23.631h13.119l-.942-12.188H8z" transform="translate(-5.884 -4.821) translate(6.009 4.991) translate(-6.009 -4.991)"/>
            </g>
        </g>
    </g>
</svg>
