<svg width="16" height="16" viewBox="0 0 16 16" fill="none" xmlns="http://www.w3.org/2000/svg">
<path fill-rule="evenodd" clip-rule="evenodd" d="M6.83333 12.6667C10.055 12.6667 12.6667 10.055 12.6667 6.83333C12.6667 3.61167 10.055 1 6.83333 1C3.61167 1 1 3.61167 1 6.83333C1 10.055 3.61167 12.6667 6.83333 12.6667Z" stroke="#645984" stroke-width="2" stroke-linecap="round" stroke-linejoin="round"/>
<path d="M14.9995 15L10.9551 10.9556" stroke="#645984" stroke-width="2" stroke-linecap="round" stroke-linejoin="round"/>
</svg>
