<svg xmlns="http://www.w3.org/2000/svg" width="7.575" height="12.625" viewBox="0 0 7.575 12.625">
    <path fill="#111a37" d="M1384.631 967.2a.717.717 0 0 0-1 0l-.423.414a.682.682 0 0 0 0 .977l4.818 4.718-4.824 4.723a.682.682 0 0 0 0 .977l.423.413a.717.717 0 0 0 1 0l5.743-5.623a.687.687 0 0 0 0-.98z" transform="translate(-1383 -967)"/>
</svg>
