[
  {
    "name": "math",
    "number": 0,
    "sub_themes": [
      {
        "name": "higher_math",
        "number": 11
      },
      {
        "name": "discrete_math",
        "number": 12
      },
      {
        "name": "computational",
        "number": 13
      },
      {
        "name": "other",
        "number": 15
      }
    ]
  },
  {
    "name": "physics",
    "number": 1,
    "sub_themes": [
      {
        "name": "theoretical",
        "number": 21
      },
      {
        "name": "general",
        "number": 22
      },
      {
        "name": "theoretical mechanics",
        "number": 23
      },
      {
        "name": "labs",
        "number": 24
      },
      {
        "name": "other",
        "number": 25
      }
    ]
  },
  {
    "name": "IT",
    "number": 2,
    "sub_themes": [
      {
        "name": "algorithms",
        "number": 31
      },
      {
        "name": "programming",
        "number": 32
      },
      {
        "name": "languages",
        "number": 33
      },
      {
        "name": "system programming",
        "number": 34
      },
      {
        "name": "other",
        "number": 35
      }
    ]
  },
  {
    "name": "chemistry",
    "number": 4,
    "sub_themes": [
      {
        "name": "inorganic",
        "number": 51
      },
      {
        "name": "organic",
        "number": 52
      },
      {
        "name": "physical chemistry",
        "number": 53
      },
      {
        "name": "other",
        "number": 55
      }
    ]
  },
  {
    "name": "other",
    "number": 3,
    "sub_themes": [
      {
        "name": "english",
        "number": 41
      },
      {
        "name": "other",
        "number": 45
      }
    ]
  }
]