{
    "store_review": {
        "column": {
            "review_id": true,
            "customer_name": true,
            "content": true,
            "creation_time": true,
            "update_time": true,
            "is_active": true
        },
        "constraint": {
            "PRIMARY": true
        }
    }
}