{
    "elogic_erp": {
        "column": {
            "entity_id": true,
            "order_id": true,
            "erp_id": true
        },
        "constraint": {
            "PRIMARY": true
        }
    }
}