{
    "academy_author": {
        "column": {
            "author_id": true,
            "firstname": true,
            "lastname": true,
            "info": true,
            "creation_time": true,
            "update_time": true
        },
        "index": {
            "ACADEMY_AUTHOR_FIRSTNAME_LASTNAME": true
        },
        "constraint": {
            "PRIMARY": true
        }
    }
}