module connecteu.rs/api/email

go 1.14

require (
	github.com/jcmturner/gokrb5/v8 v8.3.0 // indirect
	github.com/lib/pq v1.6.0
	golang.org/x/crypto v0.0.0-20200510223506-06a226fb4e37 // indirect
	golang.org/x/net v0.0.0-20200528225125-3c3fba18258b // indirect
)
