<?xml version="1.0" encoding="utf-8"?>
<!-- Generator: Adobe Illustrator 22.0.1, SVG Export Plug-In . SVG Version: 6.00 Build 0)  -->
<svg version="1.1" id="Calque_1" xmlns="http://www.w3.org/2000/svg" xmlns:xlink="http://www.w3.org/1999/xlink" x="0px" y="0px"
	 viewBox="0 0 432 432" style="enable-background:new 0 0 432 432;" xml:space="preserve">
<style type="text/css">
	.st0{fill:#957452;}
	.st1{fill:#88573C;}
	.st2{fill:#D6C49A;}
	.st3{fill:#E52627;}
	.st4{fill:#CDCCCC;}
	.st5{fill:#264395;}
	.st6{fill:#1E274A;}
	.st7{fill:#EC6625;}
	.st8{fill:#020203;}
	.st9{fill:#E52521;}
	.st10{fill:#808181;}
	.st11{fill:#FFE324;}
	.st12{fill:#3F4244;}
	.st13{fill:#009F4A;}
	.st14{fill:#343434;}
	.st15{fill:#78170E;}
	.st16{fill:#F0E9D5;}
	.st17{fill:#272531;}
	.st18{fill:#222B56;}
	.st19{fill:#9BD2CC;}
	.st20{fill:#83B143;}
	.st21{fill:#1B1B1B;}
	.st22{fill:#FFFFFF;}
	.st23{fill:#DDD6C3;}
	.st24{fill:#997F64;}
	.st25{fill:#77684B;}
	.st26{fill:#A89877;}
	.st27{fill:#B4B4B4;}
	.st28{fill:#DDCEBB;}
	.st29{fill:#9A2A1A;}
	.st30{fill:#5E1C0C;}
	.st31{fill:#F1CA43;}
	.st32{fill:#A57B46;}
	.st33{fill:#F18538;}
	.st34{fill:#F2AC64;}
	.st35{fill:#FAB42D;}
	.st36{fill:#46494E;}
	.st37{fill:#CF875E;}
	.st38{fill:#E7E6E6;}
	.st39{fill:#1A181D;}
	.st40{fill:#637644;}
	.st41{fill:#9F1E29;}
	.st42{fill:#F9B03D;}
	.st43{fill:#0D71B9;}
	.st44{fill:#E52629;}
	.st45{fill:#676767;}
	.st46{fill:#30358C;}
	.st47{fill:#9A9999;}
	.st48{fill:#3F4798;}
	.st49{fill:#2DABE3;}
	.st50{fill:#C1292E;}
	.st51{fill:#F2F2F2;}
	.st52{fill:#AA7C4C;}
	.st53{fill:#D6A573;}
	.st54{fill:#29ACE1;}
	.st55{fill:#88C05E;}
	.st56{fill:#F39323;}
	.st57{fill:#EB5B28;}
	.st58{fill:#B85965;}
	.st59{fill:#A67D52;}
	.st60{fill:#8C633A;}
	.st61{fill:#009245;}
	.st62{fill:#066938;}
	.st63{fill:#7D252D;}
	.st64{fill:#95D3E3;}
	.st65{fill:#603914;}
	.st66{fill:#EFC9AF;}
	.st67{fill:#D987B8;}
	.st68{fill:#8FC14D;}
	.st69{fill:#C69C6C;}
	.st70{fill:#2BADE1;}
	.st71{fill:#A4C958;}
	.st72{fill:#754D24;}
	.st73{fill:#35AE73;}
	.st74{fill:#E0B99E;}
	.st75{fill:#BDCCD4;}
	.st76{fill:#0C0D0D;}
	.st77{fill:#F4E152;}
	.st78{fill:#1E1911;}
	.st79{fill:#A1BD4F;}
	.st80{fill:#CBE6DC;}
	.st81{fill:#B5DCCE;}
	.st82{fill:#1F1D1B;}
	.st83{fill:#746458;}
	.st84{fill:#C7B29A;}
	.st85{fill:#998675;}
	.st86{fill:#428540;}
	.st87{fill:#E3E5E3;}
	.st88{fill:#161617;}
	.st89{fill:#1E1F1E;}
	.st90{fill:#474847;}
	.st91{fill:#191A19;}
	.st92{fill:#4B2C15;}
	.st93{fill:#92552A;}
	.st94{fill:#7EA847;}
	.st95{fill:#D59E2B;}
	.st96{fill:#807E79;}
	.st97{fill:#E5B744;}
	.st98{fill:#8EC045;}
	.st99{fill:#3B569A;}
	.st100{fill:#A1B7E0;}
	.st101{fill:#8FC9CC;}
	.st102{fill:#9ED1CA;}
	.st103{fill:#81AAA9;}
	.st104{fill:#E1783D;}
	.st105{fill:#64328A;}
	.st106{fill:#DEDEA5;}
	.st107{fill:#754997;}
	.st108{fill:#EE6F43;}
	.st109{fill:#A6CB67;}
	.st110{fill:#8FB7C0;}
	.st111{fill:#E2E1DF;}
	.st112{fill:#2C3E70;}
	.st113{fill:#D9BF96;}
	.st114{fill:#9C6941;}
	.st115{fill:#61605E;}
	.st116{fill:#9C9A99;}
	.st117{fill:#245F3D;}
	.st118{fill:#191713;}
	.st119{fill:#C39A62;}
	.st120{fill:#A17C4F;}
	.st121{fill:#F39200;}
	.st122{fill:#432918;}
	.st123{fill:#B17F4A;}
	.st124{fill:#FFCE1E;}
	.st125{fill:#BE1622;}
	.st126{fill:#3AAA35;}
	.st127{fill:#911825;}
	.st128{fill:#009FE3;}
	.st129{fill:#E94E1B;}
	.st130{fill:#FFCC03;}
	.st131{fill:#95C11F;}
	.st132{fill:#00A19A;}
	.st133{fill:#683C11;}
	.st134{fill:#878787;}
	.st135{fill:#634E42;}
	.st136{fill:#CBBBA0;}
	.st137{fill:#7B5B41;}
	.st138{fill:#493E36;}
	.st139{fill:#78A62C;}
	.st140{fill:#2C8535;}
	.st141{fill:#F9B233;}
	.st142{fill:none;}
	.st143{fill:#CA9E67;}
	.st144{fill:#E30613;}
	.st145{fill:#C6C6C6;}
	.st146{fill:#575756;}
	.st147{fill:#7B6A58;}
	.st148{fill:#A3C5D7;}
	.st149{fill:#332C25;}
	.st150{fill:#29235C;}
	.st151{fill:#E6332A;}
	.st152{fill:#738D93;}
	.st153{fill:#C87B31;}
	.st154{fill:#5BBCA7;}
	.st155{fill:#EF786F;}
	.st156{fill:#EE8D9E;}
	.st157{fill:#A74B56;}
	.st158{fill:#E72D7B;}
	.st159{fill:#E84138;}
	.st160{fill:#3B2315;}
	.st161{fill:#8EC044;}
	.st162{fill:#A1C74B;}
	.st163{fill:#231F20;}
	.st164{fill:#F6D9A7;}
	.st165{fill:#F4A5A6;}
	.st166{fill:#6E6F70;}
	.st167{fill:#F8AF41;}
	.st168{fill:#B79C19;}
	.st169{fill:#EFD101;}
	.st170{fill:#207A97;}
	.st171{fill:#20ACE3;}
	.st172{fill:#C51618;}
	.st173{fill:#C19446;}
	.st174{fill:#9E599F;}
	.st175{fill:#CD95C2;}
	.st176{fill:#F29A26;}
	.st177{fill:#FCCE8D;}
	.st178{fill:#F39B85;}
	.st179{fill:#E52628;}
	.st180{fill:#6BB52D;}
</style>
<g>
	<g>
		<path d="M197.7,211.1c-1.5-9.4-2.7-18.8-4.5-28.1c-0.1-0.5,0-1.1-0.8-1.5c-2.4,11.2-3.9,22.5-5,33.8c-0.1,1.3,0.1,1.6,1.5,1.5
			c2.3-0.1,4.6-0.4,7-0.6c2.5-0.2,2.5-0.3,2.1-2.9C197.9,212.6,197.8,211.8,197.7,211.1z"/>
		<path d="M378.2,228c-2.5-16.3-13.8-31.1-27.5-40.2c-11.9-70-67-123-133.3-123c-64.4,0-118.3,50-132.2,117.1
			c-15.4,8.8-28.7,24.8-31.4,42.6c-1.4,9,4,14.1,12.9,14.3c5.9,0.1,11.8-2,15.9-6.1c7.4,75.7,65,134.6,134.9,134.6
			c68.2,0,124.7-56.1,134.2-129.2c3.9,2.9,8.8,4.3,13.7,4.2C374.2,242.1,379.6,237,378.2,228z M140.5,103.2
			c4.6-6.9,12.1-10.9,20.4-10.9c3.5,0,3.5,5.5,0,5.5c-6.3,0-12.1,2.9-15.7,8.2C143.3,108.9,138.6,106.2,140.5,103.2z M175.9,225.2
			c-0.5,3.4-1.1,6.8-2.3,10.1c-0.7,1.9-1.6,3.7-2.8,5.4c-2.9,3.7-7.3,4.5-11.2,2c-3.2-2-5.5-4.9-7.1-8.3c-2.4-5-4-10.2-5.2-15.6
			c-1.6-7.1-2.7-14.4-2.5-21.7c0.3-6.8,1.5-13.5,4.5-19.6c1.4-2.8,3.1-5.3,5.5-7.4c4.9-4.3,10.7-4.8,16-1.5c1.4,0.9,2.5,2,3.2,3.4
			c1,2,0.6,3.8-1,4.8c-1.6,1-3.1,0.5-4.5-1.2c-2-2.6-4.9-3.2-7.8-1.6c-1.3,0.7-2.3,1.7-3.2,2.8c-2.4,3-3.7,6.5-4.7,10.2
			c-1.6,5.7-1.7,11.5-1.3,17.3c0.6,7.9,2.3,15.6,5,23.1c0.7,2,1.6,4.1,2.7,5.9c0.9,1.5,2.1,2.8,3.5,3.7c1.3,0.8,2,0.7,2.9-0.5
			c1-1.3,1.6-2.9,2.1-4.5c1.3-4.4,1.9-8.8,2.2-13.3c0.5-6.2,0.6-12.5,0.5-18.7c0-0.5,0-1,0-1.8c-2,0.3-3.6,0.5-5.2,0.7
			c-0.5,0.1-1.1,0.1-1.6,0.1c-1.6-0.1-2.9-1.3-3.1-2.8c-0.2-1.4,0.7-2.8,2.1-3.4c0.6-0.2,1.3-0.4,2-0.5c2-0.3,4-0.6,6-0.8
			c3.9-0.3,6,1.4,6.2,4.8c0.1,1,0.2,2,0.2,2.9C177,207.9,177,216.6,175.9,225.2z M207,243c-1.3,0.5-2.6,0.2-3.7-1
			c-0.7-0.8-1.1-1.7-1.3-2.8c-0.6-5.2-1.7-10.2-2.4-15.4c-0.1-1-0.4-1.4-1.5-1.3c-3.4,0.4-6.9,0.7-10.3,1c-1,0.1-1.2,0.9-1.2,1.6
			c-0.2,1.7-0.4,3.4-0.5,5.2c-0.2,2-0.4,3.9-0.6,5.8c0,0.2,0,0.5-0.1,0.7c-0.4,2.1-1.9,3.3-3.8,3c-1.7-0.2-2.9-1.9-2.8-3.8
			c0.3-3,0.5-6,0.9-9c0.8-6,1.1-12,1.7-18c1.3-12.4,3.3-24.6,6.3-36.7c0.3-1.2,0.7-2.3,1.4-3.3c1.7-2.2,4.4-2.2,6.2-0.2
			c0.9,1,1.4,2.3,1.8,3.6c1.7,5.1,2.7,10.3,3.6,15.6c2.3,14.6,4.6,29.3,6.9,43.9c0.3,2,0.7,4,1.1,6c0.1,0.6,0.2,1.2,0.3,1.5
			C209,241.4,208.3,242.4,207,243z M206.7,166.2c-2.9-1.7-4.4-5.3-4.2-8.5c0.2-3.2,2-5.8,4.1-8.2c-4.7-1.1-9.3-1-12.9,2.8
			c-2.4,2.6-6.3-1.3-3.9-3.9c4.8-5,11.8-5.7,18.3-4.2c8.3,1.9,17.7,8.3,25.8,2.8c2.9-2,5.7,2.8,2.8,4.7c-4.7,3.2-10.2,3.4-15.5,2.3
			C219.5,160.6,214.3,170.5,206.7,166.2z M262.8,222.4c-0.2,1.6-1.2,2.7-2.7,2.9c-1.6,0.2-3-0.5-3.7-2c-0.2-0.6-0.3-1.1-0.4-1.8
			c-0.8-11.4-1.5-22.9-1.2-34.3c0-0.2-0.1-0.4-0.1-0.6c-0.1,0-0.3-0.1-0.4-0.1c-2,3.8-4.1,7.5-6.1,11.3c-2,3.9-3.9,7.8-5.9,11.7
			c-0.6,1.3-1.3,2.6-2.2,3.6c-2,2.2-4.8,2.3-7,0.2c-1.1-1.1-1.8-2.4-2.5-3.7c-3.8-7.4-7.8-14.6-11.4-22.1c-0.3-0.6-0.5-1.4-1.2-2
			c0,2.6-0.1,5.1,0,7.5c0.3,8.9-0.1,17.8-0.4,26.7c-0.1,4-0.2,8-0.2,12c0,2-0.3,3.9-0.4,5.9c-0.1,1.9-1.5,3.1-3.2,3.1
			c-1.7,0-3.1-1.3-3.2-3.2c-0.1-2.2,0.1-4.4,0.1-6.5c0.4-14.2,1.2-28.5,0.7-42.7c-0.1-4.1-0.3-8.1-0.4-12.2c0-1,0-2.1,0.2-3.1
			c0.7-3.2,4-4.2,6.4-2c1.3,1.2,2.1,2.7,2.9,4.3c2.1,4.3,4.2,8.7,6.4,13c2.9,5.7,5.9,11.4,8.8,17.1c0.2,0.3,0.2,0.7,0.7,0.8
			c0.6-0.2,0.7-0.9,0.9-1.4c4.9-10.1,10.5-19.9,15.9-29.7c0.3-0.6,0.7-1.2,1.1-1.7c1-1.2,2.3-2,4-1.6c1.7,0.4,2.7,1.7,2.9,3.4
			c0.3,2.5,0.4,5.1,0.3,7.7c-0.2,5.4-0.3,10.9-0.2,16.3c0.2,7.3,0.6,14.6,1.3,21.9C262.8,221.4,262.8,221.9,262.8,222.4z
			 M261.4,93.6c7.2-2.2,14.8-1,21,3.3c2.9,2,0.1,6.8-2.8,4.7c-5-3.6-10.8-4.6-16.8-2.8C259.4,99.9,258,94.6,261.4,93.6z
			 M287.3,169.9c-0.3,1.8-2.1,3-4.1,2.6c-3-0.5-6.1-1-9.2-1.1c-2-0.1-2,0-2.1,1.9c-0.2,3.1-0.4,6.2-0.5,9.2
			c-0.2,10.2-0.3,20.5,0,30.7c0.1,2.8-0.2,2.7,2.8,2.7c1.1,0,2.3-0.1,3.4,0c2.2,0.1,3.6,1.5,3.6,3.3c0,1.8-1.5,3.2-3.6,3.2
			c-1.6,0.1-3.3,0-5.2,0c0,2.9,0.6,5.3,1,7.9c0.2,0.9,0.9,1.2,1.7,1.1c1.9-0.3,3.8-0.1,5.6-0.8c2.2-0.8,4.1,0,4.7,2
			c0.6,1.9-0.4,3.7-2.5,4.4c-3.5,1.1-7.1,1.2-10.7,0.7c-2.5-0.3-4-1.9-4.7-4.3c-0.9-3.3-1.4-6.6-1.7-10c-1.3-13.4-1.1-26.9-0.7-40.4
			c0.1-4.1,0.4-8.3,0.6-12.4c0-0.9,0.2-1.8,0.4-2.7c0.4-1.6,1.3-2.5,2.8-2.9c1-0.3,2.1-0.4,3.1-0.4c4.2,0.1,8.4,0.5,12.5,1.4
			C286.5,166.5,287.6,168,287.3,169.9z"/>
		<path d="M212.5,151.3c-1.6,1.6-3.5,3.3-4.2,5.4c-0.5,1.4-0.5,4.1,1.2,4.8c3.3,1.3,5.6-5,6.6-8.9
			C214.9,152.1,213.7,151.7,212.5,151.3z"/>
	</g>
	<g>
		<path class="st50" d="M144.5,259.2c2.2-2.1,3.3-4.5,4.7-6.6c1.7-2.6,4.6-3.3,7.1-2c2.5,1.3,3.6,4,2.8,6.9c-0.3,1-0.8,1.9-1.3,2.8
			c-1.7,2.9-3.6,5.7-6,8c-1.6,1.6-2,3.1-1.5,5.5c2.1,9.4,1.8,19,0.8,28.5c-0.6,5.1-1.4,10.2-2.8,15.2c-1.5,5.2-3.6,10.2-7,14.5
			c-3.8,4.7-8.3,8.1-14.8,7.7c-3.5-0.2-6.5-1.5-9.2-3.7c-2.4-1.9-4.6-4.2-6.3-6.8c-10.8-16.1-14.7-33.6-11.4-52.7
			c1.2-6.8,3.9-13.3,8.3-18.6c5.2-6.2,12.3-9.2,20.7-7.8C134.8,251.1,140.2,253.9,144.5,259.2z M110.4,280.1
			c-0.2,0.8-0.4,1.3-0.5,1.8c-0.1,0.6-0.2,1.3-0.3,1.9c-0.9,13.8,2.3,26.6,9.9,38.2c1.1,1.7,2.4,3.3,4,4.7c2.6,2.1,4.8,2.1,7.2-0.1
			c1.9-1.8,3.2-4,4.3-6.4c2.4-5.1,3.5-10.5,4.2-16c1.1-8.6,2-17.1,0.1-26c-4.7,1.6-9.1,3.7-14,4.1
			C120.3,282.9,115.4,282.1,110.4,280.1z M135.7,267.2c-4.6-7.7-15.8-8-19.9-0.7c-1.4,2.5-1.1,3.4,1.6,4.2
			C124.1,272.7,130,270.3,135.7,267.2z"/>
		<path class="st50" d="M201.7,321.4c3.3-23.1,7.6-45.9,10.3-69c0.1-1.2,0.3-2.3,0.6-3.4c0.8-2.7,3.1-4.2,5.9-4c2.7,0.2,4.7,2.2,5,5
			c0.1,1.1,0.1,2.3-0.1,3.5c-2.1,14.6-4.1,29.1-6.5,43.6c-2.2,13.4-4.3,26.7-5.8,40.2c-0.2,2.2-0.6,4.3-1.4,6.4
			c-1,2.5-2.8,4.1-5.5,4.4c-2.7,0.3-4.7-1.1-6.1-3.3c-0.9-1.4-1.6-3-2.1-4.5c-9.9-27.1-21.4-53.7-31.3-80.8c-0.8-2.1-1.8-4-2.3-6.1
			c-1.1-4.6,2-8,6.3-7.4c2.5,0.4,3.7,2.1,4.5,4.3c3.1,8.2,6.1,16.4,9.3,24.6c5.9,15,11.9,30,17.8,45
			C200.5,320.3,200.6,321,201.7,321.4z"/>
		<path class="st50" d="M239.5,332.6c0,4.9,1.1,9.1,1.8,13.5c0.3,1.6,1.6,2.1,2.9,1.9c3.2-0.4,6.4-0.2,9.5-1.4
			c3.7-1.4,7.1,0,8.1,3.4c1,3.2-0.7,6.3-4.3,7.5c-6,1.9-12.2,2-18.4,1.3c-4.2-0.5-6.9-3.2-8.1-7.4c-1.6-5.6-2.4-11.4-3-17.1
			c-2.2-23-1.9-46.1-1.2-69.2c0.2-7.1,0.7-14.2,1.1-21.3c0.1-1.6,0.4-3.1,0.7-4.6c0.6-2.7,2.3-4.2,4.9-5c1.7-0.5,3.5-0.7,5.3-0.7
			c7.2,0.3,14.4,0.9,21.5,2.3c3.7,0.7,5.6,3.3,5,6.6c-0.5,3.1-3.6,5.1-7,4.5c-5.2-0.9-10.4-1.7-15.7-1.9c-3.4-0.1-3.4-0.1-3.7,3.2
			c-0.3,5.3-0.7,10.6-0.8,15.8c-0.4,17.5-0.5,35.1,0,52.7c0.1,4.8-0.4,4.7,4.7,4.6c1.9,0,3.9-0.1,5.8,0c3.7,0.2,6.1,2.6,6.1,5.7
			c-0.1,3.1-2.5,5.4-6.3,5.6C245.6,332.7,242.8,332.6,239.5,332.6z"/>
		<path class="st50" d="M295.1,321.9c4.4,3.4,8.6,6.8,12.9,10.1c2.5,2,5.1,3.9,7.7,5.8c1.7,1.3,3,2.8,3,5.1c0,3.8-3.6,6.4-7.2,5.3
			c-1.4-0.4-2.5-1.3-3.6-2.2c-5.7-4.4-11.4-8.8-17.2-13.2c-0.9-0.7-1.8-1.3-3.3-2.3c0,4.9,0.2,9.1,1.6,13c0.8,2.2,0.8,4.2,0,6.4
			c-1,2.6-3.1,4.1-5.6,4c-2.4-0.1-4.7-1.7-5.3-4.4c-0.7-3.4-1.2-6.9-1.5-10.3c-2.3-20.9-3.4-41.9-4.5-62.9
			c-0.3-6.1-0.2-12.1-0.2-18.2c0-1.3,0-2.5-0.3-3.8c-1-4.1,0.5-6.8,4.6-7.9c5.4-1.4,10.9-2,16.5-1.5c6.9,0.7,13.7,2.1,20.1,5.1
			c9.4,4.4,16.5,11.1,19.4,21.3c3.6,12.5,0.1,23.4-8.2,33c-6.1,7-13.9,11.4-22.4,14.8C299.6,320,297.3,320.4,295.1,321.9z
			 M283.1,272.1c0,7,0.9,13.9,1.2,20.9c0.2,5.7,0.6,11.3,1,17c0.2,2.4,0.5,2.7,2.9,1.9c5.4-1.7,10.8-3.5,15.8-6.1
			c5.6-2.9,10.4-6.7,14-11.9c8-11.8,4.8-25.4-7.6-32.4c-7.6-4.3-15.9-5.7-24.6-5.2c-2.6,0.1-2.7,0.2-2.7,3
			C283.1,263.6,283.1,267.8,283.1,272.1z"/>
	</g>
	<path class="st50" d="M182.6,137.3c-4.3-3.6-8.6-7.2-12.9-10.8c3.4-3.8,6.7-7.6,10.1-11.3c3.5-3.9-2.3-9.7-5.8-5.8
		c-3.5,4-7.1,7.9-10.6,11.9c-3-2.5-5.9-5-8.9-7.5c-3.8-3.2-9.4,2.3-5.5,5.5c3.1,2.6,6.2,5.2,9.3,7.8c-3.3,3.9-6.7,7.9-10.8,10.9
		c-4.3,3-0.2,10.2,4.1,7.1c5-3.6,8.9-8.2,12.9-12.7c4.2,3.5,8.3,7,12.5,10.5C180.9,146,186.4,140.5,182.6,137.3z"/>
	<path class="st50" d="M284.6,137.3c-4.3-3.6-8.6-7.2-12.9-10.8c3.4-3.8,6.7-7.6,10.1-11.3c3.5-3.9-2.3-9.7-5.8-5.8
		c-3.5,4-7.1,7.9-10.6,11.9c-3-2.5-5.9-5-8.9-7.5c-3.8-3.2-9.4,2.3-5.5,5.5c3.1,2.6,6.2,5.2,9.3,7.8c-3.3,3.9-6.7,7.9-10.8,10.9
		c-4.3,3-0.2,10.2,4.1,7.1c5-3.6,8.9-8.2,12.9-12.7c4.2,3.5,8.3,7,12.5,10.5C282.9,146,288.5,140.5,284.6,137.3z"/>
</g>
</svg>
