<?xml version="1.0" encoding="UTF-8"?>
<!DOCTYPE svg PUBLIC "-//W3C//DTD SVG 1.1//EN" "http://www.w3.org/Graphics/SVG/1.1/DTD/svg11.dtd">
<svg xmlns="http://www.w3.org/2000/svg" version="1.1" width="1960" height="190">
  <!-- рамка -->
  <!-- пиано рол -->
    <!-- такт -->
      <!-- вертикална линия в такта --><line x1="30" y1="20" x2="30" y2="190" stroke="black" stroke-width="1" />
      <!-- вертикална линия в такта --><line x1="40" y1="20" x2="40" y2="190" stroke="black" stroke-width="1" />
      <!-- вертикална линия в такта --><line x1="50" y1="20" x2="50" y2="190" stroke="black" stroke-width="1" />
      <!-- вертикална линия в такта --><line x1="60" y1="20" x2="60" y2="190" stroke="black" stroke-width="2" />
      <!-- вертикална линия в такта --><line x1="70" y1="20" x2="70" y2="190" stroke="black" stroke-width="1" />
      <!-- вертикална линия в такта --><line x1="80" y1="20" x2="80" y2="190" stroke="black" stroke-width="1" />
      <!-- вертикална линия в такта --><line x1="90" y1="20" x2="90" y2="190" stroke="black" stroke-width="1" />
      <!-- вертикална линия в такта --><line x1="100" y1="20" x2="100" y2="190" stroke="black" stroke-width="2" />
      <!-- вертикална линия в такта --><line x1="110" y1="20" x2="110" y2="190" stroke="black" stroke-width="1" />
      <!-- вертикална линия в такта --><line x1="120" y1="20" x2="120" y2="190" stroke="black" stroke-width="1" />
      <!-- вертикална линия в такта --><line x1="130" y1="20" x2="130" y2="190" stroke="black" stroke-width="1" />
      <!-- вертикална линия в такта --><line x1="140" y1="20" x2="140" y2="190" stroke="black" stroke-width="2" />
      <!-- вертикална линия в такта --><line x1="150" y1="20" x2="150" y2="190" stroke="black" stroke-width="1" />
      <!-- вертикална линия в такта --><line x1="160" y1="20" x2="160" y2="190" stroke="black" stroke-width="1" />
      <!-- вертикална линия в такта --><line x1="170" y1="20" x2="170" y2="190" stroke="black" stroke-width="1" />
      <!-- нота --><rect x="20" y="140" width="40" height="10" fill="hsl(45, 40%, 55%)" stroke="black" stroke-width="1" />
        <!-- надпис на нота --><text x="40" y="145" fill="black" font-size="0.4em" dominant-baseline="middle" text-anchor="middle">0</text>
      <!-- нота --><rect x="60" y="140" width="40" height="10" fill="hsl(45, 40%, 55%)" stroke="black" stroke-width="1" />
        <!-- надпис на нота --><text x="80" y="145" fill="black" font-size="0.4em" dominant-baseline="middle" text-anchor="middle">0</text>
      <!-- нота --><rect x="100" y="140" width="40" height="10" fill="hsl(45, 40%, 55%)" stroke="black" stroke-width="1" />
        <!-- надпис на нота --><text x="120" y="145" fill="black" font-size="0.4em" dominant-baseline="middle" text-anchor="middle">0</text>
      <!-- нота --><rect x="140" y="180" width="30" height="10" fill="hsl(322, 40%, 35%)" stroke="black" stroke-width="1" />
        <!-- надпис на нота --><text x="155" y="185" fill="black" font-size="0.4em" dominant-baseline="middle" text-anchor="middle">8</text>
      <!-- нота --><rect x="170" y="110" width="10" height="10" fill="hsl(138, 40%, 55%)" stroke="black" stroke-width="1" />
        <!-- надпис на нота --><text x="175" y="115" fill="black" font-size="0.4em" dominant-baseline="middle" text-anchor="middle">3</text>
      <!-- хоризонтална линия в такта --><line x1="20" y1="180" x2="180" y2="180" stroke="black" stroke-width="2" />
      <!-- хоризонтална линия в такта --><line x1="20" y1="170" x2="180" y2="170" stroke="black" stroke-width="1" />
      <!-- хоризонтална линия в такта --><line x1="20" y1="160" x2="180" y2="160" stroke="black" stroke-width="1" />
      <!-- хоризонтална линия в такта --><line x1="20" y1="150" x2="180" y2="150" stroke="black" stroke-width="4" />
      <!-- хоризонтална линия в такта --><line x1="20" y1="140" x2="180" y2="140" stroke="black" stroke-width="1" />
      <!-- хоризонтална линия в такта --><line x1="20" y1="130" x2="180" y2="130" stroke="black" stroke-width="1" />
      <!-- хоризонтална линия в такта --><line x1="20" y1="120" x2="180" y2="120" stroke="black" stroke-width="2" />
      <!-- хоризонтална линия в такта --><line x1="20" y1="110" x2="180" y2="110" stroke="black" stroke-width="1" />
      <!-- хоризонтална линия в такта --><line x1="20" y1="100" x2="180" y2="100" stroke="black" stroke-width="1" />
      <!-- хоризонтална линия в такта --><line x1="20" y1="90" x2="180" y2="90" stroke="black" stroke-width="2" />
      <!-- хоризонтална линия в такта --><line x1="20" y1="80" x2="180" y2="80" stroke="black" stroke-width="1" />
      <!-- хоризонтална линия в такта --><line x1="20" y1="70" x2="180" y2="70" stroke="black" stroke-width="1" />
      <!-- хоризонтална линия в такта --><line x1="20" y1="60" x2="180" y2="60" stroke="black" stroke-width="2" />
      <!-- хоризонтална линия в такта --><line x1="20" y1="50" x2="180" y2="50" stroke="black" stroke-width="1" />
      <!-- хоризонтална линия в такта --><line x1="20" y1="40" x2="180" y2="40" stroke="black" stroke-width="1" />
      <!-- хоризонтална линия в такта --><line x1="20" y1="30" x2="180" y2="30" stroke="black" stroke-width="4" />
      <!-- рамка на такт --><rect x="20" y="20" width="160" height="170" fill-opacity="0.0" stroke="black" stroke-width="4" />
    <!-- такт -->
      <!-- вертикална линия в такта --><line x1="190" y1="20" x2="190" y2="190" stroke="black" stroke-width="1" />
      <!-- вертикална линия в такта --><line x1="200" y1="20" x2="200" y2="190" stroke="black" stroke-width="1" />
      <!-- вертикална линия в такта --><line x1="210" y1="20" x2="210" y2="190" stroke="black" stroke-width="1" />
      <!-- вертикална линия в такта --><line x1="220" y1="20" x2="220" y2="190" stroke="black" stroke-width="2" />
      <!-- вертикална линия в такта --><line x1="230" y1="20" x2="230" y2="190" stroke="black" stroke-width="1" />
      <!-- вертикална линия в такта --><line x1="240" y1="20" x2="240" y2="190" stroke="black" stroke-width="1" />
      <!-- вертикална линия в такта --><line x1="250" y1="20" x2="250" y2="190" stroke="black" stroke-width="1" />
      <!-- вертикална линия в такта --><line x1="260" y1="20" x2="260" y2="190" stroke="black" stroke-width="2" />
      <!-- вертикална линия в такта --><line x1="270" y1="20" x2="270" y2="190" stroke="black" stroke-width="1" />
      <!-- вертикална линия в такта --><line x1="280" y1="20" x2="280" y2="190" stroke="black" stroke-width="1" />
      <!-- вертикална линия в такта --><line x1="290" y1="20" x2="290" y2="190" stroke="black" stroke-width="1" />
      <!-- вертикална линия в такта --><line x1="300" y1="20" x2="300" y2="190" stroke="black" stroke-width="2" />
      <!-- вертикална линия в такта --><line x1="310" y1="20" x2="310" y2="190" stroke="black" stroke-width="1" />
      <!-- вертикална линия в такта --><line x1="320" y1="20" x2="320" y2="190" stroke="black" stroke-width="1" />
      <!-- вертикална линия в такта --><line x1="330" y1="20" x2="330" y2="190" stroke="black" stroke-width="1" />
      <!-- нота --><rect x="180" y="140" width="40" height="10" fill="hsl(45, 40%, 55%)" stroke="black" stroke-width="1" />
        <!-- надпис на нота --><text x="200" y="145" fill="black" font-size="0.4em" dominant-baseline="middle" text-anchor="middle">0</text>
      <!-- нота --><rect x="220" y="180" width="30" height="10" fill="hsl(322, 40%, 35%)" stroke="black" stroke-width="1" />
        <!-- надпис на нота --><text x="235" y="185" fill="black" font-size="0.4em" dominant-baseline="middle" text-anchor="middle">8</text>
      <!-- нота --><rect x="250" y="110" width="10" height="10" fill="hsl(138, 40%, 55%)" stroke="black" stroke-width="1" />
        <!-- надпис на нота --><text x="255" y="115" fill="black" font-size="0.4em" dominant-baseline="middle" text-anchor="middle">3</text>
      <!-- нота --><rect x="260" y="140" width="80" height="10" fill="hsl(45, 40%, 55%)" stroke="black" stroke-width="1" />
        <!-- надпис на нота --><text x="300" y="145" fill="black" font-size="0.4em" dominant-baseline="middle" text-anchor="middle">0</text>
      <!-- хоризонтална линия в такта --><line x1="180" y1="180" x2="340" y2="180" stroke="black" stroke-width="2" />
      <!-- хоризонтална линия в такта --><line x1="180" y1="170" x2="340" y2="170" stroke="black" stroke-width="1" />
      <!-- хоризонтална линия в такта --><line x1="180" y1="160" x2="340" y2="160" stroke="black" stroke-width="1" />
      <!-- хоризонтална линия в такта --><line x1="180" y1="150" x2="340" y2="150" stroke="black" stroke-width="4" />
      <!-- хоризонтална линия в такта --><line x1="180" y1="140" x2="340" y2="140" stroke="black" stroke-width="1" />
      <!-- хоризонтална линия в такта --><line x1="180" y1="130" x2="340" y2="130" stroke="black" stroke-width="1" />
      <!-- хоризонтална линия в такта --><line x1="180" y1="120" x2="340" y2="120" stroke="black" stroke-width="2" />
      <!-- хоризонтална линия в такта --><line x1="180" y1="110" x2="340" y2="110" stroke="black" stroke-width="1" />
      <!-- хоризонтална линия в такта --><line x1="180" y1="100" x2="340" y2="100" stroke="black" stroke-width="1" />
      <!-- хоризонтална линия в такта --><line x1="180" y1="90" x2="340" y2="90" stroke="black" stroke-width="2" />
      <!-- хоризонтална линия в такта --><line x1="180" y1="80" x2="340" y2="80" stroke="black" stroke-width="1" />
      <!-- хоризонтална линия в такта --><line x1="180" y1="70" x2="340" y2="70" stroke="black" stroke-width="1" />
      <!-- хоризонтална линия в такта --><line x1="180" y1="60" x2="340" y2="60" stroke="black" stroke-width="2" />
      <!-- хоризонтална линия в такта --><line x1="180" y1="50" x2="340" y2="50" stroke="black" stroke-width="1" />
      <!-- хоризонтална линия в такта --><line x1="180" y1="40" x2="340" y2="40" stroke="black" stroke-width="1" />
      <!-- хоризонтална линия в такта --><line x1="180" y1="30" x2="340" y2="30" stroke="black" stroke-width="4" />
      <!-- рамка на такт --><rect x="180" y="20" width="160" height="170" fill-opacity="0.0" stroke="black" stroke-width="4" />
    <!-- такт -->
      <!-- вертикална линия в такта --><line x1="350" y1="20" x2="350" y2="190" stroke="black" stroke-width="1" />
      <!-- вертикална линия в такта --><line x1="360" y1="20" x2="360" y2="190" stroke="black" stroke-width="1" />
      <!-- вертикална линия в такта --><line x1="370" y1="20" x2="370" y2="190" stroke="black" stroke-width="1" />
      <!-- вертикална линия в такта --><line x1="380" y1="20" x2="380" y2="190" stroke="black" stroke-width="2" />
      <!-- вертикална линия в такта --><line x1="390" y1="20" x2="390" y2="190" stroke="black" stroke-width="1" />
      <!-- вертикална линия в такта --><line x1="400" y1="20" x2="400" y2="190" stroke="black" stroke-width="1" />
      <!-- вертикална линия в такта --><line x1="410" y1="20" x2="410" y2="190" stroke="black" stroke-width="1" />
      <!-- вертикална линия в такта --><line x1="420" y1="20" x2="420" y2="190" stroke="black" stroke-width="2" />
      <!-- вертикална линия в такта --><line x1="430" y1="20" x2="430" y2="190" stroke="black" stroke-width="1" />
      <!-- вертикална линия в такта --><line x1="440" y1="20" x2="440" y2="190" stroke="black" stroke-width="1" />
      <!-- вертикална линия в такта --><line x1="450" y1="20" x2="450" y2="190" stroke="black" stroke-width="1" />
      <!-- вертикална линия в такта --><line x1="460" y1="20" x2="460" y2="190" stroke="black" stroke-width="2" />
      <!-- вертикална линия в такта --><line x1="470" y1="20" x2="470" y2="190" stroke="black" stroke-width="1" />
      <!-- вертикална линия в такта --><line x1="480" y1="20" x2="480" y2="190" stroke="black" stroke-width="1" />
      <!-- вертикална линия в такта --><line x1="490" y1="20" x2="490" y2="190" stroke="black" stroke-width="1" />
      <!-- нота --><rect x="340" y="70" width="40" height="10" fill="hsl(300, 40%, 55%)" stroke="black" stroke-width="1" />
        <!-- надпис на нота --><text x="360" y="75" fill="black" font-size="0.4em" dominant-baseline="middle" text-anchor="middle">7</text>
      <!-- нота --><rect x="380" y="70" width="40" height="10" fill="hsl(300, 40%, 55%)" stroke="black" stroke-width="1" />
        <!-- надпис на нота --><text x="400" y="75" fill="black" font-size="0.4em" dominant-baseline="middle" text-anchor="middle">7</text>
      <!-- нота --><rect x="420" y="70" width="40" height="10" fill="hsl(300, 40%, 55%)" stroke="black" stroke-width="1" />
        <!-- надпис на нота --><text x="440" y="75" fill="black" font-size="0.4em" dominant-baseline="middle" text-anchor="middle">7</text>
      <!-- нота --><rect x="460" y="60" width="30" height="10" fill="hsl(322, 40%, 55%)" stroke="black" stroke-width="1" />
        <!-- надпис на нота --><text x="475" y="65" fill="black" font-size="0.4em" dominant-baseline="middle" text-anchor="middle">8</text>
      <!-- нота --><rect x="490" y="110" width="10" height="10" fill="hsl(138, 40%, 55%)" stroke="black" stroke-width="1" />
        <!-- надпис на нота --><text x="495" y="115" fill="black" font-size="0.4em" dominant-baseline="middle" text-anchor="middle">3</text>
      <!-- хоризонтална линия в такта --><line x1="340" y1="180" x2="500" y2="180" stroke="black" stroke-width="2" />
      <!-- хоризонтална линия в такта --><line x1="340" y1="170" x2="500" y2="170" stroke="black" stroke-width="1" />
      <!-- хоризонтална линия в такта --><line x1="340" y1="160" x2="500" y2="160" stroke="black" stroke-width="1" />
      <!-- хоризонтална линия в такта --><line x1="340" y1="150" x2="500" y2="150" stroke="black" stroke-width="4" />
      <!-- хоризонтална линия в такта --><line x1="340" y1="140" x2="500" y2="140" stroke="black" stroke-width="1" />
      <!-- хоризонтална линия в такта --><line x1="340" y1="130" x2="500" y2="130" stroke="black" stroke-width="1" />
      <!-- хоризонтална линия в такта --><line x1="340" y1="120" x2="500" y2="120" stroke="black" stroke-width="2" />
      <!-- хоризонтална линия в такта --><line x1="340" y1="110" x2="500" y2="110" stroke="black" stroke-width="1" />
      <!-- хоризонтална линия в такта --><line x1="340" y1="100" x2="500" y2="100" stroke="black" stroke-width="1" />
      <!-- хоризонтална линия в такта --><line x1="340" y1="90" x2="500" y2="90" stroke="black" stroke-width="2" />
      <!-- хоризонтална линия в такта --><line x1="340" y1="80" x2="500" y2="80" stroke="black" stroke-width="1" />
      <!-- хоризонтална линия в такта --><line x1="340" y1="70" x2="500" y2="70" stroke="black" stroke-width="1" />
      <!-- хоризонтална линия в такта --><line x1="340" y1="60" x2="500" y2="60" stroke="black" stroke-width="2" />
      <!-- хоризонтална линия в такта --><line x1="340" y1="50" x2="500" y2="50" stroke="black" stroke-width="1" />
      <!-- хоризонтална линия в такта --><line x1="340" y1="40" x2="500" y2="40" stroke="black" stroke-width="1" />
      <!-- хоризонтална линия в такта --><line x1="340" y1="30" x2="500" y2="30" stroke="black" stroke-width="4" />
      <!-- рамка на такт --><rect x="340" y="20" width="160" height="170" fill-opacity="0.0" stroke="black" stroke-width="4" />
    <!-- такт -->
      <!-- вертикална линия в такта --><line x1="510" y1="20" x2="510" y2="190" stroke="black" stroke-width="1" />
      <!-- вертикална линия в такта --><line x1="520" y1="20" x2="520" y2="190" stroke="black" stroke-width="1" />
      <!-- вертикална линия в такта --><line x1="530" y1="20" x2="530" y2="190" stroke="black" stroke-width="1" />
      <!-- вертикална линия в такта --><line x1="540" y1="20" x2="540" y2="190" stroke="black" stroke-width="2" />
      <!-- вертикална линия в такта --><line x1="550" y1="20" x2="550" y2="190" stroke="black" stroke-width="1" />
      <!-- вертикална линия в такта --><line x1="560" y1="20" x2="560" y2="190" stroke="black" stroke-width="1" />
      <!-- вертикална линия в такта --><line x1="570" y1="20" x2="570" y2="190" stroke="black" stroke-width="1" />
      <!-- вертикална линия в такта --><line x1="580" y1="20" x2="580" y2="190" stroke="black" stroke-width="2" />
      <!-- вертикална линия в такта --><line x1="590" y1="20" x2="590" y2="190" stroke="black" stroke-width="1" />
      <!-- вертикална линия в такта --><line x1="600" y1="20" x2="600" y2="190" stroke="black" stroke-width="1" />
      <!-- вертикална линия в такта --><line x1="610" y1="20" x2="610" y2="190" stroke="black" stroke-width="1" />
      <!-- вертикална линия в такта --><line x1="620" y1="20" x2="620" y2="190" stroke="black" stroke-width="2" />
      <!-- вертикална линия в такта --><line x1="630" y1="20" x2="630" y2="190" stroke="black" stroke-width="1" />
      <!-- вертикална линия в такта --><line x1="640" y1="20" x2="640" y2="190" stroke="black" stroke-width="1" />
      <!-- вертикална линия в такта --><line x1="650" y1="20" x2="650" y2="190" stroke="black" stroke-width="1" />
      <!-- нота --><rect x="500" y="150" width="40" height="10" fill="hsl(30, 40%, 35%)" stroke="black" stroke-width="1" />
        <!-- надпис на нота --><text x="520" y="155" fill="black" font-size="0.4em" dominant-baseline="middle" text-anchor="middle">11</text>
      <!-- нота --><rect x="540" y="180" width="30" height="10" fill="hsl(322, 40%, 35%)" stroke="black" stroke-width="1" />
        <!-- надпис на нота --><text x="555" y="185" fill="black" font-size="0.4em" dominant-baseline="middle" text-anchor="middle">8</text>
      <!-- нота --><rect x="570" y="110" width="10" height="10" fill="hsl(138, 40%, 55%)" stroke="black" stroke-width="1" />
        <!-- надпис на нота --><text x="575" y="115" fill="black" font-size="0.4em" dominant-baseline="middle" text-anchor="middle">3</text>
      <!-- нота --><rect x="580" y="140" width="80" height="10" fill="hsl(45, 40%, 55%)" stroke="black" stroke-width="1" />
        <!-- надпис на нота --><text x="620" y="145" fill="black" font-size="0.4em" dominant-baseline="middle" text-anchor="middle">0</text>
      <!-- хоризонтална линия в такта --><line x1="500" y1="180" x2="660" y2="180" stroke="black" stroke-width="2" />
      <!-- хоризонтална линия в такта --><line x1="500" y1="170" x2="660" y2="170" stroke="black" stroke-width="1" />
      <!-- хоризонтална линия в такта --><line x1="500" y1="160" x2="660" y2="160" stroke="black" stroke-width="1" />
      <!-- хоризонтална линия в такта --><line x1="500" y1="150" x2="660" y2="150" stroke="black" stroke-width="4" />
      <!-- хоризонтална линия в такта --><line x1="500" y1="140" x2="660" y2="140" stroke="black" stroke-width="1" />
      <!-- хоризонтална линия в такта --><line x1="500" y1="130" x2="660" y2="130" stroke="black" stroke-width="1" />
      <!-- хоризонтална линия в такта --><line x1="500" y1="120" x2="660" y2="120" stroke="black" stroke-width="2" />
      <!-- хоризонтална линия в такта --><line x1="500" y1="110" x2="660" y2="110" stroke="black" stroke-width="1" />
      <!-- хоризонтална линия в такта --><line x1="500" y1="100" x2="660" y2="100" stroke="black" stroke-width="1" />
      <!-- хоризонтална линия в такта --><line x1="500" y1="90" x2="660" y2="90" stroke="black" stroke-width="2" />
      <!-- хоризонтална линия в такта --><line x1="500" y1="80" x2="660" y2="80" stroke="black" stroke-width="1" />
      <!-- хоризонтална линия в такта --><line x1="500" y1="70" x2="660" y2="70" stroke="black" stroke-width="1" />
      <!-- хоризонтална линия в такта --><line x1="500" y1="60" x2="660" y2="60" stroke="black" stroke-width="2" />
      <!-- хоризонтална линия в такта --><line x1="500" y1="50" x2="660" y2="50" stroke="black" stroke-width="1" />
      <!-- хоризонтална линия в такта --><line x1="500" y1="40" x2="660" y2="40" stroke="black" stroke-width="1" />
      <!-- хоризонтална линия в такта --><line x1="500" y1="30" x2="660" y2="30" stroke="black" stroke-width="4" />
      <!-- рамка на такт --><rect x="500" y="20" width="160" height="170" fill-opacity="0.0" stroke="black" stroke-width="4" />
    <!-- такт -->
      <!-- вертикална линия в такта --><line x1="670" y1="20" x2="670" y2="190" stroke="black" stroke-width="1" />
      <!-- вертикална линия в такта --><line x1="680" y1="20" x2="680" y2="190" stroke="black" stroke-width="1" />
      <!-- вертикална линия в такта --><line x1="690" y1="20" x2="690" y2="190" stroke="black" stroke-width="1" />
      <!-- вертикална линия в такта --><line x1="700" y1="20" x2="700" y2="190" stroke="black" stroke-width="2" />
      <!-- вертикална линия в такта --><line x1="710" y1="20" x2="710" y2="190" stroke="black" stroke-width="1" />
      <!-- вертикална линия в такта --><line x1="720" y1="20" x2="720" y2="190" stroke="black" stroke-width="1" />
      <!-- вертикална линия в такта --><line x1="730" y1="20" x2="730" y2="190" stroke="black" stroke-width="1" />
      <!-- вертикална линия в такта --><line x1="740" y1="20" x2="740" y2="190" stroke="black" stroke-width="2" />
      <!-- вертикална линия в такта --><line x1="750" y1="20" x2="750" y2="190" stroke="black" stroke-width="1" />
      <!-- вертикална линия в такта --><line x1="760" y1="20" x2="760" y2="190" stroke="black" stroke-width="1" />
      <!-- вертикална линия в такта --><line x1="770" y1="20" x2="770" y2="190" stroke="black" stroke-width="1" />
      <!-- вертикална линия в такта --><line x1="780" y1="20" x2="780" y2="190" stroke="black" stroke-width="2" />
      <!-- вертикална линия в такта --><line x1="790" y1="20" x2="790" y2="190" stroke="black" stroke-width="1" />
      <!-- вертикална линия в такта --><line x1="800" y1="20" x2="800" y2="190" stroke="black" stroke-width="1" />
      <!-- вертикална линия в такта --><line x1="810" y1="20" x2="810" y2="190" stroke="black" stroke-width="1" />
      <!-- нота --><rect x="660" y="20" width="40" height="10" fill="hsl(45, 40%, 80%)" stroke="black" stroke-width="1" />
        <!-- надпис на нота --><text x="680" y="25" fill="black" font-size="0.4em" dominant-baseline="middle" text-anchor="middle">0</text>
      <!-- нота --><rect x="700" y="140" width="30" height="10" fill="hsl(45, 40%, 55%)" stroke="black" stroke-width="1" />
        <!-- надпис на нота --><text x="715" y="145" fill="black" font-size="0.4em" dominant-baseline="middle" text-anchor="middle">0</text>
      <!-- нота --><rect x="730" y="140" width="10" height="10" fill="hsl(45, 40%, 55%)" stroke="black" stroke-width="1" />
        <!-- надпис на нота --><text x="735" y="145" fill="black" font-size="0.4em" dominant-baseline="middle" text-anchor="middle">0</text>
      <!-- нота --><rect x="740" y="20" width="40" height="10" fill="hsl(45, 40%, 80%)" stroke="black" stroke-width="1" />
        <!-- надпис на нота --><text x="760" y="25" fill="black" font-size="0.4em" dominant-baseline="middle" text-anchor="middle">0</text>
      <!-- нота --><rect x="780" y="30" width="30" height="10" fill="hsl(30, 40%, 55%)" stroke="black" stroke-width="1" />
        <!-- надпис на нота --><text x="795" y="35" fill="black" font-size="0.4em" dominant-baseline="middle" text-anchor="middle">11</text>
      <!-- нота --><rect x="810" y="40" width="10" height="10" fill="hsl(22, 40%, 55%)" stroke="black" stroke-width="1" />
        <!-- надпис на нота --><text x="815" y="45" fill="black" font-size="0.4em" dominant-baseline="middle" text-anchor="middle">10</text>
      <!-- хоризонтална линия в такта --><line x1="660" y1="180" x2="820" y2="180" stroke="black" stroke-width="2" />
      <!-- хоризонтална линия в такта --><line x1="660" y1="170" x2="820" y2="170" stroke="black" stroke-width="1" />
      <!-- хоризонтална линия в такта --><line x1="660" y1="160" x2="820" y2="160" stroke="black" stroke-width="1" />
      <!-- хоризонтална линия в такта --><line x1="660" y1="150" x2="820" y2="150" stroke="black" stroke-width="4" />
      <!-- хоризонтална линия в такта --><line x1="660" y1="140" x2="820" y2="140" stroke="black" stroke-width="1" />
      <!-- хоризонтална линия в такта --><line x1="660" y1="130" x2="820" y2="130" stroke="black" stroke-width="1" />
      <!-- хоризонтална линия в такта --><line x1="660" y1="120" x2="820" y2="120" stroke="black" stroke-width="2" />
      <!-- хоризонтална линия в такта --><line x1="660" y1="110" x2="820" y2="110" stroke="black" stroke-width="1" />
      <!-- хоризонтална линия в такта --><line x1="660" y1="100" x2="820" y2="100" stroke="black" stroke-width="1" />
      <!-- хоризонтална линия в такта --><line x1="660" y1="90" x2="820" y2="90" stroke="black" stroke-width="2" />
      <!-- хоризонтална линия в такта --><line x1="660" y1="80" x2="820" y2="80" stroke="black" stroke-width="1" />
      <!-- хоризонтална линия в такта --><line x1="660" y1="70" x2="820" y2="70" stroke="black" stroke-width="1" />
      <!-- хоризонтална линия в такта --><line x1="660" y1="60" x2="820" y2="60" stroke="black" stroke-width="2" />
      <!-- хоризонтална линия в такта --><line x1="660" y1="50" x2="820" y2="50" stroke="black" stroke-width="1" />
      <!-- хоризонтална линия в такта --><line x1="660" y1="40" x2="820" y2="40" stroke="black" stroke-width="1" />
      <!-- хоризонтална линия в такта --><line x1="660" y1="30" x2="820" y2="30" stroke="black" stroke-width="4" />
      <!-- рамка на такт --><rect x="660" y="20" width="160" height="170" fill-opacity="0.0" stroke="black" stroke-width="4" />
    <!-- такт -->
      <!-- вертикална линия в такта --><line x1="830" y1="20" x2="830" y2="190" stroke="black" stroke-width="1" />
      <!-- вертикална линия в такта --><line x1="840" y1="20" x2="840" y2="190" stroke="black" stroke-width="1" />
      <!-- вертикална линия в такта --><line x1="850" y1="20" x2="850" y2="190" stroke="black" stroke-width="1" />
      <!-- вертикална линия в такта --><line x1="860" y1="20" x2="860" y2="190" stroke="black" stroke-width="2" />
      <!-- вертикална линия в такта --><line x1="870" y1="20" x2="870" y2="190" stroke="black" stroke-width="1" />
      <!-- вертикална линия в такта --><line x1="880" y1="20" x2="880" y2="190" stroke="black" stroke-width="1" />
      <!-- вертикална линия в такта --><line x1="890" y1="20" x2="890" y2="190" stroke="black" stroke-width="1" />
      <!-- вертикална линия в такта --><line x1="900" y1="20" x2="900" y2="190" stroke="black" stroke-width="2" />
      <!-- вертикална линия в такта --><line x1="910" y1="20" x2="910" y2="190" stroke="black" stroke-width="1" />
      <!-- вертикална линия в такта --><line x1="920" y1="20" x2="920" y2="190" stroke="black" stroke-width="1" />
      <!-- вертикална линия в такта --><line x1="930" y1="20" x2="930" y2="190" stroke="black" stroke-width="1" />
      <!-- вертикална линия в такта --><line x1="940" y1="20" x2="940" y2="190" stroke="black" stroke-width="2" />
      <!-- вертикална линия в такта --><line x1="950" y1="20" x2="950" y2="190" stroke="black" stroke-width="1" />
      <!-- вертикална линия в такта --><line x1="960" y1="20" x2="960" y2="190" stroke="black" stroke-width="1" />
      <!-- вертикална линия в такта --><line x1="970" y1="20" x2="970" y2="190" stroke="black" stroke-width="1" />
      <!-- нота --><rect x="820" y="50" width="10" height="10" fill="hsl(5, 40%, 55%)" stroke="black" stroke-width="1" />
        <!-- надпис на нота --><text x="825" y="55" fill="black" font-size="0.4em" dominant-baseline="middle" text-anchor="middle">9</text>
      <!-- нота --><rect x="830" y="60" width="10" height="10" fill="hsl(322, 40%, 55%)" stroke="black" stroke-width="1" />
        <!-- надпис на нота --><text x="835" y="65" fill="black" font-size="0.4em" dominant-baseline="middle" text-anchor="middle">8</text>
      <!-- нота --><rect x="840" y="50" width="20" height="10" fill="hsl(5, 40%, 55%)" stroke="black" stroke-width="1" />
        <!-- надпис на нота --><text x="850" y="55" fill="black" font-size="0.4em" dominant-baseline="middle" text-anchor="middle">9</text>
      <!-- нота --><rect x="880" y="130" width="20" height="10" fill="hsl(60, 40%, 55%)" stroke="black" stroke-width="1" />
        <!-- надпис на нота --><text x="890" y="135" fill="black" font-size="0.4em" dominant-baseline="middle" text-anchor="middle">1</text>
      <!-- нота --><rect x="900" y="80" width="40" height="10" fill="hsl(264, 40%, 55%)" stroke="black" stroke-width="1" />
        <!-- надпис на нота --><text x="920" y="85" fill="black" font-size="0.4em" dominant-baseline="middle" text-anchor="middle">6</text>
      <!-- нота --><rect x="940" y="90" width="30" height="10" fill="hsl(224, 40%, 55%)" stroke="black" stroke-width="1" />
        <!-- надпис на нота --><text x="955" y="95" fill="black" font-size="0.4em" dominant-baseline="middle" text-anchor="middle">5</text>
      <!-- нота --><rect x="970" y="100" width="10" height="10" fill="hsl(164, 40%, 55%)" stroke="black" stroke-width="1" />
        <!-- надпис на нота --><text x="975" y="105" fill="black" font-size="0.4em" dominant-baseline="middle" text-anchor="middle">4</text>
      <!-- хоризонтална линия в такта --><line x1="820" y1="180" x2="980" y2="180" stroke="black" stroke-width="2" />
      <!-- хоризонтална линия в такта --><line x1="820" y1="170" x2="980" y2="170" stroke="black" stroke-width="1" />
      <!-- хоризонтална линия в такта --><line x1="820" y1="160" x2="980" y2="160" stroke="black" stroke-width="1" />
      <!-- хоризонтална линия в такта --><line x1="820" y1="150" x2="980" y2="150" stroke="black" stroke-width="4" />
      <!-- хоризонтална линия в такта --><line x1="820" y1="140" x2="980" y2="140" stroke="black" stroke-width="1" />
      <!-- хоризонтална линия в такта --><line x1="820" y1="130" x2="980" y2="130" stroke="black" stroke-width="1" />
      <!-- хоризонтална линия в такта --><line x1="820" y1="120" x2="980" y2="120" stroke="black" stroke-width="2" />
      <!-- хоризонтална линия в такта --><line x1="820" y1="110" x2="980" y2="110" stroke="black" stroke-width="1" />
      <!-- хоризонтална линия в такта --><line x1="820" y1="100" x2="980" y2="100" stroke="black" stroke-width="1" />
      <!-- хоризонтална линия в такта --><line x1="820" y1="90" x2="980" y2="90" stroke="black" stroke-width="2" />
      <!-- хоризонтална линия в такта --><line x1="820" y1="80" x2="980" y2="80" stroke="black" stroke-width="1" />
      <!-- хоризонтална линия в такта --><line x1="820" y1="70" x2="980" y2="70" stroke="black" stroke-width="1" />
      <!-- хоризонтална линия в такта --><line x1="820" y1="60" x2="980" y2="60" stroke="black" stroke-width="2" />
      <!-- хоризонтална линия в такта --><line x1="820" y1="50" x2="980" y2="50" stroke="black" stroke-width="1" />
      <!-- хоризонтална линия в такта --><line x1="820" y1="40" x2="980" y2="40" stroke="black" stroke-width="1" />
      <!-- хоризонтална линия в такта --><line x1="820" y1="30" x2="980" y2="30" stroke="black" stroke-width="4" />
      <!-- рамка на такт --><rect x="820" y="20" width="160" height="170" fill-opacity="0.0" stroke="black" stroke-width="4" />
    <!-- такт -->
      <!-- вертикална линия в такта --><line x1="990" y1="20" x2="990" y2="190" stroke="black" stroke-width="1" />
      <!-- вертикална линия в такта --><line x1="1000" y1="20" x2="1000" y2="190" stroke="black" stroke-width="1" />
      <!-- вертикална линия в такта --><line x1="1010" y1="20" x2="1010" y2="190" stroke="black" stroke-width="1" />
      <!-- вертикална линия в такта --><line x1="1020" y1="20" x2="1020" y2="190" stroke="black" stroke-width="2" />
      <!-- вертикална линия в такта --><line x1="1030" y1="20" x2="1030" y2="190" stroke="black" stroke-width="1" />
      <!-- вертикална линия в такта --><line x1="1040" y1="20" x2="1040" y2="190" stroke="black" stroke-width="1" />
      <!-- вертикална линия в такта --><line x1="1050" y1="20" x2="1050" y2="190" stroke="black" stroke-width="1" />
      <!-- вертикална линия в такта --><line x1="1060" y1="20" x2="1060" y2="190" stroke="black" stroke-width="2" />
      <!-- вертикална линия в такта --><line x1="1070" y1="20" x2="1070" y2="190" stroke="black" stroke-width="1" />
      <!-- вертикална линия в такта --><line x1="1080" y1="20" x2="1080" y2="190" stroke="black" stroke-width="1" />
      <!-- вертикална линия в такта --><line x1="1090" y1="20" x2="1090" y2="190" stroke="black" stroke-width="1" />
      <!-- вертикална линия в такта --><line x1="1100" y1="20" x2="1100" y2="190" stroke="black" stroke-width="2" />
      <!-- вертикална линия в такта --><line x1="1110" y1="20" x2="1110" y2="190" stroke="black" stroke-width="1" />
      <!-- вертикална линия в такта --><line x1="1120" y1="20" x2="1120" y2="190" stroke="black" stroke-width="1" />
      <!-- вертикална линия в такта --><line x1="1130" y1="20" x2="1130" y2="190" stroke="black" stroke-width="1" />
      <!-- нота --><rect x="980" y="110" width="10" height="10" fill="hsl(138, 40%, 55%)" stroke="black" stroke-width="1" />
        <!-- надпис на нота --><text x="985" y="115" fill="black" font-size="0.4em" dominant-baseline="middle" text-anchor="middle">3</text>
      <!-- нота --><rect x="990" y="120" width="10" height="10" fill="hsl(87, 40%, 55%)" stroke="black" stroke-width="1" />
        <!-- надпис на нота --><text x="995" y="125" fill="black" font-size="0.4em" dominant-baseline="middle" text-anchor="middle">2</text>
      <!-- нота --><rect x="1000" y="110" width="20" height="10" fill="hsl(138, 40%, 55%)" stroke="black" stroke-width="1" />
        <!-- надпис на нота --><text x="1010" y="115" fill="black" font-size="0.4em" dominant-baseline="middle" text-anchor="middle">3</text>
      <!-- нота --><rect x="1040" y="180" width="20" height="10" fill="hsl(322, 40%, 35%)" stroke="black" stroke-width="1" />
        <!-- надпис на нота --><text x="1050" y="185" fill="black" font-size="0.4em" dominant-baseline="middle" text-anchor="middle">8</text>
      <!-- нота --><rect x="1060" y="150" width="40" height="10" fill="hsl(30, 40%, 35%)" stroke="black" stroke-width="1" />
        <!-- надпис на нота --><text x="1080" y="155" fill="black" font-size="0.4em" dominant-baseline="middle" text-anchor="middle">11</text>
      <!-- нота --><rect x="1100" y="180" width="30" height="10" fill="hsl(322, 40%, 35%)" stroke="black" stroke-width="1" />
        <!-- надпис на нота --><text x="1115" y="185" fill="black" font-size="0.4em" dominant-baseline="middle" text-anchor="middle">8</text>
      <!-- нота --><rect x="1130" y="140" width="10" height="10" fill="hsl(45, 40%, 55%)" stroke="black" stroke-width="1" />
        <!-- надпис на нота --><text x="1135" y="145" fill="black" font-size="0.4em" dominant-baseline="middle" text-anchor="middle">0</text>
      <!-- хоризонтална линия в такта --><line x1="980" y1="180" x2="1140" y2="180" stroke="black" stroke-width="2" />
      <!-- хоризонтална линия в такта --><line x1="980" y1="170" x2="1140" y2="170" stroke="black" stroke-width="1" />
      <!-- хоризонтална линия в такта --><line x1="980" y1="160" x2="1140" y2="160" stroke="black" stroke-width="1" />
      <!-- хоризонтална линия в такта --><line x1="980" y1="150" x2="1140" y2="150" stroke="black" stroke-width="4" />
      <!-- хоризонтална линия в такта --><line x1="980" y1="140" x2="1140" y2="140" stroke="black" stroke-width="1" />
      <!-- хоризонтална линия в такта --><line x1="980" y1="130" x2="1140" y2="130" stroke="black" stroke-width="1" />
      <!-- хоризонтална линия в такта --><line x1="980" y1="120" x2="1140" y2="120" stroke="black" stroke-width="2" />
      <!-- хоризонтална линия в такта --><line x1="980" y1="110" x2="1140" y2="110" stroke="black" stroke-width="1" />
      <!-- хоризонтална линия в такта --><line x1="980" y1="100" x2="1140" y2="100" stroke="black" stroke-width="1" />
      <!-- хоризонтална линия в такта --><line x1="980" y1="90" x2="1140" y2="90" stroke="black" stroke-width="2" />
      <!-- хоризонтална линия в такта --><line x1="980" y1="80" x2="1140" y2="80" stroke="black" stroke-width="1" />
      <!-- хоризонтална линия в такта --><line x1="980" y1="70" x2="1140" y2="70" stroke="black" stroke-width="1" />
      <!-- хоризонтална линия в такта --><line x1="980" y1="60" x2="1140" y2="60" stroke="black" stroke-width="2" />
      <!-- хоризонтална линия в такта --><line x1="980" y1="50" x2="1140" y2="50" stroke="black" stroke-width="1" />
      <!-- хоризонтална линия в такта --><line x1="980" y1="40" x2="1140" y2="40" stroke="black" stroke-width="1" />
      <!-- хоризонтална линия в такта --><line x1="980" y1="30" x2="1140" y2="30" stroke="black" stroke-width="4" />
      <!-- рамка на такт --><rect x="980" y="20" width="160" height="170" fill-opacity="0.0" stroke="black" stroke-width="4" />
    <!-- такт -->
      <!-- вертикална линия в такта --><line x1="1150" y1="20" x2="1150" y2="190" stroke="black" stroke-width="1" />
      <!-- вертикална линия в такта --><line x1="1160" y1="20" x2="1160" y2="190" stroke="black" stroke-width="1" />
      <!-- вертикална линия в такта --><line x1="1170" y1="20" x2="1170" y2="190" stroke="black" stroke-width="1" />
      <!-- вертикална линия в такта --><line x1="1180" y1="20" x2="1180" y2="190" stroke="black" stroke-width="2" />
      <!-- вертикална линия в такта --><line x1="1190" y1="20" x2="1190" y2="190" stroke="black" stroke-width="1" />
      <!-- вертикална линия в такта --><line x1="1200" y1="20" x2="1200" y2="190" stroke="black" stroke-width="1" />
      <!-- вертикална линия в такта --><line x1="1210" y1="20" x2="1210" y2="190" stroke="black" stroke-width="1" />
      <!-- вертикална линия в такта --><line x1="1220" y1="20" x2="1220" y2="190" stroke="black" stroke-width="2" />
      <!-- вертикална линия в такта --><line x1="1230" y1="20" x2="1230" y2="190" stroke="black" stroke-width="1" />
      <!-- вертикална линия в такта --><line x1="1240" y1="20" x2="1240" y2="190" stroke="black" stroke-width="1" />
      <!-- вертикална линия в такта --><line x1="1250" y1="20" x2="1250" y2="190" stroke="black" stroke-width="1" />
      <!-- вертикална линия в такта --><line x1="1260" y1="20" x2="1260" y2="190" stroke="black" stroke-width="2" />
      <!-- вертикална линия в такта --><line x1="1270" y1="20" x2="1270" y2="190" stroke="black" stroke-width="1" />
      <!-- вертикална линия в такта --><line x1="1280" y1="20" x2="1280" y2="190" stroke="black" stroke-width="1" />
      <!-- вертикална линия в такта --><line x1="1290" y1="20" x2="1290" y2="190" stroke="black" stroke-width="1" />
      <!-- нота --><rect x="1140" y="110" width="40" height="10" fill="hsl(138, 40%, 55%)" stroke="black" stroke-width="1" />
        <!-- надпис на нота --><text x="1160" y="115" fill="black" font-size="0.4em" dominant-baseline="middle" text-anchor="middle">3</text>
      <!-- нота --><rect x="1180" y="140" width="30" height="10" fill="hsl(45, 40%, 55%)" stroke="black" stroke-width="1" />
        <!-- надпис на нота --><text x="1195" y="145" fill="black" font-size="0.4em" dominant-baseline="middle" text-anchor="middle">0</text>
      <!-- нота --><rect x="1210" y="110" width="10" height="10" fill="hsl(138, 40%, 55%)" stroke="black" stroke-width="1" />
        <!-- надпис на нота --><text x="1215" y="115" fill="black" font-size="0.4em" dominant-baseline="middle" text-anchor="middle">3</text>
      <!-- нота --><rect x="1220" y="70" width="80" height="10" fill="hsl(300, 40%, 55%)" stroke="black" stroke-width="1" />
        <!-- надпис на нота --><text x="1260" y="75" fill="black" font-size="0.4em" dominant-baseline="middle" text-anchor="middle">7</text>
      <!-- хоризонтална линия в такта --><line x1="1140" y1="180" x2="1300" y2="180" stroke="black" stroke-width="2" />
      <!-- хоризонтална линия в такта --><line x1="1140" y1="170" x2="1300" y2="170" stroke="black" stroke-width="1" />
      <!-- хоризонтална линия в такта --><line x1="1140" y1="160" x2="1300" y2="160" stroke="black" stroke-width="1" />
      <!-- хоризонтална линия в такта --><line x1="1140" y1="150" x2="1300" y2="150" stroke="black" stroke-width="4" />
      <!-- хоризонтална линия в такта --><line x1="1140" y1="140" x2="1300" y2="140" stroke="black" stroke-width="1" />
      <!-- хоризонтална линия в такта --><line x1="1140" y1="130" x2="1300" y2="130" stroke="black" stroke-width="1" />
      <!-- хоризонтална линия в такта --><line x1="1140" y1="120" x2="1300" y2="120" stroke="black" stroke-width="2" />
      <!-- хоризонтална линия в такта --><line x1="1140" y1="110" x2="1300" y2="110" stroke="black" stroke-width="1" />
      <!-- хоризонтална линия в такта --><line x1="1140" y1="100" x2="1300" y2="100" stroke="black" stroke-width="1" />
      <!-- хоризонтална линия в такта --><line x1="1140" y1="90" x2="1300" y2="90" stroke="black" stroke-width="2" />
      <!-- хоризонтална линия в такта --><line x1="1140" y1="80" x2="1300" y2="80" stroke="black" stroke-width="1" />
      <!-- хоризонтална линия в такта --><line x1="1140" y1="70" x2="1300" y2="70" stroke="black" stroke-width="1" />
      <!-- хоризонтална линия в такта --><line x1="1140" y1="60" x2="1300" y2="60" stroke="black" stroke-width="2" />
      <!-- хоризонтална линия в такта --><line x1="1140" y1="50" x2="1300" y2="50" stroke="black" stroke-width="1" />
      <!-- хоризонтална линия в такта --><line x1="1140" y1="40" x2="1300" y2="40" stroke="black" stroke-width="1" />
      <!-- хоризонтална линия в такта --><line x1="1140" y1="30" x2="1300" y2="30" stroke="black" stroke-width="4" />
      <!-- рамка на такт --><rect x="1140" y="20" width="160" height="170" fill-opacity="0.0" stroke="black" stroke-width="4" />
    <!-- такт -->
      <!-- вертикална линия в такта --><line x1="1310" y1="20" x2="1310" y2="190" stroke="black" stroke-width="1" />
      <!-- вертикална линия в такта --><line x1="1320" y1="20" x2="1320" y2="190" stroke="black" stroke-width="1" />
      <!-- вертикална линия в такта --><line x1="1330" y1="20" x2="1330" y2="190" stroke="black" stroke-width="1" />
      <!-- вертикална линия в такта --><line x1="1340" y1="20" x2="1340" y2="190" stroke="black" stroke-width="2" />
      <!-- вертикална линия в такта --><line x1="1350" y1="20" x2="1350" y2="190" stroke="black" stroke-width="1" />
      <!-- вертикална линия в такта --><line x1="1360" y1="20" x2="1360" y2="190" stroke="black" stroke-width="1" />
      <!-- вертикална линия в такта --><line x1="1370" y1="20" x2="1370" y2="190" stroke="black" stroke-width="1" />
      <!-- вертикална линия в такта --><line x1="1380" y1="20" x2="1380" y2="190" stroke="black" stroke-width="2" />
      <!-- вертикална линия в такта --><line x1="1390" y1="20" x2="1390" y2="190" stroke="black" stroke-width="1" />
      <!-- вертикална линия в такта --><line x1="1400" y1="20" x2="1400" y2="190" stroke="black" stroke-width="1" />
      <!-- вертикална линия в такта --><line x1="1410" y1="20" x2="1410" y2="190" stroke="black" stroke-width="1" />
      <!-- вертикална линия в такта --><line x1="1420" y1="20" x2="1420" y2="190" stroke="black" stroke-width="2" />
      <!-- вертикална линия в такта --><line x1="1430" y1="20" x2="1430" y2="190" stroke="black" stroke-width="1" />
      <!-- вертикална линия в такта --><line x1="1440" y1="20" x2="1440" y2="190" stroke="black" stroke-width="1" />
      <!-- вертикална линия в такта --><line x1="1450" y1="20" x2="1450" y2="190" stroke="black" stroke-width="1" />
      <!-- нота --><rect x="1300" y="20" width="40" height="10" fill="hsl(45, 40%, 80%)" stroke="black" stroke-width="1" />
        <!-- надпис на нота --><text x="1320" y="25" fill="black" font-size="0.4em" dominant-baseline="middle" text-anchor="middle">0</text>
      <!-- нота --><rect x="1340" y="140" width="30" height="10" fill="hsl(45, 40%, 55%)" stroke="black" stroke-width="1" />
        <!-- надпис на нота --><text x="1355" y="145" fill="black" font-size="0.4em" dominant-baseline="middle" text-anchor="middle">0</text>
      <!-- нота --><rect x="1370" y="140" width="10" height="10" fill="hsl(45, 40%, 55%)" stroke="black" stroke-width="1" />
        <!-- надпис на нота --><text x="1375" y="145" fill="black" font-size="0.4em" dominant-baseline="middle" text-anchor="middle">0</text>
      <!-- нота --><rect x="1380" y="20" width="40" height="10" fill="hsl(45, 40%, 80%)" stroke="black" stroke-width="1" />
        <!-- надпис на нота --><text x="1400" y="25" fill="black" font-size="0.4em" dominant-baseline="middle" text-anchor="middle">0</text>
      <!-- нота --><rect x="1420" y="30" width="30" height="10" fill="hsl(30, 40%, 55%)" stroke="black" stroke-width="1" />
        <!-- надпис на нота --><text x="1435" y="35" fill="black" font-size="0.4em" dominant-baseline="middle" text-anchor="middle">11</text>
      <!-- нота --><rect x="1450" y="40" width="10" height="10" fill="hsl(22, 40%, 55%)" stroke="black" stroke-width="1" />
        <!-- надпис на нота --><text x="1455" y="45" fill="black" font-size="0.4em" dominant-baseline="middle" text-anchor="middle">10</text>
      <!-- хоризонтална линия в такта --><line x1="1300" y1="180" x2="1460" y2="180" stroke="black" stroke-width="2" />
      <!-- хоризонтална линия в такта --><line x1="1300" y1="170" x2="1460" y2="170" stroke="black" stroke-width="1" />
      <!-- хоризонтална линия в такта --><line x1="1300" y1="160" x2="1460" y2="160" stroke="black" stroke-width="1" />
      <!-- хоризонтална линия в такта --><line x1="1300" y1="150" x2="1460" y2="150" stroke="black" stroke-width="4" />
      <!-- хоризонтална линия в такта --><line x1="1300" y1="140" x2="1460" y2="140" stroke="black" stroke-width="1" />
      <!-- хоризонтална линия в такта --><line x1="1300" y1="130" x2="1460" y2="130" stroke="black" stroke-width="1" />
      <!-- хоризонтална линия в такта --><line x1="1300" y1="120" x2="1460" y2="120" stroke="black" stroke-width="2" />
      <!-- хоризонтална линия в такта --><line x1="1300" y1="110" x2="1460" y2="110" stroke="black" stroke-width="1" />
      <!-- хоризонтална линия в такта --><line x1="1300" y1="100" x2="1460" y2="100" stroke="black" stroke-width="1" />
      <!-- хоризонтална линия в такта --><line x1="1300" y1="90" x2="1460" y2="90" stroke="black" stroke-width="2" />
      <!-- хоризонтална линия в такта --><line x1="1300" y1="80" x2="1460" y2="80" stroke="black" stroke-width="1" />
      <!-- хоризонтална линия в такта --><line x1="1300" y1="70" x2="1460" y2="70" stroke="black" stroke-width="1" />
      <!-- хоризонтална линия в такта --><line x1="1300" y1="60" x2="1460" y2="60" stroke="black" stroke-width="2" />
      <!-- хоризонтална линия в такта --><line x1="1300" y1="50" x2="1460" y2="50" stroke="black" stroke-width="1" />
      <!-- хоризонтална линия в такта --><line x1="1300" y1="40" x2="1460" y2="40" stroke="black" stroke-width="1" />
      <!-- хоризонтална линия в такта --><line x1="1300" y1="30" x2="1460" y2="30" stroke="black" stroke-width="4" />
      <!-- рамка на такт --><rect x="1300" y="20" width="160" height="170" fill-opacity="0.0" stroke="black" stroke-width="4" />
    <!-- такт -->
      <!-- вертикална линия в такта --><line x1="1470" y1="20" x2="1470" y2="190" stroke="black" stroke-width="1" />
      <!-- вертикална линия в такта --><line x1="1480" y1="20" x2="1480" y2="190" stroke="black" stroke-width="1" />
      <!-- вертикална линия в такта --><line x1="1490" y1="20" x2="1490" y2="190" stroke="black" stroke-width="1" />
      <!-- вертикална линия в такта --><line x1="1500" y1="20" x2="1500" y2="190" stroke="black" stroke-width="2" />
      <!-- вертикална линия в такта --><line x1="1510" y1="20" x2="1510" y2="190" stroke="black" stroke-width="1" />
      <!-- вертикална линия в такта --><line x1="1520" y1="20" x2="1520" y2="190" stroke="black" stroke-width="1" />
      <!-- вертикална линия в такта --><line x1="1530" y1="20" x2="1530" y2="190" stroke="black" stroke-width="1" />
      <!-- вертикална линия в такта --><line x1="1540" y1="20" x2="1540" y2="190" stroke="black" stroke-width="2" />
      <!-- вертикална линия в такта --><line x1="1550" y1="20" x2="1550" y2="190" stroke="black" stroke-width="1" />
      <!-- вертикална линия в такта --><line x1="1560" y1="20" x2="1560" y2="190" stroke="black" stroke-width="1" />
      <!-- вертикална линия в такта --><line x1="1570" y1="20" x2="1570" y2="190" stroke="black" stroke-width="1" />
      <!-- вертикална линия в такта --><line x1="1580" y1="20" x2="1580" y2="190" stroke="black" stroke-width="2" />
      <!-- вертикална линия в такта --><line x1="1590" y1="20" x2="1590" y2="190" stroke="black" stroke-width="1" />
      <!-- вертикална линия в такта --><line x1="1600" y1="20" x2="1600" y2="190" stroke="black" stroke-width="1" />
      <!-- вертикална линия в такта --><line x1="1610" y1="20" x2="1610" y2="190" stroke="black" stroke-width="1" />
      <!-- нота --><rect x="1460" y="50" width="10" height="10" fill="hsl(5, 40%, 55%)" stroke="black" stroke-width="1" />
        <!-- надпис на нота --><text x="1465" y="55" fill="black" font-size="0.4em" dominant-baseline="middle" text-anchor="middle">9</text>
      <!-- нота --><rect x="1470" y="60" width="10" height="10" fill="hsl(322, 40%, 55%)" stroke="black" stroke-width="1" />
        <!-- надпис на нота --><text x="1475" y="65" fill="black" font-size="0.4em" dominant-baseline="middle" text-anchor="middle">8</text>
      <!-- нота --><rect x="1480" y="50" width="20" height="10" fill="hsl(5, 40%, 55%)" stroke="black" stroke-width="1" />
        <!-- надпис на нота --><text x="1490" y="55" fill="black" font-size="0.4em" dominant-baseline="middle" text-anchor="middle">9</text>
      <!-- нота --><rect x="1520" y="130" width="20" height="10" fill="hsl(60, 40%, 55%)" stroke="black" stroke-width="1" />
        <!-- надпис на нота --><text x="1530" y="135" fill="black" font-size="0.4em" dominant-baseline="middle" text-anchor="middle">1</text>
      <!-- нота --><rect x="1540" y="80" width="40" height="10" fill="hsl(264, 40%, 55%)" stroke="black" stroke-width="1" />
        <!-- надпис на нота --><text x="1560" y="85" fill="black" font-size="0.4em" dominant-baseline="middle" text-anchor="middle">6</text>
      <!-- нота --><rect x="1580" y="90" width="30" height="10" fill="hsl(224, 40%, 55%)" stroke="black" stroke-width="1" />
        <!-- надпис на нота --><text x="1595" y="95" fill="black" font-size="0.4em" dominant-baseline="middle" text-anchor="middle">5</text>
      <!-- нота --><rect x="1610" y="100" width="10" height="10" fill="hsl(164, 40%, 55%)" stroke="black" stroke-width="1" />
        <!-- надпис на нота --><text x="1615" y="105" fill="black" font-size="0.4em" dominant-baseline="middle" text-anchor="middle">4</text>
      <!-- хоризонтална линия в такта --><line x1="1460" y1="180" x2="1620" y2="180" stroke="black" stroke-width="2" />
      <!-- хоризонтална линия в такта --><line x1="1460" y1="170" x2="1620" y2="170" stroke="black" stroke-width="1" />
      <!-- хоризонтална линия в такта --><line x1="1460" y1="160" x2="1620" y2="160" stroke="black" stroke-width="1" />
      <!-- хоризонтална линия в такта --><line x1="1460" y1="150" x2="1620" y2="150" stroke="black" stroke-width="4" />
      <!-- хоризонтална линия в такта --><line x1="1460" y1="140" x2="1620" y2="140" stroke="black" stroke-width="1" />
      <!-- хоризонтална линия в такта --><line x1="1460" y1="130" x2="1620" y2="130" stroke="black" stroke-width="1" />
      <!-- хоризонтална линия в такта --><line x1="1460" y1="120" x2="1620" y2="120" stroke="black" stroke-width="2" />
      <!-- хоризонтална линия в такта --><line x1="1460" y1="110" x2="1620" y2="110" stroke="black" stroke-width="1" />
      <!-- хоризонтална линия в такта --><line x1="1460" y1="100" x2="1620" y2="100" stroke="black" stroke-width="1" />
      <!-- хоризонтална линия в такта --><line x1="1460" y1="90" x2="1620" y2="90" stroke="black" stroke-width="2" />
      <!-- хоризонтална линия в такта --><line x1="1460" y1="80" x2="1620" y2="80" stroke="black" stroke-width="1" />
      <!-- хоризонтална линия в такта --><line x1="1460" y1="70" x2="1620" y2="70" stroke="black" stroke-width="1" />
      <!-- хоризонтална линия в такта --><line x1="1460" y1="60" x2="1620" y2="60" stroke="black" stroke-width="2" />
      <!-- хоризонтална линия в такта --><line x1="1460" y1="50" x2="1620" y2="50" stroke="black" stroke-width="1" />
      <!-- хоризонтална линия в такта --><line x1="1460" y1="40" x2="1620" y2="40" stroke="black" stroke-width="1" />
      <!-- хоризонтална линия в такта --><line x1="1460" y1="30" x2="1620" y2="30" stroke="black" stroke-width="4" />
      <!-- рамка на такт --><rect x="1460" y="20" width="160" height="170" fill-opacity="0.0" stroke="black" stroke-width="4" />
    <!-- такт -->
      <!-- вертикална линия в такта --><line x1="1630" y1="20" x2="1630" y2="190" stroke="black" stroke-width="1" />
      <!-- вертикална линия в такта --><line x1="1640" y1="20" x2="1640" y2="190" stroke="black" stroke-width="1" />
      <!-- вертикална линия в такта --><line x1="1650" y1="20" x2="1650" y2="190" stroke="black" stroke-width="1" />
      <!-- вертикална линия в такта --><line x1="1660" y1="20" x2="1660" y2="190" stroke="black" stroke-width="2" />
      <!-- вертикална линия в такта --><line x1="1670" y1="20" x2="1670" y2="190" stroke="black" stroke-width="1" />
      <!-- вертикална линия в такта --><line x1="1680" y1="20" x2="1680" y2="190" stroke="black" stroke-width="1" />
      <!-- вертикална линия в такта --><line x1="1690" y1="20" x2="1690" y2="190" stroke="black" stroke-width="1" />
      <!-- вертикална линия в такта --><line x1="1700" y1="20" x2="1700" y2="190" stroke="black" stroke-width="2" />
      <!-- вертикална линия в такта --><line x1="1710" y1="20" x2="1710" y2="190" stroke="black" stroke-width="1" />
      <!-- вертикална линия в такта --><line x1="1720" y1="20" x2="1720" y2="190" stroke="black" stroke-width="1" />
      <!-- вертикална линия в такта --><line x1="1730" y1="20" x2="1730" y2="190" stroke="black" stroke-width="1" />
      <!-- вертикална линия в такта --><line x1="1740" y1="20" x2="1740" y2="190" stroke="black" stroke-width="2" />
      <!-- вертикална линия в такта --><line x1="1750" y1="20" x2="1750" y2="190" stroke="black" stroke-width="1" />
      <!-- вертикална линия в такта --><line x1="1760" y1="20" x2="1760" y2="190" stroke="black" stroke-width="1" />
      <!-- вертикална линия в такта --><line x1="1770" y1="20" x2="1770" y2="190" stroke="black" stroke-width="1" />
      <!-- нота --><rect x="1620" y="110" width="10" height="10" fill="hsl(138, 40%, 55%)" stroke="black" stroke-width="1" />
        <!-- надпис на нота --><text x="1625" y="115" fill="black" font-size="0.4em" dominant-baseline="middle" text-anchor="middle">3</text>
      <!-- нота --><rect x="1630" y="120" width="10" height="10" fill="hsl(87, 40%, 55%)" stroke="black" stroke-width="1" />
        <!-- надпис на нота --><text x="1635" y="125" fill="black" font-size="0.4em" dominant-baseline="middle" text-anchor="middle">2</text>
      <!-- нота --><rect x="1640" y="110" width="20" height="10" fill="hsl(138, 40%, 55%)" stroke="black" stroke-width="1" />
        <!-- надпис на нота --><text x="1650" y="115" fill="black" font-size="0.4em" dominant-baseline="middle" text-anchor="middle">3</text>
      <!-- нота --><rect x="1680" y="180" width="20" height="10" fill="hsl(322, 40%, 35%)" stroke="black" stroke-width="1" />
        <!-- надпис на нота --><text x="1690" y="185" fill="black" font-size="0.4em" dominant-baseline="middle" text-anchor="middle">8</text>
      <!-- нота --><rect x="1700" y="150" width="40" height="10" fill="hsl(30, 40%, 35%)" stroke="black" stroke-width="1" />
        <!-- надпис на нота --><text x="1720" y="155" fill="black" font-size="0.4em" dominant-baseline="middle" text-anchor="middle">11</text>
      <!-- нота --><rect x="1740" y="180" width="30" height="10" fill="hsl(322, 40%, 35%)" stroke="black" stroke-width="1" />
        <!-- надпис на нота --><text x="1755" y="185" fill="black" font-size="0.4em" dominant-baseline="middle" text-anchor="middle">8</text>
      <!-- нота --><rect x="1770" y="110" width="10" height="10" fill="hsl(138, 40%, 55%)" stroke="black" stroke-width="1" />
        <!-- надпис на нота --><text x="1775" y="115" fill="black" font-size="0.4em" dominant-baseline="middle" text-anchor="middle">3</text>
      <!-- хоризонтална линия в такта --><line x1="1620" y1="180" x2="1780" y2="180" stroke="black" stroke-width="2" />
      <!-- хоризонтална линия в такта --><line x1="1620" y1="170" x2="1780" y2="170" stroke="black" stroke-width="1" />
      <!-- хоризонтална линия в такта --><line x1="1620" y1="160" x2="1780" y2="160" stroke="black" stroke-width="1" />
      <!-- хоризонтална линия в такта --><line x1="1620" y1="150" x2="1780" y2="150" stroke="black" stroke-width="4" />
      <!-- хоризонтална линия в такта --><line x1="1620" y1="140" x2="1780" y2="140" stroke="black" stroke-width="1" />
      <!-- хоризонтална линия в такта --><line x1="1620" y1="130" x2="1780" y2="130" stroke="black" stroke-width="1" />
      <!-- хоризонтална линия в такта --><line x1="1620" y1="120" x2="1780" y2="120" stroke="black" stroke-width="2" />
      <!-- хоризонтална линия в такта --><line x1="1620" y1="110" x2="1780" y2="110" stroke="black" stroke-width="1" />
      <!-- хоризонтална линия в такта --><line x1="1620" y1="100" x2="1780" y2="100" stroke="black" stroke-width="1" />
      <!-- хоризонтална линия в такта --><line x1="1620" y1="90" x2="1780" y2="90" stroke="black" stroke-width="2" />
      <!-- хоризонтална линия в такта --><line x1="1620" y1="80" x2="1780" y2="80" stroke="black" stroke-width="1" />
      <!-- хоризонтална линия в такта --><line x1="1620" y1="70" x2="1780" y2="70" stroke="black" stroke-width="1" />
      <!-- хоризонтална линия в такта --><line x1="1620" y1="60" x2="1780" y2="60" stroke="black" stroke-width="2" />
      <!-- хоризонтална линия в такта --><line x1="1620" y1="50" x2="1780" y2="50" stroke="black" stroke-width="1" />
      <!-- хоризонтална линия в такта --><line x1="1620" y1="40" x2="1780" y2="40" stroke="black" stroke-width="1" />
      <!-- хоризонтална линия в такта --><line x1="1620" y1="30" x2="1780" y2="30" stroke="black" stroke-width="4" />
      <!-- рамка на такт --><rect x="1620" y="20" width="160" height="170" fill-opacity="0.0" stroke="black" stroke-width="4" />
    <!-- такт -->
      <!-- вертикална линия в такта --><line x1="1790" y1="20" x2="1790" y2="190" stroke="black" stroke-width="1" />
      <!-- вертикална линия в такта --><line x1="1800" y1="20" x2="1800" y2="190" stroke="black" stroke-width="1" />
      <!-- вертикална линия в такта --><line x1="1810" y1="20" x2="1810" y2="190" stroke="black" stroke-width="1" />
      <!-- вертикална линия в такта --><line x1="1820" y1="20" x2="1820" y2="190" stroke="black" stroke-width="2" />
      <!-- вертикална линия в такта --><line x1="1830" y1="20" x2="1830" y2="190" stroke="black" stroke-width="1" />
      <!-- вертикална линия в такта --><line x1="1840" y1="20" x2="1840" y2="190" stroke="black" stroke-width="1" />
      <!-- вертикална линия в такта --><line x1="1850" y1="20" x2="1850" y2="190" stroke="black" stroke-width="1" />
      <!-- вертикална линия в такта --><line x1="1860" y1="20" x2="1860" y2="190" stroke="black" stroke-width="2" />
      <!-- вертикална линия в такта --><line x1="1870" y1="20" x2="1870" y2="190" stroke="black" stroke-width="1" />
      <!-- вертикална линия в такта --><line x1="1880" y1="20" x2="1880" y2="190" stroke="black" stroke-width="1" />
      <!-- вертикална линия в такта --><line x1="1890" y1="20" x2="1890" y2="190" stroke="black" stroke-width="1" />
      <!-- вертикална линия в такта --><line x1="1900" y1="20" x2="1900" y2="190" stroke="black" stroke-width="2" />
      <!-- вертикална линия в такта --><line x1="1910" y1="20" x2="1910" y2="190" stroke="black" stroke-width="1" />
      <!-- вертикална линия в такта --><line x1="1920" y1="20" x2="1920" y2="190" stroke="black" stroke-width="1" />
      <!-- вертикална линия в такта --><line x1="1930" y1="20" x2="1930" y2="190" stroke="black" stroke-width="1" />
      <!-- нота --><rect x="1780" y="140" width="40" height="10" fill="hsl(45, 40%, 55%)" stroke="black" stroke-width="1" />
        <!-- надпис на нота --><text x="1800" y="145" fill="black" font-size="0.4em" dominant-baseline="middle" text-anchor="middle">0</text>
      <!-- нота --><rect x="1820" y="180" width="30" height="10" fill="hsl(322, 40%, 35%)" stroke="black" stroke-width="1" />
        <!-- надпис на нота --><text x="1835" y="185" fill="black" font-size="0.4em" dominant-baseline="middle" text-anchor="middle">8</text>
      <!-- нота --><rect x="1850" y="110" width="10" height="10" fill="hsl(138, 40%, 55%)" stroke="black" stroke-width="1" />
        <!-- надпис на нота --><text x="1855" y="115" fill="black" font-size="0.4em" dominant-baseline="middle" text-anchor="middle">3</text>
      <!-- нота --><rect x="1860" y="140" width="80" height="10" fill="hsl(45, 40%, 55%)" stroke="black" stroke-width="1" />
        <!-- надпис на нота --><text x="1900" y="145" fill="black" font-size="0.4em" dominant-baseline="middle" text-anchor="middle">0</text>
      <!-- нота --><rect x="1860" y="140" width="80" height="10" fill="hsl(45, 40%, 55%)" stroke="black" stroke-width="1" />
        <!-- надпис на нота --><text x="1900" y="145" fill="black" font-size="0.4em" dominant-baseline="middle" text-anchor="middle">0</text>
      <!-- хоризонтална линия в такта --><line x1="1780" y1="180" x2="1940" y2="180" stroke="black" stroke-width="2" />
      <!-- хоризонтална линия в такта --><line x1="1780" y1="170" x2="1940" y2="170" stroke="black" stroke-width="1" />
      <!-- хоризонтална линия в такта --><line x1="1780" y1="160" x2="1940" y2="160" stroke="black" stroke-width="1" />
      <!-- хоризонтална линия в такта --><line x1="1780" y1="150" x2="1940" y2="150" stroke="black" stroke-width="4" />
      <!-- хоризонтална линия в такта --><line x1="1780" y1="140" x2="1940" y2="140" stroke="black" stroke-width="1" />
      <!-- хоризонтална линия в такта --><line x1="1780" y1="130" x2="1940" y2="130" stroke="black" stroke-width="1" />
      <!-- хоризонтална линия в такта --><line x1="1780" y1="120" x2="1940" y2="120" stroke="black" stroke-width="2" />
      <!-- хоризонтална линия в такта --><line x1="1780" y1="110" x2="1940" y2="110" stroke="black" stroke-width="1" />
      <!-- хоризонтална линия в такта --><line x1="1780" y1="100" x2="1940" y2="100" stroke="black" stroke-width="1" />
      <!-- хоризонтална линия в такта --><line x1="1780" y1="90" x2="1940" y2="90" stroke="black" stroke-width="2" />
      <!-- хоризонтална линия в такта --><line x1="1780" y1="80" x2="1940" y2="80" stroke="black" stroke-width="1" />
      <!-- хоризонтална линия в такта --><line x1="1780" y1="70" x2="1940" y2="70" stroke="black" stroke-width="1" />
      <!-- хоризонтална линия в такта --><line x1="1780" y1="60" x2="1940" y2="60" stroke="black" stroke-width="2" />
      <!-- хоризонтална линия в такта --><line x1="1780" y1="50" x2="1940" y2="50" stroke="black" stroke-width="1" />
      <!-- хоризонтална линия в такта --><line x1="1780" y1="40" x2="1940" y2="40" stroke="black" stroke-width="1" />
      <!-- хоризонтална линия в такта --><line x1="1780" y1="30" x2="1940" y2="30" stroke="black" stroke-width="4" />
      <!-- рамка на такт --><rect x="1780" y="20" width="160" height="170" fill-opacity="0.0" stroke="black" stroke-width="4" />
</svg>
