<?xml version="1.0" encoding="UTF-8" standalone="no"?>
<svg
   version="1.1"
   width="324"
   height="592.89117"
   id="svg293"
   sodipodi:docname="the-godfather.svg"
   inkscape:version="1.4 (e7c3feb100, 2024-10-09)"
   inkscape:export-filename="the-godfather.png"
   inkscape:export-xdpi="485.75525"
   inkscape:export-ydpi="485.75525"
   xmlns:inkscape="http://www.inkscape.org/namespaces/inkscape"
   xmlns:sodipodi="http://sodipodi.sourceforge.net/DTD/sodipodi-0.dtd"
   xmlns="http://www.w3.org/2000/svg"
   xmlns:svg="http://www.w3.org/2000/svg">
  <defs
     id="defs293" />
  <sodipodi:namedview
     id="namedview293"
     pagecolor="#505050"
     bordercolor="#eeeeee"
     borderopacity="1"
     inkscape:showpageshadow="0"
     inkscape:pageopacity="0"
     inkscape:pagecheckerboard="0"
     inkscape:deskcolor="#505050"
     inkscape:zoom="0.60054348"
     inkscape:cx="246.44344"
     inkscape:cy="341.35747"
     inkscape:window-width="1252"
     inkscape:window-height="768"
     inkscape:window-x="53"
     inkscape:window-y="0"
     inkscape:window-maximized="0"
     inkscape:current-layer="svg293"
     inkscape:export-bgcolor="#ffffff00" />
  <!-- рамка -->
  <!-- пиано рол -->
  <!-- такт -->
  <!-- вертикална линия в такта -->
  <line
     x1="12"
     y1="52.891174"
     x2="12"
     y2="222.89117"
     stroke="#000000"
     stroke-width="1"
     id="line1" />
  <!-- вертикална линия в такта -->
  <line
     x1="22"
     y1="52.891174"
     x2="22"
     y2="222.89117"
     stroke="#000000"
     stroke-width="2"
     id="line2" />
  <!-- вертикална линия в такта -->
  <line
     x1="32"
     y1="52.891174"
     x2="32"
     y2="222.89117"
     stroke="#000000"
     stroke-width="1"
     id="line3" />
  <!-- вертикална линия в такта -->
  <line
     x1="42"
     y1="52.891174"
     x2="42"
     y2="222.89117"
     stroke="#000000"
     stroke-width="2"
     id="line4" />
  <!-- вертикална линия в такта -->
  <line
     x1="52"
     y1="52.891174"
     x2="52"
     y2="222.89117"
     stroke="#000000"
     stroke-width="1"
     id="line5" />
  <!-- вертикална линия в такта -->
  <line
     x1="62"
     y1="52.891174"
     x2="62"
     y2="222.89117"
     stroke="#000000"
     stroke-width="2"
     id="line6" />
  <!-- вертикална линия в такта -->
  <line
     x1="72"
     y1="52.891174"
     x2="72"
     y2="222.89117"
     stroke="#000000"
     stroke-width="1"
     id="line7" />
  <!-- нота -->
  <rect
     x="2"
     y="132.89117"
     width="10"
     height="10"
     fill="#ba805e"
     stroke="#000000"
     stroke-width="1"
     id="rect7" />
  <!-- надпис на нота -->
  <text
     x="7"
     y="137.89117"
     fill="#000000"
     font-size="4.8px"
     dominant-baseline="middle"
     text-anchor="middle"
     id="text7">10</text>
  <!-- нота -->
  <rect
     x="12"
     y="82.891174"
     width="10"
     height="10"
     fill="#b8e1c4"
     stroke="#000000"
     stroke-width="1"
     id="rect8" />
  <!-- надпис на нота -->
  <text
     x="17"
     y="87.891174"
     fill="#000000"
     font-size="4.8px"
     dominant-baseline="middle"
     text-anchor="middle"
     id="text8">3</text>
  <!-- нота -->
  <rect
     x="22"
     y="52.891174"
     width="10"
     height="10"
     fill="#c8b8e1"
     stroke="#000000"
     stroke-width="1"
     id="rect9" />
  <!-- надпис на нота -->
  <text
     x="27"
     y="57.891178"
     fill="#000000"
     font-size="4.8px"
     dominant-baseline="middle"
     text-anchor="middle"
     id="text9">6</text>
  <text
     x="161.11368"
     y="10.243164"
     fill="#000000"
     font-size="22.977px"
     dominant-baseline="middle"
     text-anchor="middle"
     id="text9-1"
     style="text-align:center;text-anchor:middle;stroke-width:4.78686">Кръстникът</text>
  <text
     x="162.49258"
     y="34.424885"
     fill="#000000"
     font-size="12.6101px"
     dominant-baseline="middle"
     text-anchor="middle"
     id="text9-1-2"
     style="text-align:center;text-anchor:middle;stroke-width:2.6271"><tspan
       style="text-align:center;text-anchor:middle"
       id="tspan293">Джовани Рота Риналди</tspan></text>
  <!-- нота -->
  <rect
     x="32"
     y="62.891178"
     width="10"
     height="10"
     fill="#b8c3e1"
     stroke="#000000"
     stroke-width="1"
     id="rect10" />
  <!-- надпис на нота -->
  <text
     x="37"
     y="67.891174"
     fill="#000000"
     font-size="4.8px"
     dominant-baseline="middle"
     text-anchor="middle"
     id="text10">5</text>
  <!-- нота -->
  <rect
     x="42"
     y="82.891174"
     width="10"
     height="10"
     fill="#b8e1c4"
     stroke="#000000"
     stroke-width="1"
     id="rect11" />
  <!-- надпис на нота -->
  <text
     x="47"
     y="87.891174"
     fill="#000000"
     font-size="4.8px"
     dominant-baseline="middle"
     text-anchor="middle"
     id="text11">3</text>
  <!-- нота -->
  <rect
     x="52"
     y="52.891174"
     width="10"
     height="10"
     fill="#c8b8e1"
     stroke="#000000"
     stroke-width="1"
     id="rect12" />
  <!-- надпис на нота -->
  <text
     x="57"
     y="57.891178"
     fill="#000000"
     font-size="4.8px"
     dominant-baseline="middle"
     text-anchor="middle"
     id="text12">6</text>
  <!-- нота -->
  <rect
     x="62"
     y="82.891174"
     width="10"
     height="10"
     fill="#b8e1c4"
     stroke="#000000"
     stroke-width="1"
     id="rect13" />
  <!-- надпис на нота -->
  <text
     x="67"
     y="87.891174"
     fill="#000000"
     font-size="4.8px"
     dominant-baseline="middle"
     text-anchor="middle"
     id="text13">3</text>
  <!-- нота -->
  <rect
     x="72"
     y="62.891178"
     width="10"
     height="10"
     fill="#b8c3e1"
     stroke="#000000"
     stroke-width="1"
     id="rect14" />
  <!-- надпис на нота -->
  <text
     x="77"
     y="67.891174"
     fill="#000000"
     font-size="4.8px"
     dominant-baseline="middle"
     text-anchor="middle"
     id="text14">5</text>
  <!-- хоризонтална линия в такта -->
  <line
     x1="2"
     y1="212.89117"
     x2="82"
     y2="212.89117"
     stroke="#000000"
     stroke-width="2"
     id="line14" />
  <!-- хоризонтална линия в такта -->
  <line
     x1="2"
     y1="202.89117"
     x2="82"
     y2="202.89117"
     stroke="#000000"
     stroke-width="1"
     id="line15" />
  <!-- хоризонтална линия в такта -->
  <line
     x1="2"
     y1="192.89117"
     x2="82"
     y2="192.89117"
     stroke="#000000"
     stroke-width="1"
     id="line16" />
  <!-- хоризонтална линия в такта -->
  <line
     x1="2"
     y1="182.89117"
     x2="82"
     y2="182.89117"
     stroke="#000000"
     stroke-width="2"
     id="line17" />
  <!-- хоризонтална линия в такта -->
  <line
     x1="2"
     y1="172.89117"
     x2="82"
     y2="172.89117"
     stroke="#000000"
     stroke-width="1"
     id="line18" />
  <!-- хоризонтална линия в такта -->
  <line
     x1="2"
     y1="162.89117"
     x2="82"
     y2="162.89117"
     stroke="#000000"
     stroke-width="1"
     id="line19" />
  <!-- хоризонтална линия в такта -->
  <line
     x1="2"
     y1="152.89117"
     x2="82"
     y2="152.89117"
     stroke="#000000"
     stroke-width="2"
     id="line20" />
  <!-- хоризонтална линия в такта -->
  <line
     x1="2"
     y1="142.89117"
     x2="82"
     y2="142.89117"
     stroke="#000000"
     stroke-width="1"
     id="line21" />
  <!-- хоризонтална линия в такта -->
  <line
     x1="2"
     y1="132.89117"
     x2="82"
     y2="132.89117"
     stroke="#000000"
     stroke-width="1"
     id="line22" />
  <!-- хоризонтална линия в такта -->
  <line
     x1="2"
     y1="122.89117"
     x2="82"
     y2="122.89117"
     stroke="#000000"
     stroke-width="4"
     id="line23" />
  <!-- хоризонтална линия в такта -->
  <line
     x1="2"
     y1="112.89117"
     x2="82"
     y2="112.89117"
     stroke="#000000"
     stroke-width="1"
     id="line24" />
  <!-- хоризонтална линия в такта -->
  <line
     x1="2"
     y1="102.89117"
     x2="82"
     y2="102.89117"
     stroke="#000000"
     stroke-width="1"
     id="line25" />
  <!-- хоризонтална линия в такта -->
  <line
     x1="2"
     y1="92.891174"
     x2="82"
     y2="92.891174"
     stroke="#000000"
     stroke-width="2"
     id="line26" />
  <!-- хоризонтална линия в такта -->
  <line
     x1="2"
     y1="82.891174"
     x2="82"
     y2="82.891174"
     stroke="#000000"
     stroke-width="1"
     id="line27" />
  <!-- хоризонтална линия в такта -->
  <line
     x1="2"
     y1="72.891174"
     x2="82"
     y2="72.891174"
     stroke="#000000"
     stroke-width="1"
     id="line28" />
  <!-- хоризонтална линия в такта -->
  <line
     x1="2"
     y1="62.891178"
     x2="82"
     y2="62.891178"
     stroke="#000000"
     stroke-width="2"
     id="line29" />
  <!-- рамка на такт -->
  <rect
     x="2"
     y="52.891174"
     width="80"
     height="170"
     fill-opacity="0"
     stroke="#000000"
     stroke-width="4"
     id="rect29" />
  <!-- такт -->
  <!-- вертикална линия в такта -->
  <line
     x1="92"
     y1="52.891174"
     x2="92"
     y2="222.89117"
     stroke="#000000"
     stroke-width="1"
     id="line30" />
  <!-- вертикална линия в такта -->
  <line
     x1="102"
     y1="52.891174"
     x2="102"
     y2="222.89117"
     stroke="#000000"
     stroke-width="2"
     id="line31" />
  <!-- вертикална линия в такта -->
  <line
     x1="112"
     y1="52.891174"
     x2="112"
     y2="222.89117"
     stroke="#000000"
     stroke-width="1"
     id="line32" />
  <!-- вертикална линия в такта -->
  <line
     x1="122"
     y1="52.891174"
     x2="122"
     y2="222.89117"
     stroke="#000000"
     stroke-width="2"
     id="line33" />
  <!-- вертикална линия в такта -->
  <line
     x1="132"
     y1="52.891174"
     x2="132"
     y2="222.89117"
     stroke="#000000"
     stroke-width="1"
     id="line34" />
  <!-- вертикална линия в такта -->
  <line
     x1="142"
     y1="52.891174"
     x2="142"
     y2="222.89117"
     stroke="#000000"
     stroke-width="2"
     id="line35" />
  <!-- вертикална линия в такта -->
  <line
     x1="152"
     y1="52.891174"
     x2="152"
     y2="222.89117"
     stroke="#000000"
     stroke-width="1"
     id="line36" />
  <!-- нота -->
  <rect
     x="82"
     y="82.891174"
     width="10"
     height="10"
     fill="#b8e1c4"
     stroke="#000000"
     stroke-width="1"
     id="rect36" />
  <!-- надпис на нота -->
  <text
     x="87"
     y="87.891174"
     fill="#000000"
     font-size="4.8px"
     dominant-baseline="middle"
     text-anchor="middle"
     id="text36">3</text>
  <!-- нота -->
  <rect
     x="92"
     y="122.89117"
     width="10"
     height="10"
     fill="#ba8c5e"
     stroke="#000000"
     stroke-width="1"
     id="rect37" />
  <!-- надпис на нота -->
  <text
     x="97"
     y="127.89118"
     fill="#000000"
     font-size="4.8px"
     dominant-baseline="middle"
     text-anchor="middle"
     id="text37">11</text>
  <!-- нота -->
  <rect
     x="102"
     y="102.89117"
     width="10"
     height="10"
     fill="#e1e1b8"
     stroke="#000000"
     stroke-width="1"
     id="rect38" />
  <!-- надпис на нота -->
  <text
     x="107"
     y="107.89117"
     fill="#000000"
     font-size="4.8px"
     dominant-baseline="middle"
     text-anchor="middle"
     id="text38">1</text>
  <!-- нота -->
  <rect
     x="112"
     y="132.89117"
     width="40"
     height="10"
     fill="#ba805e"
     stroke="#000000"
     stroke-width="1"
     id="rect39" />
  <!-- надпис на нота -->
  <text
     x="132"
     y="137.89117"
     fill="#000000"
     font-size="4.8px"
     dominant-baseline="middle"
     text-anchor="middle"
     id="text39">10</text>
  <!-- хоризонтална линия в такта -->
  <line
     x1="82"
     y1="212.89117"
     x2="162"
     y2="212.89117"
     stroke="#000000"
     stroke-width="2"
     id="line39" />
  <!-- хоризонтална линия в такта -->
  <line
     x1="82"
     y1="202.89117"
     x2="162"
     y2="202.89117"
     stroke="#000000"
     stroke-width="1"
     id="line40" />
  <!-- хоризонтална линия в такта -->
  <line
     x1="82"
     y1="192.89117"
     x2="162"
     y2="192.89117"
     stroke="#000000"
     stroke-width="1"
     id="line41" />
  <!-- хоризонтална линия в такта -->
  <line
     x1="82"
     y1="182.89117"
     x2="162"
     y2="182.89117"
     stroke="#000000"
     stroke-width="2"
     id="line42" />
  <!-- хоризонтална линия в такта -->
  <line
     x1="82"
     y1="172.89117"
     x2="162"
     y2="172.89117"
     stroke="#000000"
     stroke-width="1"
     id="line43" />
  <!-- хоризонтална линия в такта -->
  <line
     x1="82"
     y1="162.89117"
     x2="162"
     y2="162.89117"
     stroke="#000000"
     stroke-width="1"
     id="line44" />
  <!-- хоризонтална линия в такта -->
  <line
     x1="82"
     y1="152.89117"
     x2="162"
     y2="152.89117"
     stroke="#000000"
     stroke-width="2"
     id="line45" />
  <!-- хоризонтална линия в такта -->
  <line
     x1="82"
     y1="142.89117"
     x2="162"
     y2="142.89117"
     stroke="#000000"
     stroke-width="1"
     id="line46" />
  <!-- хоризонтална линия в такта -->
  <line
     x1="82"
     y1="132.89117"
     x2="162"
     y2="132.89117"
     stroke="#000000"
     stroke-width="1"
     id="line47" />
  <!-- хоризонтална линия в такта -->
  <line
     x1="82"
     y1="122.89117"
     x2="162"
     y2="122.89117"
     stroke="#000000"
     stroke-width="4"
     id="line48" />
  <!-- хоризонтална линия в такта -->
  <line
     x1="82"
     y1="112.89117"
     x2="162"
     y2="112.89117"
     stroke="#000000"
     stroke-width="1"
     id="line49" />
  <!-- хоризонтална линия в такта -->
  <line
     x1="82"
     y1="102.89117"
     x2="162"
     y2="102.89117"
     stroke="#000000"
     stroke-width="1"
     id="line50" />
  <!-- хоризонтална линия в такта -->
  <line
     x1="82"
     y1="92.891174"
     x2="162"
     y2="92.891174"
     stroke="#000000"
     stroke-width="2"
     id="line51" />
  <!-- хоризонтална линия в такта -->
  <line
     x1="82"
     y1="82.891174"
     x2="162"
     y2="82.891174"
     stroke="#000000"
     stroke-width="1"
     id="line52" />
  <!-- хоризонтална линия в такта -->
  <line
     x1="82"
     y1="72.891174"
     x2="162"
     y2="72.891174"
     stroke="#000000"
     stroke-width="1"
     id="line53" />
  <!-- хоризонтална линия в такта -->
  <line
     x1="82"
     y1="62.891178"
     x2="162"
     y2="62.891178"
     stroke="#000000"
     stroke-width="2"
     id="line54" />
  <!-- рамка на такт -->
  <rect
     x="82"
     y="52.891174"
     width="80"
     height="170"
     fill-opacity="0"
     stroke="#000000"
     stroke-width="4"
     id="rect54" />
  <!-- такт -->
  <!-- вертикална линия в такта -->
  <line
     x1="172"
     y1="52.891174"
     x2="172"
     y2="222.89117"
     stroke="#000000"
     stroke-width="1"
     id="line55" />
  <!-- вертикална линия в такта -->
  <line
     x1="182"
     y1="52.891174"
     x2="182"
     y2="222.89117"
     stroke="#000000"
     stroke-width="2"
     id="line56" />
  <!-- вертикална линия в такта -->
  <line
     x1="192"
     y1="52.891174"
     x2="192"
     y2="222.89117"
     stroke="#000000"
     stroke-width="1"
     id="line57" />
  <!-- вертикална линия в такта -->
  <line
     x1="202"
     y1="52.891174"
     x2="202"
     y2="222.89117"
     stroke="#000000"
     stroke-width="2"
     id="line58" />
  <!-- вертикална линия в такта -->
  <line
     x1="212"
     y1="52.891174"
     x2="212"
     y2="222.89117"
     stroke="#000000"
     stroke-width="1"
     id="line59" />
  <!-- вертикална линия в такта -->
  <line
     x1="222"
     y1="52.891174"
     x2="222"
     y2="222.89117"
     stroke="#000000"
     stroke-width="2"
     id="line60" />
  <!-- вертикална линия в такта -->
  <line
     x1="231.99998"
     y1="52.891174"
     x2="231.99998"
     y2="222.89117"
     stroke="#000000"
     stroke-width="1"
     id="line61" />
  <!-- нота -->
  <rect
     x="162"
     y="132.89117"
     width="10"
     height="10"
     fill="#ba805e"
     stroke="#000000"
     stroke-width="1"
     id="rect61" />
  <!-- надпис на нота -->
  <text
     x="167"
     y="137.89117"
     fill="#000000"
     font-size="4.8px"
     dominant-baseline="middle"
     text-anchor="middle"
     id="text61">10</text>
  <!-- нота -->
  <rect
     x="172"
     y="82.891174"
     width="10"
     height="10"
     fill="#b8e1c4"
     stroke="#000000"
     stroke-width="1"
     id="rect62" />
  <!-- надпис на нота -->
  <text
     x="177"
     y="87.891174"
     fill="#000000"
     font-size="4.8px"
     dominant-baseline="middle"
     text-anchor="middle"
     id="text62">3</text>
  <!-- нота -->
  <rect
     x="182"
     y="52.891174"
     width="10"
     height="10"
     fill="#c8b8e1"
     stroke="#000000"
     stroke-width="1"
     id="rect63" />
  <!-- надпис на нота -->
  <text
     x="187"
     y="57.891178"
     fill="#000000"
     font-size="4.8px"
     dominant-baseline="middle"
     text-anchor="middle"
     id="text63">6</text>
  <!-- нота -->
  <rect
     x="192"
     y="62.891178"
     width="10"
     height="10"
     fill="#b8c3e1"
     stroke="#000000"
     stroke-width="1"
     id="rect64" />
  <!-- надпис на нота -->
  <text
     x="197"
     y="67.891174"
     fill="#000000"
     font-size="4.8px"
     dominant-baseline="middle"
     text-anchor="middle"
     id="text64">5</text>
  <!-- нота -->
  <rect
     x="202"
     y="82.891174"
     width="10"
     height="10"
     fill="#b8e1c4"
     stroke="#000000"
     stroke-width="1"
     id="rect65" />
  <!-- надпис на нота -->
  <text
     x="207"
     y="87.891174"
     fill="#000000"
     font-size="4.8px"
     dominant-baseline="middle"
     text-anchor="middle"
     id="text65">3</text>
  <!-- нота -->
  <rect
     x="212"
     y="52.891174"
     width="10"
     height="10"
     fill="#c8b8e1"
     stroke="#000000"
     stroke-width="1"
     id="rect66" />
  <!-- надпис на нота -->
  <text
     x="217"
     y="57.891178"
     fill="#000000"
     font-size="4.8px"
     dominant-baseline="middle"
     text-anchor="middle"
     id="text66">6</text>
  <!-- нота -->
  <rect
     x="222"
     y="82.891174"
     width="10"
     height="10"
     fill="#b8e1c4"
     stroke="#000000"
     stroke-width="1"
     id="rect67" />
  <!-- надпис на нота -->
  <text
     x="226.99998"
     y="87.891174"
     fill="#000000"
     font-size="4.8px"
     dominant-baseline="middle"
     text-anchor="middle"
     id="text67">3</text>
  <!-- нота -->
  <rect
     x="231.99998"
     y="62.891178"
     width="10"
     height="10"
     fill="#b8c3e1"
     stroke="#000000"
     stroke-width="1"
     id="rect68" />
  <!-- надпис на нота -->
  <text
     x="236.99998"
     y="67.891174"
     fill="#000000"
     font-size="4.8px"
     dominant-baseline="middle"
     text-anchor="middle"
     id="text68">5</text>
  <!-- хоризонтална линия в такта -->
  <line
     x1="162"
     y1="212.89117"
     x2="241.99998"
     y2="212.89117"
     stroke="#000000"
     stroke-width="2"
     id="line68" />
  <!-- хоризонтална линия в такта -->
  <line
     x1="162"
     y1="202.89117"
     x2="241.99998"
     y2="202.89117"
     stroke="#000000"
     stroke-width="1"
     id="line69" />
  <!-- хоризонтална линия в такта -->
  <line
     x1="162"
     y1="192.89117"
     x2="241.99998"
     y2="192.89117"
     stroke="#000000"
     stroke-width="1"
     id="line70" />
  <!-- хоризонтална линия в такта -->
  <line
     x1="162"
     y1="182.89117"
     x2="241.99998"
     y2="182.89117"
     stroke="#000000"
     stroke-width="2"
     id="line71" />
  <!-- хоризонтална линия в такта -->
  <line
     x1="162"
     y1="172.89117"
     x2="241.99998"
     y2="172.89117"
     stroke="#000000"
     stroke-width="1"
     id="line72" />
  <!-- хоризонтална линия в такта -->
  <line
     x1="162"
     y1="162.89117"
     x2="241.99998"
     y2="162.89117"
     stroke="#000000"
     stroke-width="1"
     id="line73" />
  <!-- хоризонтална линия в такта -->
  <line
     x1="162"
     y1="152.89117"
     x2="241.99998"
     y2="152.89117"
     stroke="#000000"
     stroke-width="2"
     id="line74" />
  <!-- хоризонтална линия в такта -->
  <line
     x1="162"
     y1="142.89117"
     x2="241.99998"
     y2="142.89117"
     stroke="#000000"
     stroke-width="1"
     id="line75" />
  <!-- хоризонтална линия в такта -->
  <line
     x1="162"
     y1="132.89117"
     x2="241.99998"
     y2="132.89117"
     stroke="#000000"
     stroke-width="1"
     id="line76" />
  <!-- хоризонтална линия в такта -->
  <line
     x1="162"
     y1="122.89117"
     x2="241.99998"
     y2="122.89117"
     stroke="#000000"
     stroke-width="4"
     id="line77" />
  <!-- хоризонтална линия в такта -->
  <line
     x1="162"
     y1="112.89117"
     x2="241.99998"
     y2="112.89117"
     stroke="#000000"
     stroke-width="1"
     id="line78" />
  <!-- хоризонтална линия в такта -->
  <line
     x1="162"
     y1="102.89117"
     x2="241.99998"
     y2="102.89117"
     stroke="#000000"
     stroke-width="1"
     id="line79" />
  <!-- хоризонтална линия в такта -->
  <line
     x1="162"
     y1="92.891174"
     x2="241.99998"
     y2="92.891174"
     stroke="#000000"
     stroke-width="2"
     id="line80" />
  <!-- хоризонтална линия в такта -->
  <line
     x1="162"
     y1="82.891174"
     x2="241.99998"
     y2="82.891174"
     stroke="#000000"
     stroke-width="1"
     id="line81" />
  <!-- хоризонтална линия в такта -->
  <line
     x1="162"
     y1="72.891174"
     x2="241.99998"
     y2="72.891174"
     stroke="#000000"
     stroke-width="1"
     id="line82" />
  <!-- хоризонтална линия в такта -->
  <line
     x1="162"
     y1="62.891178"
     x2="241.99998"
     y2="62.891178"
     stroke="#000000"
     stroke-width="2"
     id="line83" />
  <!-- рамка на такт -->
  <rect
     x="162"
     y="52.891174"
     width="80"
     height="170"
     fill-opacity="0"
     stroke="#000000"
     stroke-width="4"
     id="rect83" />
  <!-- такт -->
  <!-- вертикална линия в такта -->
  <line
     x1="251.99998"
     y1="52.891174"
     x2="251.99998"
     y2="222.89117"
     stroke="#000000"
     stroke-width="1"
     id="line84" />
  <!-- вертикална линия в такта -->
  <line
     x1="262"
     y1="52.891174"
     x2="262"
     y2="222.89117"
     stroke="#000000"
     stroke-width="2"
     id="line85" />
  <!-- вертикална линия в такта -->
  <line
     x1="272"
     y1="52.891174"
     x2="272"
     y2="222.89117"
     stroke="#000000"
     stroke-width="1"
     id="line86" />
  <!-- вертикална линия в такта -->
  <line
     x1="282"
     y1="52.891174"
     x2="282"
     y2="222.89117"
     stroke="#000000"
     stroke-width="2"
     id="line87" />
  <!-- вертикална линия в такта -->
  <line
     x1="292"
     y1="52.891174"
     x2="292"
     y2="222.89117"
     stroke="#000000"
     stroke-width="1"
     id="line88" />
  <!-- вертикална линия в такта -->
  <line
     x1="302"
     y1="52.891174"
     x2="302"
     y2="222.89117"
     stroke="#000000"
     stroke-width="2"
     id="line89" />
  <!-- вертикална линия в такта -->
  <line
     x1="312"
     y1="52.891174"
     x2="312"
     y2="222.89117"
     stroke="#000000"
     stroke-width="1"
     id="line90" />
  <!-- нота -->
  <rect
     x="241.99998"
     y="82.891174"
     width="10"
     height="10"
     fill="#b8e1c4"
     stroke="#000000"
     stroke-width="1"
     id="rect90" />
  <!-- надпис на нота -->
  <text
     x="246.99998"
     y="87.891174"
     fill="#000000"
     font-size="4.8px"
     dominant-baseline="middle"
     text-anchor="middle"
     id="text90">3</text>
  <!-- нота -->
  <rect
     x="251.99998"
     y="132.89117"
     width="10"
     height="10"
     fill="#ba805e"
     stroke="#000000"
     stroke-width="1"
     id="rect91" />
  <!-- надпис на нота -->
  <text
     x="257"
     y="137.89117"
     fill="#000000"
     font-size="4.8px"
     dominant-baseline="middle"
     text-anchor="middle"
     id="text91">10</text>
  <!-- нота -->
  <rect
     x="262"
     y="142.89117"
     width="10"
     height="10"
     fill="#ba665e"
     stroke="#000000"
     stroke-width="1"
     id="rect92" />
  <!-- надпис на нота -->
  <text
     x="267"
     y="147.89117"
     fill="#000000"
     font-size="4.8px"
     dominant-baseline="middle"
     text-anchor="middle"
     id="text92">9</text>
  <!-- нота -->
  <rect
     x="272"
     y="152.89117"
     width="40"
     height="10"
     fill="#ba5e99"
     stroke="#000000"
     stroke-width="1"
     id="rect93" />
  <!-- надпис на нота -->
  <text
     x="292"
     y="157.89117"
     fill="#000000"
     font-size="4.8px"
     dominant-baseline="middle"
     text-anchor="middle"
     id="text93">8</text>
  <!-- хоризонтална линия в такта -->
  <line
     x1="241.99998"
     y1="212.89117"
     x2="322"
     y2="212.89117"
     stroke="#000000"
     stroke-width="2"
     id="line93" />
  <!-- хоризонтална линия в такта -->
  <line
     x1="241.99998"
     y1="202.89117"
     x2="322"
     y2="202.89117"
     stroke="#000000"
     stroke-width="1"
     id="line94" />
  <!-- хоризонтална линия в такта -->
  <line
     x1="241.99998"
     y1="192.89117"
     x2="322"
     y2="192.89117"
     stroke="#000000"
     stroke-width="1"
     id="line95" />
  <!-- хоризонтална линия в такта -->
  <line
     x1="241.99998"
     y1="182.89117"
     x2="322"
     y2="182.89117"
     stroke="#000000"
     stroke-width="2"
     id="line96" />
  <!-- хоризонтална линия в такта -->
  <line
     x1="241.99998"
     y1="172.89117"
     x2="322"
     y2="172.89117"
     stroke="#000000"
     stroke-width="1"
     id="line97" />
  <!-- хоризонтална линия в такта -->
  <line
     x1="241.99998"
     y1="162.89117"
     x2="322"
     y2="162.89117"
     stroke="#000000"
     stroke-width="1"
     id="line98" />
  <!-- хоризонтална линия в такта -->
  <line
     x1="241.99998"
     y1="152.89117"
     x2="322"
     y2="152.89117"
     stroke="#000000"
     stroke-width="2"
     id="line99" />
  <!-- хоризонтална линия в такта -->
  <line
     x1="241.99998"
     y1="142.89117"
     x2="322"
     y2="142.89117"
     stroke="#000000"
     stroke-width="1"
     id="line100" />
  <!-- хоризонтална линия в такта -->
  <line
     x1="241.99998"
     y1="132.89117"
     x2="322"
     y2="132.89117"
     stroke="#000000"
     stroke-width="1"
     id="line101" />
  <!-- хоризонтална линия в такта -->
  <line
     x1="241.99998"
     y1="122.89117"
     x2="322"
     y2="122.89117"
     stroke="#000000"
     stroke-width="4"
     id="line102" />
  <!-- хоризонтална линия в такта -->
  <line
     x1="241.99998"
     y1="112.89117"
     x2="322"
     y2="112.89117"
     stroke="#000000"
     stroke-width="1"
     id="line103" />
  <!-- хоризонтална линия в такта -->
  <line
     x1="241.99998"
     y1="102.89117"
     x2="322"
     y2="102.89117"
     stroke="#000000"
     stroke-width="1"
     id="line104" />
  <!-- хоризонтална линия в такта -->
  <line
     x1="241.99998"
     y1="92.891174"
     x2="322"
     y2="92.891174"
     stroke="#000000"
     stroke-width="2"
     id="line105" />
  <!-- хоризонтална линия в такта -->
  <line
     x1="241.99998"
     y1="82.891174"
     x2="322"
     y2="82.891174"
     stroke="#000000"
     stroke-width="1"
     id="line106" />
  <!-- хоризонтална линия в такта -->
  <line
     x1="241.99998"
     y1="72.891174"
     x2="322"
     y2="72.891174"
     stroke="#000000"
     stroke-width="1"
     id="line107" />
  <!-- хоризонтална линия в такта -->
  <line
     x1="241.99998"
     y1="62.891178"
     x2="322"
     y2="62.891178"
     stroke="#000000"
     stroke-width="2"
     id="line108" />
  <!-- рамка на такт -->
  <rect
     x="241.99998"
     y="52.891174"
     width="80"
     height="170"
     fill-opacity="0"
     stroke="#000000"
     stroke-width="4"
     id="rect108" />
  <!-- такт -->
  <!-- вертикална линия в такта -->
  <line
     x1="12"
     y1="236.89117"
     x2="12"
     y2="406.89117"
     stroke="#000000"
     stroke-width="1"
     id="line109" />
  <!-- вертикална линия в такта -->
  <line
     x1="22"
     y1="236.89117"
     x2="22"
     y2="406.89117"
     stroke="#000000"
     stroke-width="2"
     id="line110" />
  <!-- вертикална линия в такта -->
  <line
     x1="32"
     y1="236.89117"
     x2="32"
     y2="406.89117"
     stroke="#000000"
     stroke-width="1"
     id="line111" />
  <!-- вертикална линия в такта -->
  <line
     x1="42"
     y1="236.89117"
     x2="42"
     y2="406.89117"
     stroke="#000000"
     stroke-width="2"
     id="line112" />
  <!-- вертикална линия в такта -->
  <line
     x1="52"
     y1="236.89117"
     x2="52"
     y2="406.89117"
     stroke="#000000"
     stroke-width="1"
     id="line113" />
  <!-- вертикална линия в такта -->
  <line
     x1="62"
     y1="236.89117"
     x2="62"
     y2="406.89117"
     stroke="#000000"
     stroke-width="2"
     id="line114" />
  <!-- вертикална линия в такта -->
  <line
     x1="72"
     y1="236.89117"
     x2="72"
     y2="406.89117"
     stroke="#000000"
     stroke-width="1"
     id="line115" />
  <!-- нота -->
  <rect
     x="2"
     y="336.89117"
     width="10"
     height="10"
     fill="#ba5e99"
     stroke="#000000"
     stroke-width="1"
     id="rect115" />
  <!-- надпис на нота -->
  <text
     x="7"
     y="341.89117"
     fill="#000000"
     font-size="4.8px"
     dominant-baseline="middle"
     text-anchor="middle"
     id="text115">8</text>
  <!-- нота -->
  <rect
     x="12"
     y="306.89117"
     width="10"
     height="10"
     fill="#ba8c5e"
     stroke="#000000"
     stroke-width="1"
     id="rect116" />
  <!-- надпис на нота -->
  <text
     x="17"
     y="311.89117"
     fill="#000000"
     font-size="4.8px"
     dominant-baseline="middle"
     text-anchor="middle"
     id="text116">11</text>
  <!-- нота -->
  <rect
     x="22"
     y="276.89117"
     width="10"
     height="10"
     fill="#cee1b8"
     stroke="#000000"
     stroke-width="1"
     id="rect117" />
  <!-- надпис на нота -->
  <text
     x="27"
     y="281.89117"
     fill="#000000"
     font-size="4.8px"
     dominant-baseline="middle"
     text-anchor="middle"
     id="text117">2</text>
  <!-- нота -->
  <rect
     x="32"
     y="246.89117"
     width="40"
     height="10"
     fill="#b8c3e1"
     stroke="#000000"
     stroke-width="1"
     id="rect118" />
  <!-- надпис на нота -->
  <text
     x="52"
     y="251.89117"
     fill="#000000"
     font-size="4.8px"
     dominant-baseline="middle"
     text-anchor="middle"
     id="text118">5</text>
  <!-- хоризонтална линия в такта -->
  <line
     x1="2"
     y1="396.89117"
     x2="82"
     y2="396.89117"
     stroke="#000000"
     stroke-width="2"
     id="line118" />
  <!-- хоризонтална линия в такта -->
  <line
     x1="2"
     y1="386.89117"
     x2="82"
     y2="386.89117"
     stroke="#000000"
     stroke-width="1"
     id="line119" />
  <!-- хоризонтална линия в такта -->
  <line
     x1="2"
     y1="376.89117"
     x2="82"
     y2="376.89117"
     stroke="#000000"
     stroke-width="1"
     id="line120" />
  <!-- хоризонтална линия в такта -->
  <line
     x1="2"
     y1="366.89117"
     x2="82"
     y2="366.89117"
     stroke="#000000"
     stroke-width="2"
     id="line121" />
  <!-- хоризонтална линия в такта -->
  <line
     x1="2"
     y1="356.89117"
     x2="82"
     y2="356.89117"
     stroke="#000000"
     stroke-width="1"
     id="line122" />
  <!-- хоризонтална линия в такта -->
  <line
     x1="2"
     y1="346.89117"
     x2="82"
     y2="346.89117"
     stroke="#000000"
     stroke-width="1"
     id="line123" />
  <!-- хоризонтална линия в такта -->
  <line
     x1="2"
     y1="336.89117"
     x2="82"
     y2="336.89117"
     stroke="#000000"
     stroke-width="2"
     id="line124" />
  <!-- хоризонтална линия в такта -->
  <line
     x1="2"
     y1="326.89117"
     x2="82"
     y2="326.89117"
     stroke="#000000"
     stroke-width="1"
     id="line125" />
  <!-- хоризонтална линия в такта -->
  <line
     x1="2"
     y1="316.89117"
     x2="82"
     y2="316.89117"
     stroke="#000000"
     stroke-width="1"
     id="line126" />
  <!-- хоризонтална линия в такта -->
  <line
     x1="2"
     y1="306.89117"
     x2="82"
     y2="306.89117"
     stroke="#000000"
     stroke-width="4"
     id="line127" />
  <!-- хоризонтална линия в такта -->
  <line
     x1="2"
     y1="296.89117"
     x2="82"
     y2="296.89117"
     stroke="#000000"
     stroke-width="1"
     id="line128" />
  <!-- хоризонтална линия в такта -->
  <line
     x1="2"
     y1="286.89117"
     x2="82"
     y2="286.89117"
     stroke="#000000"
     stroke-width="1"
     id="line129" />
  <!-- хоризонтална линия в такта -->
  <line
     x1="2"
     y1="276.89117"
     x2="82"
     y2="276.89117"
     stroke="#000000"
     stroke-width="2"
     id="line130" />
  <!-- хоризонтална линия в такта -->
  <line
     x1="2"
     y1="266.89117"
     x2="82"
     y2="266.89117"
     stroke="#000000"
     stroke-width="1"
     id="line131" />
  <!-- хоризонтална линия в такта -->
  <line
     x1="2"
     y1="256.89117"
     x2="82"
     y2="256.89117"
     stroke="#000000"
     stroke-width="1"
     id="line132" />
  <!-- хоризонтална линия в такта -->
  <line
     x1="2"
     y1="246.89117"
     x2="82"
     y2="246.89117"
     stroke="#000000"
     stroke-width="2"
     id="line133" />
  <!-- рамка на такт -->
  <rect
     x="2"
     y="236.89117"
     width="80"
     height="170"
     fill-opacity="0"
     stroke="#000000"
     stroke-width="4"
     id="rect133" />
  <!-- такт -->
  <!-- вертикална линия в такта -->
  <line
     x1="92"
     y1="236.89117"
     x2="92"
     y2="406.89117"
     stroke="#000000"
     stroke-width="1"
     id="line134" />
  <!-- вертикална линия в такта -->
  <line
     x1="102"
     y1="236.89117"
     x2="102"
     y2="406.89117"
     stroke="#000000"
     stroke-width="2"
     id="line135" />
  <!-- вертикална линия в такта -->
  <line
     x1="112"
     y1="236.89117"
     x2="112"
     y2="406.89117"
     stroke="#000000"
     stroke-width="1"
     id="line136" />
  <!-- вертикална линия в такта -->
  <line
     x1="122"
     y1="236.89117"
     x2="122"
     y2="406.89117"
     stroke="#000000"
     stroke-width="2"
     id="line137" />
  <!-- вертикална линия в такта -->
  <line
     x1="132"
     y1="236.89117"
     x2="132"
     y2="406.89117"
     stroke="#000000"
     stroke-width="1"
     id="line138" />
  <!-- вертикална линия в такта -->
  <line
     x1="142"
     y1="236.89117"
     x2="142"
     y2="406.89117"
     stroke="#000000"
     stroke-width="2"
     id="line139" />
  <!-- вертикална линия в такта -->
  <line
     x1="152"
     y1="236.89117"
     x2="152"
     y2="406.89117"
     stroke="#000000"
     stroke-width="1"
     id="line140" />
  <!-- нота -->
  <rect
     x="82"
     y="336.89117"
     width="10"
     height="10"
     fill="#ba5e99"
     stroke="#000000"
     stroke-width="1"
     id="rect140" />
  <!-- надпис на нота -->
  <text
     x="87"
     y="341.89117"
     fill="#000000"
     font-size="4.8px"
     dominant-baseline="middle"
     text-anchor="middle"
     id="text140">8</text>
  <!-- нота -->
  <rect
     x="92"
     y="306.89117"
     width="10"
     height="10"
     fill="#ba8c5e"
     stroke="#000000"
     stroke-width="1"
     id="rect141" />
  <!-- надпис на нота -->
  <text
     x="97"
     y="311.89117"
     fill="#000000"
     font-size="4.8px"
     dominant-baseline="middle"
     text-anchor="middle"
     id="text141">11</text>
  <!-- нота -->
  <rect
     x="102"
     y="276.89117"
     width="10"
     height="10"
     fill="#cee1b8"
     stroke="#000000"
     stroke-width="1"
     id="rect142" />
  <!-- надпис на нота -->
  <text
     x="107"
     y="281.89117"
     fill="#000000"
     font-size="4.8px"
     dominant-baseline="middle"
     text-anchor="middle"
     id="text142">2</text>
  <!-- нота -->
  <rect
     x="112"
     y="266.89117"
     width="40"
     height="10"
     fill="#b8e1c4"
     stroke="#000000"
     stroke-width="1"
     id="rect143" />
  <!-- надпис на нота -->
  <text
     x="132"
     y="271.89117"
     fill="#000000"
     font-size="4.8px"
     dominant-baseline="middle"
     text-anchor="middle"
     id="text143">3</text>
  <!-- хоризонтална линия в такта -->
  <line
     x1="82"
     y1="396.89117"
     x2="162"
     y2="396.89117"
     stroke="#000000"
     stroke-width="2"
     id="line143" />
  <!-- хоризонтална линия в такта -->
  <line
     x1="82"
     y1="386.89117"
     x2="162"
     y2="386.89117"
     stroke="#000000"
     stroke-width="1"
     id="line144" />
  <!-- хоризонтална линия в такта -->
  <line
     x1="82"
     y1="376.89117"
     x2="162"
     y2="376.89117"
     stroke="#000000"
     stroke-width="1"
     id="line145" />
  <!-- хоризонтална линия в такта -->
  <line
     x1="82"
     y1="366.89117"
     x2="162"
     y2="366.89117"
     stroke="#000000"
     stroke-width="2"
     id="line146" />
  <!-- хоризонтална линия в такта -->
  <line
     x1="82"
     y1="356.89117"
     x2="162"
     y2="356.89117"
     stroke="#000000"
     stroke-width="1"
     id="line147" />
  <!-- хоризонтална линия в такта -->
  <line
     x1="82"
     y1="346.89117"
     x2="162"
     y2="346.89117"
     stroke="#000000"
     stroke-width="1"
     id="line148" />
  <!-- хоризонтална линия в такта -->
  <line
     x1="82"
     y1="336.89117"
     x2="162"
     y2="336.89117"
     stroke="#000000"
     stroke-width="2"
     id="line149" />
  <!-- хоризонтална линия в такта -->
  <line
     x1="82"
     y1="326.89117"
     x2="162"
     y2="326.89117"
     stroke="#000000"
     stroke-width="1"
     id="line150" />
  <!-- хоризонтална линия в такта -->
  <line
     x1="82"
     y1="316.89117"
     x2="162"
     y2="316.89117"
     stroke="#000000"
     stroke-width="1"
     id="line151" />
  <!-- хоризонтална линия в такта -->
  <line
     x1="82"
     y1="306.89117"
     x2="162"
     y2="306.89117"
     stroke="#000000"
     stroke-width="4"
     id="line152" />
  <!-- хоризонтална линия в такта -->
  <line
     x1="82"
     y1="296.89117"
     x2="162"
     y2="296.89117"
     stroke="#000000"
     stroke-width="1"
     id="line153" />
  <!-- хоризонтална линия в такта -->
  <line
     x1="82"
     y1="286.89117"
     x2="162"
     y2="286.89117"
     stroke="#000000"
     stroke-width="1"
     id="line154" />
  <!-- хоризонтална линия в такта -->
  <line
     x1="82"
     y1="276.89117"
     x2="162"
     y2="276.89117"
     stroke="#000000"
     stroke-width="2"
     id="line155" />
  <!-- хоризонтална линия в такта -->
  <line
     x1="82"
     y1="266.89117"
     x2="162"
     y2="266.89117"
     stroke="#000000"
     stroke-width="1"
     id="line156" />
  <!-- хоризонтална линия в такта -->
  <line
     x1="82"
     y1="256.89117"
     x2="162"
     y2="256.89117"
     stroke="#000000"
     stroke-width="1"
     id="line157" />
  <!-- хоризонтална линия в такта -->
  <line
     x1="82"
     y1="246.89117"
     x2="162"
     y2="246.89117"
     stroke="#000000"
     stroke-width="2"
     id="line158" />
  <!-- рамка на такт -->
  <rect
     x="82"
     y="236.89117"
     width="80"
     height="170"
     fill-opacity="0"
     stroke="#000000"
     stroke-width="4"
     id="rect158" />
  <!-- такт -->
  <!-- вертикална линия в такта -->
  <line
     x1="172"
     y1="236.89117"
     x2="172"
     y2="406.89117"
     stroke="#000000"
     stroke-width="1"
     id="line159" />
  <!-- вертикална линия в такта -->
  <line
     x1="182"
     y1="236.89117"
     x2="182"
     y2="406.89117"
     stroke="#000000"
     stroke-width="2"
     id="line160" />
  <!-- вертикална линия в такта -->
  <line
     x1="192"
     y1="236.89117"
     x2="192"
     y2="406.89117"
     stroke="#000000"
     stroke-width="1"
     id="line161" />
  <!-- вертикална линия в такта -->
  <line
     x1="202"
     y1="236.89117"
     x2="202"
     y2="406.89117"
     stroke="#000000"
     stroke-width="2"
     id="line162" />
  <!-- вертикална линия в такта -->
  <line
     x1="212"
     y1="236.89117"
     x2="212"
     y2="406.89117"
     stroke="#000000"
     stroke-width="1"
     id="line163" />
  <!-- вертикална линия в такта -->
  <line
     x1="222"
     y1="236.89117"
     x2="222"
     y2="406.89117"
     stroke="#000000"
     stroke-width="2"
     id="line164" />
  <!-- вертикална линия в такта -->
  <line
     x1="231.99998"
     y1="236.89117"
     x2="231.99998"
     y2="406.89117"
     stroke="#000000"
     stroke-width="1"
     id="line165" />
  <!-- нота -->
  <rect
     x="162"
     y="386.89117"
     width="10"
     height="10"
     fill="#5eba7a"
     stroke="#000000"
     stroke-width="1"
     id="rect165" />
  <!-- надпис на нота -->
  <text
     x="167"
     y="391.89117"
     fill="#000000"
     font-size="4.8px"
     dominant-baseline="middle"
     text-anchor="middle"
     id="text165">3</text>
  <!-- нота -->
  <rect
     x="172"
     y="356.89117"
     width="10"
     height="10"
     fill="#835eba"
     stroke="#000000"
     stroke-width="1"
     id="rect166" />
  <!-- надпис на нота -->
  <text
     x="177"
     y="361.89117"
     fill="#000000"
     font-size="4.8px"
     dominant-baseline="middle"
     text-anchor="middle"
     id="text166">6</text>
  <!-- нота -->
  <rect
     x="182"
     y="286.89117"
     width="10"
     height="10"
     fill="#e1e1b8"
     stroke="#000000"
     stroke-width="1"
     id="rect167" />
  <!-- надпис на нота -->
  <text
     x="187"
     y="291.89117"
     fill="#000000"
     font-size="4.8px"
     dominant-baseline="middle"
     text-anchor="middle"
     id="text167">1</text>
  <!-- нота -->
  <rect
     x="192"
     y="306.89117"
     width="10"
     height="10"
     fill="#ba8c5e"
     stroke="#000000"
     stroke-width="1"
     id="rect168" />
  <!-- надпис на нота -->
  <text
     x="197"
     y="311.89117"
     fill="#000000"
     font-size="4.8px"
     dominant-baseline="middle"
     text-anchor="middle"
     id="text168">11</text>
  <!-- нота -->
  <rect
     x="202"
     y="316.89117"
     width="10"
     height="10"
     fill="#ba805e"
     stroke="#000000"
     stroke-width="1"
     id="rect169" />
  <!-- надпис на нота -->
  <text
     x="207"
     y="321.89117"
     fill="#000000"
     font-size="4.8px"
     dominant-baseline="middle"
     text-anchor="middle"
     id="text169">10</text>
  <!-- нота -->
  <rect
     x="212"
     y="286.89117"
     width="10"
     height="10"
     fill="#e1e1b8"
     stroke="#000000"
     stroke-width="1"
     id="rect170" />
  <!-- надпис на нота -->
  <text
     x="217"
     y="291.89117"
     fill="#000000"
     font-size="4.8px"
     dominant-baseline="middle"
     text-anchor="middle"
     id="text170">1</text>
  <!-- нота -->
  <rect
     x="222"
     y="306.89117"
     width="10"
     height="10"
     fill="#ba8c5e"
     stroke="#000000"
     stroke-width="1"
     id="rect171" />
  <!-- надпис на нота -->
  <text
     x="226.99998"
     y="311.89117"
     fill="#000000"
     font-size="4.8px"
     dominant-baseline="middle"
     text-anchor="middle"
     id="text171">11</text>
  <!-- нота -->
  <rect
     x="231.99998"
     y="306.89117"
     width="10"
     height="10"
     fill="#ba8c5e"
     stroke="#000000"
     stroke-width="1"
     id="rect172" />
  <!-- надпис на нота -->
  <text
     x="236.99998"
     y="311.89117"
     fill="#000000"
     font-size="4.8px"
     dominant-baseline="middle"
     text-anchor="middle"
     id="text172">11</text>
  <!-- хоризонтална линия в такта -->
  <line
     x1="162"
     y1="396.89117"
     x2="241.99995"
     y2="396.89117"
     stroke="#000000"
     stroke-width="2"
     id="line172" />
  <!-- хоризонтална линия в такта -->
  <line
     x1="162"
     y1="386.89117"
     x2="241.99995"
     y2="386.89117"
     stroke="#000000"
     stroke-width="1"
     id="line173" />
  <!-- хоризонтална линия в такта -->
  <line
     x1="162"
     y1="376.89117"
     x2="241.99995"
     y2="376.89117"
     stroke="#000000"
     stroke-width="1"
     id="line174" />
  <!-- хоризонтална линия в такта -->
  <line
     x1="162"
     y1="366.89117"
     x2="241.99995"
     y2="366.89117"
     stroke="#000000"
     stroke-width="2"
     id="line175" />
  <!-- хоризонтална линия в такта -->
  <line
     x1="162"
     y1="356.89117"
     x2="241.99995"
     y2="356.89117"
     stroke="#000000"
     stroke-width="1"
     id="line176" />
  <!-- хоризонтална линия в такта -->
  <line
     x1="162"
     y1="346.89117"
     x2="241.99995"
     y2="346.89117"
     stroke="#000000"
     stroke-width="1"
     id="line177" />
  <!-- хоризонтална линия в такта -->
  <line
     x1="162"
     y1="336.89117"
     x2="241.99995"
     y2="336.89117"
     stroke="#000000"
     stroke-width="2"
     id="line178" />
  <!-- хоризонтална линия в такта -->
  <line
     x1="162"
     y1="326.89117"
     x2="241.99995"
     y2="326.89117"
     stroke="#000000"
     stroke-width="1"
     id="line179" />
  <!-- хоризонтална линия в такта -->
  <line
     x1="162"
     y1="316.89117"
     x2="241.99995"
     y2="316.89117"
     stroke="#000000"
     stroke-width="1"
     id="line180" />
  <!-- хоризонтална линия в такта -->
  <line
     x1="162"
     y1="306.89117"
     x2="241.99995"
     y2="306.89117"
     stroke="#000000"
     stroke-width="4"
     id="line181" />
  <!-- хоризонтална линия в такта -->
  <line
     x1="162"
     y1="296.89117"
     x2="241.99995"
     y2="296.89117"
     stroke="#000000"
     stroke-width="1"
     id="line182" />
  <!-- хоризонтална линия в такта -->
  <line
     x1="162"
     y1="286.89117"
     x2="241.99995"
     y2="286.89117"
     stroke="#000000"
     stroke-width="1"
     id="line183" />
  <!-- хоризонтална линия в такта -->
  <line
     x1="162"
     y1="276.89117"
     x2="241.99995"
     y2="276.89117"
     stroke="#000000"
     stroke-width="2"
     id="line184" />
  <!-- хоризонтална линия в такта -->
  <line
     x1="162"
     y1="266.89117"
     x2="241.99995"
     y2="266.89117"
     stroke="#000000"
     stroke-width="1"
     id="line185" />
  <!-- хоризонтална линия в такта -->
  <line
     x1="162"
     y1="256.89117"
     x2="241.99995"
     y2="256.89117"
     stroke="#000000"
     stroke-width="1"
     id="line186" />
  <!-- хоризонтална линия в такта -->
  <line
     x1="162"
     y1="246.89117"
     x2="241.99995"
     y2="246.89117"
     stroke="#000000"
     stroke-width="2"
     id="line187" />
  <!-- рамка на такт -->
  <rect
     x="162"
     y="236.89117"
     width="80"
     height="170"
     fill-opacity="0"
     stroke="#000000"
     stroke-width="4"
     id="rect187" />
  <!-- такт -->
  <!-- вертикална линия в такта -->
  <line
     x1="251.99995"
     y1="236.89117"
     x2="251.99995"
     y2="406.89117"
     stroke="#000000"
     stroke-width="1"
     id="line188" />
  <!-- вертикална линия в такта -->
  <line
     x1="261.99994"
     y1="236.89117"
     x2="261.99994"
     y2="406.89117"
     stroke="#000000"
     stroke-width="2"
     id="line189" />
  <!-- вертикална линия в такта -->
  <line
     x1="271.99994"
     y1="236.89117"
     x2="271.99994"
     y2="406.89117"
     stroke="#000000"
     stroke-width="1"
     id="line190" />
  <!-- вертикална линия в такта -->
  <line
     x1="281.99994"
     y1="236.89117"
     x2="281.99994"
     y2="406.89117"
     stroke="#000000"
     stroke-width="2"
     id="line191" />
  <!-- вертикална линия в такта -->
  <line
     x1="291.99994"
     y1="236.89117"
     x2="291.99994"
     y2="406.89117"
     stroke="#000000"
     stroke-width="1"
     id="line192" />
  <!-- вертикална линия в такта -->
  <line
     x1="301.99994"
     y1="236.89117"
     x2="301.99994"
     y2="406.89117"
     stroke="#000000"
     stroke-width="2"
     id="line193" />
  <!-- вертикална линия в такта -->
  <line
     x1="311.99994"
     y1="236.89117"
     x2="311.99994"
     y2="406.89117"
     stroke="#000000"
     stroke-width="1"
     id="line194" />
  <!-- нота -->
  <rect
     x="241.99995"
     y="316.89117"
     width="10"
     height="10"
     fill="#ba805e"
     stroke="#000000"
     stroke-width="1"
     id="rect194" />
  <!-- надпис на нота -->
  <text
     x="246.99995"
     y="321.89117"
     fill="#000000"
     font-size="4.8px"
     dominant-baseline="middle"
     text-anchor="middle"
     id="text194">10</text>
  <!-- нота -->
  <rect
     x="251.99995"
     y="316.89117"
     width="10"
     height="10"
     fill="#ba805e"
     stroke="#000000"
     stroke-width="1"
     id="rect195" />
  <!-- надпис на нота -->
  <text
     x="256.99994"
     y="321.89117"
     fill="#000000"
     font-size="4.8px"
     dominant-baseline="middle"
     text-anchor="middle"
     id="text195">10</text>
  <!-- нота -->
  <rect
     x="261.99994"
     y="396.89117"
     width="10"
     height="10"
     fill="#91ba5e"
     stroke="#000000"
     stroke-width="1"
     id="rect196" />
  <!-- надпис на нота -->
  <text
     x="266.99994"
     y="401.89117"
     fill="#000000"
     font-size="4.8px"
     dominant-baseline="middle"
     text-anchor="middle"
     id="text196">2</text>
  <!-- нота -->
  <rect
     x="271.99994"
     y="386.89117"
     width="40"
     height="10"
     fill="#5eba7a"
     stroke="#000000"
     stroke-width="1"
     id="rect197" />
  <!-- надпис на нота -->
  <text
     x="291.99994"
     y="391.89117"
     fill="#000000"
     font-size="4.8px"
     dominant-baseline="middle"
     text-anchor="middle"
     id="text197">3</text>
  <!-- хоризонтална линия в такта -->
  <line
     x1="241.99995"
     y1="396.89117"
     x2="321.99994"
     y2="396.89117"
     stroke="#000000"
     stroke-width="2"
     id="line197" />
  <!-- хоризонтална линия в такта -->
  <line
     x1="241.99995"
     y1="386.89117"
     x2="321.99994"
     y2="386.89117"
     stroke="#000000"
     stroke-width="1"
     id="line198" />
  <!-- хоризонтална линия в такта -->
  <line
     x1="241.99995"
     y1="376.89117"
     x2="321.99994"
     y2="376.89117"
     stroke="#000000"
     stroke-width="1"
     id="line199" />
  <!-- хоризонтална линия в такта -->
  <line
     x1="241.99995"
     y1="366.89117"
     x2="321.99994"
     y2="366.89117"
     stroke="#000000"
     stroke-width="2"
     id="line200" />
  <!-- хоризонтална линия в такта -->
  <line
     x1="241.99995"
     y1="356.89117"
     x2="321.99994"
     y2="356.89117"
     stroke="#000000"
     stroke-width="1"
     id="line201" />
  <!-- хоризонтална линия в такта -->
  <line
     x1="241.99995"
     y1="346.89117"
     x2="321.99994"
     y2="346.89117"
     stroke="#000000"
     stroke-width="1"
     id="line202" />
  <!-- хоризонтална линия в такта -->
  <line
     x1="241.99995"
     y1="336.89117"
     x2="321.99994"
     y2="336.89117"
     stroke="#000000"
     stroke-width="2"
     id="line203" />
  <!-- хоризонтална линия в такта -->
  <line
     x1="241.99995"
     y1="326.89117"
     x2="321.99994"
     y2="326.89117"
     stroke="#000000"
     stroke-width="1"
     id="line204" />
  <!-- хоризонтална линия в такта -->
  <line
     x1="241.99995"
     y1="316.89117"
     x2="321.99994"
     y2="316.89117"
     stroke="#000000"
     stroke-width="1"
     id="line205" />
  <!-- хоризонтална линия в такта -->
  <line
     x1="241.99995"
     y1="306.89117"
     x2="321.99994"
     y2="306.89117"
     stroke="#000000"
     stroke-width="4"
     id="line206" />
  <!-- хоризонтална линия в такта -->
  <line
     x1="241.99995"
     y1="296.89117"
     x2="321.99994"
     y2="296.89117"
     stroke="#000000"
     stroke-width="1"
     id="line207" />
  <!-- хоризонтална линия в такта -->
  <line
     x1="241.99995"
     y1="286.89117"
     x2="321.99994"
     y2="286.89117"
     stroke="#000000"
     stroke-width="1"
     id="line208" />
  <!-- хоризонтална линия в такта -->
  <line
     x1="241.99995"
     y1="276.89117"
     x2="321.99994"
     y2="276.89117"
     stroke="#000000"
     stroke-width="2"
     id="line209" />
  <!-- хоризонтална линия в такта -->
  <line
     x1="241.99995"
     y1="266.89117"
     x2="321.99994"
     y2="266.89117"
     stroke="#000000"
     stroke-width="1"
     id="line210" />
  <!-- хоризонтална линия в такта -->
  <line
     x1="241.99995"
     y1="256.89117"
     x2="321.99994"
     y2="256.89117"
     stroke="#000000"
     stroke-width="1"
     id="line211" />
  <!-- хоризонтална линия в такта -->
  <line
     x1="241.99995"
     y1="246.89117"
     x2="321.99994"
     y2="246.89117"
     stroke="#000000"
     stroke-width="2"
     id="line212" />
  <!-- рамка на такт -->
  <rect
     x="241.99995"
     y="236.89117"
     width="80"
     height="170"
     fill-opacity="0"
     stroke="#000000"
     stroke-width="4"
     id="rect212" />
  <!-- такт -->
  <!-- вертикална линия в такта -->
  <line
     x1="12"
     y1="420.89117"
     x2="12"
     y2="590.89117"
     stroke="#000000"
     stroke-width="1"
     id="line213" />
  <!-- вертикална линия в такта -->
  <line
     x1="22"
     y1="420.89117"
     x2="22"
     y2="590.89117"
     stroke="#000000"
     stroke-width="2"
     id="line214" />
  <!-- вертикална линия в такта -->
  <line
     x1="32"
     y1="420.89117"
     x2="32"
     y2="590.89117"
     stroke="#000000"
     stroke-width="1"
     id="line215" />
  <!-- вертикална линия в такта -->
  <line
     x1="42"
     y1="420.89117"
     x2="42"
     y2="590.89117"
     stroke="#000000"
     stroke-width="2"
     id="line216" />
  <!-- вертикална линия в такта -->
  <line
     x1="52"
     y1="420.89117"
     x2="52"
     y2="590.89117"
     stroke="#000000"
     stroke-width="1"
     id="line217" />
  <!-- вертикална линия в такта -->
  <line
     x1="62"
     y1="420.89117"
     x2="62"
     y2="590.89117"
     stroke="#000000"
     stroke-width="2"
     id="line218" />
  <!-- вертикална линия в такта -->
  <line
     x1="72"
     y1="420.89117"
     x2="72"
     y2="590.89117"
     stroke="#000000"
     stroke-width="1"
     id="line219" />
  <!-- нота -->
  <rect
     x="2"
     y="450.89117"
     width="10"
     height="10"
     fill="#b8e1c4"
     stroke="#000000"
     stroke-width="1"
     id="rect219" />
  <!-- надпис на нота -->
  <text
     x="7"
     y="455.89117"
     fill="#000000"
     font-size="4.8px"
     dominant-baseline="middle"
     text-anchor="middle"
     id="text219">3</text>
  <!-- нота -->
  <rect
     x="12"
     y="450.89117"
     width="10"
     height="10"
     fill="#b8e1c4"
     stroke="#000000"
     stroke-width="1"
     id="rect220" />
  <!-- надпис на нота -->
  <text
     x="17"
     y="455.89117"
     fill="#000000"
     font-size="4.8px"
     dominant-baseline="middle"
     text-anchor="middle"
     id="text220">3</text>
  <!-- нота -->
  <rect
     x="22"
     y="460.89117"
     width="10"
     height="10"
     fill="#cee1b8"
     stroke="#000000"
     stroke-width="1"
     id="rect221" />
  <!-- надпис на нота -->
  <text
     x="27"
     y="465.89117"
     fill="#000000"
     font-size="4.8px"
     dominant-baseline="middle"
     text-anchor="middle"
     id="text221">2</text>
  <!-- нота -->
  <rect
     x="32"
     y="470.89117"
     width="30"
     height="10"
     fill="#e1e1b8"
     stroke="#000000"
     stroke-width="1"
     id="rect222" />
  <!-- надпис на нота -->
  <text
     x="47"
     y="475.89117"
     fill="#000000"
     font-size="4.8px"
     dominant-baseline="middle"
     text-anchor="middle"
     id="text222">1</text>
  <!-- нота -->
  <rect
     x="62"
     y="470.89117"
     width="10"
     height="10"
     fill="#e1e1b8"
     stroke="#000000"
     stroke-width="1"
     id="rect223" />
  <!-- надпис на нота -->
  <text
     x="67"
     y="475.89117"
     fill="#000000"
     font-size="4.8px"
     dominant-baseline="middle"
     text-anchor="middle"
     id="text223">1</text>
  <!-- нота -->
  <rect
     x="72"
     y="430.89117"
     width="10"
     height="10"
     fill="#b8c3e1"
     stroke="#000000"
     stroke-width="1"
     id="rect224" />
  <!-- надпис на нота -->
  <text
     x="77"
     y="435.89117"
     fill="#000000"
     font-size="4.8px"
     dominant-baseline="middle"
     text-anchor="middle"
     id="text224">5</text>
  <!-- хоризонтална линия в такта -->
  <line
     x1="2"
     y1="580.89117"
     x2="82"
     y2="580.89117"
     stroke="#000000"
     stroke-width="2"
     id="line224" />
  <!-- хоризонтална линия в такта -->
  <line
     x1="2"
     y1="570.89117"
     x2="82"
     y2="570.89117"
     stroke="#000000"
     stroke-width="1"
     id="line225" />
  <!-- хоризонтална линия в такта -->
  <line
     x1="2"
     y1="560.89117"
     x2="82"
     y2="560.89117"
     stroke="#000000"
     stroke-width="1"
     id="line226" />
  <!-- хоризонтална линия в такта -->
  <line
     x1="2"
     y1="550.89117"
     x2="82"
     y2="550.89117"
     stroke="#000000"
     stroke-width="2"
     id="line227" />
  <!-- хоризонтална линия в такта -->
  <line
     x1="2"
     y1="540.89117"
     x2="82"
     y2="540.89117"
     stroke="#000000"
     stroke-width="1"
     id="line228" />
  <!-- хоризонтална линия в такта -->
  <line
     x1="2"
     y1="530.89117"
     x2="82"
     y2="530.89117"
     stroke="#000000"
     stroke-width="1"
     id="line229" />
  <!-- хоризонтална линия в такта -->
  <line
     x1="2"
     y1="520.89117"
     x2="82"
     y2="520.89117"
     stroke="#000000"
     stroke-width="2"
     id="line230" />
  <!-- хоризонтална линия в такта -->
  <line
     x1="2"
     y1="510.89117"
     x2="82"
     y2="510.89117"
     stroke="#000000"
     stroke-width="1"
     id="line231" />
  <!-- хоризонтална линия в такта -->
  <line
     x1="2"
     y1="500.89117"
     x2="82"
     y2="500.89117"
     stroke="#000000"
     stroke-width="1"
     id="line232" />
  <!-- хоризонтална линия в такта -->
  <line
     x1="2"
     y1="490.89117"
     x2="82"
     y2="490.89117"
     stroke="#000000"
     stroke-width="4"
     id="line233" />
  <!-- хоризонтална линия в такта -->
  <line
     x1="2"
     y1="480.89117"
     x2="82"
     y2="480.89117"
     stroke="#000000"
     stroke-width="1"
     id="line234" />
  <!-- хоризонтална линия в такта -->
  <line
     x1="2"
     y1="470.89117"
     x2="82"
     y2="470.89117"
     stroke="#000000"
     stroke-width="1"
     id="line235" />
  <!-- хоризонтална линия в такта -->
  <line
     x1="2"
     y1="460.89117"
     x2="82"
     y2="460.89117"
     stroke="#000000"
     stroke-width="2"
     id="line236" />
  <!-- хоризонтална линия в такта -->
  <line
     x1="2"
     y1="450.89117"
     x2="82"
     y2="450.89117"
     stroke="#000000"
     stroke-width="1"
     id="line237" />
  <!-- хоризонтална линия в такта -->
  <line
     x1="2"
     y1="440.89117"
     x2="82"
     y2="440.89117"
     stroke="#000000"
     stroke-width="1"
     id="line238" />
  <!-- хоризонтална линия в такта -->
  <line
     x1="2"
     y1="430.89117"
     x2="82"
     y2="430.89117"
     stroke="#000000"
     stroke-width="2"
     id="line239" />
  <!-- рамка на такт -->
  <rect
     x="2"
     y="420.89117"
     width="80"
     height="170"
     fill-opacity="0"
     stroke="#000000"
     stroke-width="4"
     id="rect239" />
  <!-- такт -->
  <!-- вертикална линия в такта -->
  <line
     x1="92"
     y1="420.89117"
     x2="92"
     y2="590.89117"
     stroke="#000000"
     stroke-width="1"
     id="line240" />
  <!-- вертикална линия в такта -->
  <line
     x1="102"
     y1="420.89117"
     x2="102"
     y2="590.89117"
     stroke="#000000"
     stroke-width="2"
     id="line241" />
  <!-- вертикална линия в такта -->
  <line
     x1="112"
     y1="420.89117"
     x2="112"
     y2="590.89117"
     stroke="#000000"
     stroke-width="1"
     id="line242" />
  <!-- вертикална линия в такта -->
  <line
     x1="122"
     y1="420.89117"
     x2="122"
     y2="590.89117"
     stroke="#000000"
     stroke-width="2"
     id="line243" />
  <!-- вертикална линия в такта -->
  <line
     x1="132"
     y1="420.89117"
     x2="132"
     y2="590.89117"
     stroke="#000000"
     stroke-width="1"
     id="line244" />
  <!-- вертикална линия в такта -->
  <line
     x1="142"
     y1="420.89117"
     x2="142"
     y2="590.89117"
     stroke="#000000"
     stroke-width="2"
     id="line245" />
  <!-- вертикална линия в такта -->
  <line
     x1="152"
     y1="420.89117"
     x2="152"
     y2="590.89117"
     stroke="#000000"
     stroke-width="1"
     id="line246" />
  <!-- нота -->
  <rect
     x="92"
     y="450.89117"
     width="10"
     height="10"
     fill="#b8e1c4"
     stroke="#000000"
     stroke-width="1"
     id="rect246" />
  <!-- надпис на нота -->
  <text
     x="97"
     y="455.89117"
     fill="#000000"
     font-size="4.8px"
     dominant-baseline="middle"
     text-anchor="middle"
     id="text246">3</text>
  <!-- нота -->
  <rect
     x="102"
     y="490.89117"
     width="10"
     height="10"
     fill="#ba8c5e"
     stroke="#000000"
     stroke-width="1"
     id="rect247" />
  <!-- надпис на нота -->
  <text
     x="107"
     y="495.89117"
     fill="#000000"
     font-size="4.8px"
     dominant-baseline="middle"
     text-anchor="middle"
     id="text247">11</text>
  <!-- нота -->
  <rect
     x="112"
     y="500.89117"
     width="30"
     height="10"
     fill="#ba805e"
     stroke="#000000"
     stroke-width="1"
     id="rect248" />
  <!-- надпис на нота -->
  <text
     x="127"
     y="505.89117"
     fill="#000000"
     font-size="4.8px"
     dominant-baseline="middle"
     text-anchor="middle"
     id="text248">10</text>
  <!-- нота -->
  <rect
     x="142"
     y="500.89117"
     width="10"
     height="10"
     fill="#ba805e"
     stroke="#000000"
     stroke-width="1"
     id="rect249" />
  <!-- надпис на нота -->
  <text
     x="147"
     y="505.89117"
     fill="#000000"
     font-size="4.8px"
     dominant-baseline="middle"
     text-anchor="middle"
     id="text249">10</text>
  <!-- нота -->
  <rect
     x="152"
     y="470.89117"
     width="10"
     height="10"
     fill="#e1e1b8"
     stroke="#000000"
     stroke-width="1"
     id="rect250" />
  <!-- надпис на нота -->
  <text
     x="157"
     y="475.89117"
     fill="#000000"
     font-size="4.8px"
     dominant-baseline="middle"
     text-anchor="middle"
     id="text250">1</text>
  <!-- хоризонтална линия в такта -->
  <line
     x1="82"
     y1="580.89117"
     x2="162"
     y2="580.89117"
     stroke="#000000"
     stroke-width="2"
     id="line250" />
  <!-- хоризонтална линия в такта -->
  <line
     x1="82"
     y1="570.89117"
     x2="162"
     y2="570.89117"
     stroke="#000000"
     stroke-width="1"
     id="line251" />
  <!-- хоризонтална линия в такта -->
  <line
     x1="82"
     y1="560.89117"
     x2="162"
     y2="560.89117"
     stroke="#000000"
     stroke-width="1"
     id="line252" />
  <!-- хоризонтална линия в такта -->
  <line
     x1="82"
     y1="550.89117"
     x2="162"
     y2="550.89117"
     stroke="#000000"
     stroke-width="2"
     id="line253" />
  <!-- хоризонтална линия в такта -->
  <line
     x1="82"
     y1="540.89117"
     x2="162"
     y2="540.89117"
     stroke="#000000"
     stroke-width="1"
     id="line254" />
  <!-- хоризонтална линия в такта -->
  <line
     x1="82"
     y1="530.89117"
     x2="162"
     y2="530.89117"
     stroke="#000000"
     stroke-width="1"
     id="line255" />
  <!-- хоризонтална линия в такта -->
  <line
     x1="82"
     y1="520.89117"
     x2="162"
     y2="520.89117"
     stroke="#000000"
     stroke-width="2"
     id="line256" />
  <!-- хоризонтална линия в такта -->
  <line
     x1="82"
     y1="510.89117"
     x2="162"
     y2="510.89117"
     stroke="#000000"
     stroke-width="1"
     id="line257" />
  <!-- хоризонтална линия в такта -->
  <line
     x1="82"
     y1="500.89117"
     x2="162"
     y2="500.89117"
     stroke="#000000"
     stroke-width="1"
     id="line258" />
  <!-- хоризонтална линия в такта -->
  <line
     x1="82"
     y1="490.89117"
     x2="162"
     y2="490.89117"
     stroke="#000000"
     stroke-width="4"
     id="line259" />
  <!-- хоризонтална линия в такта -->
  <line
     x1="82"
     y1="480.89117"
     x2="162"
     y2="480.89117"
     stroke="#000000"
     stroke-width="1"
     id="line260" />
  <!-- хоризонтална линия в такта -->
  <line
     x1="82"
     y1="470.89117"
     x2="162"
     y2="470.89117"
     stroke="#000000"
     stroke-width="1"
     id="line261" />
  <!-- хоризонтална линия в такта -->
  <line
     x1="82"
     y1="460.89117"
     x2="162"
     y2="460.89117"
     stroke="#000000"
     stroke-width="2"
     id="line262" />
  <!-- хоризонтална линия в такта -->
  <line
     x1="82"
     y1="450.89117"
     x2="162"
     y2="450.89117"
     stroke="#000000"
     stroke-width="1"
     id="line263" />
  <!-- хоризонтална линия в такта -->
  <line
     x1="82"
     y1="440.89117"
     x2="162"
     y2="440.89117"
     stroke="#000000"
     stroke-width="1"
     id="line264" />
  <!-- хоризонтална линия в такта -->
  <line
     x1="82"
     y1="430.89117"
     x2="162"
     y2="430.89117"
     stroke="#000000"
     stroke-width="2"
     id="line265" />
  <!-- рамка на такт -->
  <rect
     x="82"
     y="420.89117"
     width="80"
     height="170"
     fill-opacity="0"
     stroke="#000000"
     stroke-width="4"
     id="rect265" />
  <!-- такт -->
  <!-- вертикална линия в такта -->
  <line
     x1="172"
     y1="420.89117"
     x2="172"
     y2="590.89117"
     stroke="#000000"
     stroke-width="1"
     id="line266" />
  <!-- вертикална линия в такта -->
  <line
     x1="182.00003"
     y1="420.89117"
     x2="182.00003"
     y2="590.89117"
     stroke="#000000"
     stroke-width="2"
     id="line267" />
  <!-- вертикална линия в такта -->
  <line
     x1="192.00003"
     y1="420.89117"
     x2="192.00003"
     y2="590.89117"
     stroke="#000000"
     stroke-width="1"
     id="line268" />
  <!-- вертикална линия в такта -->
  <line
     x1="202.00003"
     y1="420.89117"
     x2="202.00003"
     y2="590.89117"
     stroke="#000000"
     stroke-width="2"
     id="line269" />
  <!-- вертикална линия в такта -->
  <line
     x1="212.00003"
     y1="420.89117"
     x2="212.00003"
     y2="590.89117"
     stroke="#000000"
     stroke-width="1"
     id="line270" />
  <!-- вертикална линия в такта -->
  <line
     x1="222.00003"
     y1="420.89117"
     x2="222.00003"
     y2="590.89117"
     stroke="#000000"
     stroke-width="2"
     id="line271" />
  <!-- вертикална линия в такта -->
  <line
     x1="232.00002"
     y1="420.89117"
     x2="232.00002"
     y2="590.89117"
     stroke="#000000"
     stroke-width="1"
     id="line272" />
  <!-- нота -->
  <rect
     x="162"
     y="500.89117"
     width="10"
     height="10"
     fill="#ba805e"
     stroke="#000000"
     stroke-width="1"
     id="rect272" />
  <!-- надпис на нота -->
  <text
     x="167"
     y="505.89117"
     fill="#000000"
     font-size="4.8px"
     dominant-baseline="middle"
     text-anchor="middle"
     id="text272">10</text>
  <!-- нота -->
  <rect
     x="172"
     y="520.89117"
     width="30"
     height="10"
     fill="#ba5e99"
     stroke="#000000"
     stroke-width="1"
     id="rect273" />
  <!-- надпис на нота -->
  <text
     x="187.00003"
     y="525.89117"
     fill="#000000"
     font-size="4.8px"
     dominant-baseline="middle"
     text-anchor="middle"
     id="text273">8</text>
  <!-- нота -->
  <rect
     x="202.00003"
     y="520.89117"
     width="10"
     height="10"
     fill="#ba5e99"
     stroke="#000000"
     stroke-width="1"
     id="rect274" />
  <!-- надпис на нота -->
  <text
     x="207.00003"
     y="525.89117"
     fill="#000000"
     font-size="4.8px"
     dominant-baseline="middle"
     text-anchor="middle"
     id="text274">8</text>
  <!-- нота -->
  <rect
     x="212.00003"
     y="490.89117"
     width="10"
     height="10"
     fill="#ba8c5e"
     stroke="#000000"
     stroke-width="1"
     id="rect275" />
  <!-- надпис на нота -->
  <text
     x="217.00003"
     y="495.89117"
     fill="#000000"
     font-size="4.8px"
     dominant-baseline="middle"
     text-anchor="middle"
     id="text275">11</text>
  <!-- нота -->
  <rect
     x="222.00003"
     y="520.89117"
     width="10"
     height="10"
     fill="#ba5e99"
     stroke="#000000"
     stroke-width="1"
     id="rect276" />
  <!-- надпис на нота -->
  <text
     x="227.00002"
     y="525.89117"
     fill="#000000"
     font-size="4.8px"
     dominant-baseline="middle"
     text-anchor="middle"
     id="text276">8</text>
  <!-- нота -->
  <rect
     x="232.00002"
     y="500.89117"
     width="10"
     height="10"
     fill="#ba805e"
     stroke="#000000"
     stroke-width="1"
     id="rect277" />
  <!-- надпис на нота -->
  <text
     x="237.00002"
     y="505.89117"
     fill="#000000"
     font-size="4.8px"
     dominant-baseline="middle"
     text-anchor="middle"
     id="text277">10</text>
  <!-- нота -->
  <rect
     x="232.00002"
     y="500.89117"
     width="10"
     height="10"
     fill="#ba805e"
     stroke="#000000"
     stroke-width="1"
     id="rect278" />
  <!-- надпис на нота -->
  <text
     x="237.00002"
     y="505.89117"
     fill="#000000"
     font-size="4.8px"
     dominant-baseline="middle"
     text-anchor="middle"
     id="text278">10</text>
  <!-- хоризонтална линия в такта -->
  <line
     x1="162"
     y1="580.89117"
     x2="242.00002"
     y2="580.89117"
     stroke="#000000"
     stroke-width="2"
     id="line278" />
  <!-- хоризонтална линия в такта -->
  <line
     x1="162"
     y1="570.89117"
     x2="242.00002"
     y2="570.89117"
     stroke="#000000"
     stroke-width="1"
     id="line279" />
  <!-- хоризонтална линия в такта -->
  <line
     x1="162"
     y1="560.89117"
     x2="242.00002"
     y2="560.89117"
     stroke="#000000"
     stroke-width="1"
     id="line280" />
  <!-- хоризонтална линия в такта -->
  <line
     x1="162"
     y1="550.89117"
     x2="242.00002"
     y2="550.89117"
     stroke="#000000"
     stroke-width="2"
     id="line281" />
  <!-- хоризонтална линия в такта -->
  <line
     x1="162"
     y1="540.89117"
     x2="242.00002"
     y2="540.89117"
     stroke="#000000"
     stroke-width="1"
     id="line282" />
  <!-- хоризонтална линия в такта -->
  <line
     x1="162"
     y1="530.89117"
     x2="242.00002"
     y2="530.89117"
     stroke="#000000"
     stroke-width="1"
     id="line283" />
  <!-- хоризонтална линия в такта -->
  <line
     x1="162"
     y1="520.89117"
     x2="242.00002"
     y2="520.89117"
     stroke="#000000"
     stroke-width="2"
     id="line284" />
  <!-- хоризонтална линия в такта -->
  <line
     x1="162"
     y1="510.89117"
     x2="242.00002"
     y2="510.89117"
     stroke="#000000"
     stroke-width="1"
     id="line285" />
  <!-- хоризонтална линия в такта -->
  <line
     x1="162"
     y1="500.89117"
     x2="242.00002"
     y2="500.89117"
     stroke="#000000"
     stroke-width="1"
     id="line286" />
  <!-- хоризонтална линия в такта -->
  <line
     x1="162"
     y1="490.89117"
     x2="242.00002"
     y2="490.89117"
     stroke="#000000"
     stroke-width="4"
     id="line287" />
  <!-- хоризонтална линия в такта -->
  <line
     x1="162"
     y1="480.89117"
     x2="242.00002"
     y2="480.89117"
     stroke="#000000"
     stroke-width="1"
     id="line288" />
  <!-- хоризонтална линия в такта -->
  <line
     x1="162"
     y1="470.89117"
     x2="242.00002"
     y2="470.89117"
     stroke="#000000"
     stroke-width="1"
     id="line289" />
  <!-- хоризонтална линия в такта -->
  <line
     x1="162"
     y1="460.89117"
     x2="242.00002"
     y2="460.89117"
     stroke="#000000"
     stroke-width="2"
     id="line290" />
  <!-- хоризонтална линия в такта -->
  <line
     x1="162"
     y1="450.89117"
     x2="242.00002"
     y2="450.89117"
     stroke="#000000"
     stroke-width="1"
     id="line291" />
  <!-- хоризонтална линия в такта -->
  <line
     x1="162"
     y1="440.89117"
     x2="242.00002"
     y2="440.89117"
     stroke="#000000"
     stroke-width="1"
     id="line292" />
  <!-- хоризонтална линия в такта -->
  <line
     x1="162"
     y1="430.89117"
     x2="242.00002"
     y2="430.89117"
     stroke="#000000"
     stroke-width="2"
     id="line293" />
  <!-- рамка на такт -->
  <rect
     x="162"
     y="420.89117"
     width="80"
     height="170"
     fill-opacity="0"
     stroke="#000000"
     stroke-width="4"
     id="rect293" />
  <line
     x1="252.00002"
     y1="420.89117"
     x2="252.00002"
     y2="590.89117"
     stroke="#000000"
     stroke-width="1"
     id="line266-3" />
  <line
     x1="262.00006"
     y1="420.89117"
     x2="262.00006"
     y2="590.89117"
     stroke="#000000"
     stroke-width="2"
     id="line267-6" />
  <line
     x1="272.00006"
     y1="420.89117"
     x2="272.00006"
     y2="590.89117"
     stroke="#000000"
     stroke-width="1"
     id="line268-7" />
  <line
     x1="282.00006"
     y1="420.89117"
     x2="282.00006"
     y2="590.89117"
     stroke="#000000"
     stroke-width="2"
     id="line269-5" />
  <line
     x1="292.00006"
     y1="420.89117"
     x2="292.00006"
     y2="590.89117"
     stroke="#000000"
     stroke-width="1"
     id="line270-3" />
  <line
     x1="302.00006"
     y1="420.89117"
     x2="302.00006"
     y2="590.89117"
     stroke="#000000"
     stroke-width="2"
     id="line271-5" />
  <line
     x1="312.00006"
     y1="420.89117"
     x2="312.00006"
     y2="590.89117"
     stroke="#000000"
     stroke-width="1"
     id="line272-6" />
  <line
     x1="242.00002"
     y1="580.89117"
     x2="322.00006"
     y2="580.89117"
     stroke="#000000"
     stroke-width="2"
     id="line278-8" />
  <line
     x1="242.00002"
     y1="570.89117"
     x2="322.00006"
     y2="570.89117"
     stroke="#000000"
     stroke-width="1"
     id="line279-7" />
  <line
     x1="242.00002"
     y1="560.89117"
     x2="322.00006"
     y2="560.89117"
     stroke="#000000"
     stroke-width="1"
     id="line280-9" />
  <line
     x1="242.00002"
     y1="550.89117"
     x2="322.00006"
     y2="550.89117"
     stroke="#000000"
     stroke-width="2"
     id="line281-2" />
  <line
     x1="242.00002"
     y1="540.89117"
     x2="322.00006"
     y2="540.89117"
     stroke="#000000"
     stroke-width="1"
     id="line282-0" />
  <line
     x1="242.00002"
     y1="530.89117"
     x2="322.00006"
     y2="530.89117"
     stroke="#000000"
     stroke-width="1"
     id="line283-2" />
  <line
     x1="242.00002"
     y1="520.89117"
     x2="322.00006"
     y2="520.89117"
     stroke="#000000"
     stroke-width="2"
     id="line284-3" />
  <line
     x1="242.00002"
     y1="510.89117"
     x2="322.00006"
     y2="510.89117"
     stroke="#000000"
     stroke-width="1"
     id="line285-7" />
  <line
     x1="242.00002"
     y1="500.89117"
     x2="322.00006"
     y2="500.89117"
     stroke="#000000"
     stroke-width="1"
     id="line286-5" />
  <line
     x1="242.00002"
     y1="490.89117"
     x2="322.00006"
     y2="490.89117"
     stroke="#000000"
     stroke-width="4"
     id="line287-9" />
  <line
     x1="242.00002"
     y1="480.89117"
     x2="322.00006"
     y2="480.89117"
     stroke="#000000"
     stroke-width="1"
     id="line288-2" />
  <line
     x1="242.00002"
     y1="470.89117"
     x2="322.00006"
     y2="470.89117"
     stroke="#000000"
     stroke-width="1"
     id="line289-2" />
  <line
     x1="242.00002"
     y1="460.89117"
     x2="322.00006"
     y2="460.89117"
     stroke="#000000"
     stroke-width="2"
     id="line290-8" />
  <line
     x1="242.00002"
     y1="450.89117"
     x2="322.00006"
     y2="450.89117"
     stroke="#000000"
     stroke-width="1"
     id="line291-9" />
  <line
     x1="242.00002"
     y1="440.89117"
     x2="322.00006"
     y2="440.89117"
     stroke="#000000"
     stroke-width="1"
     id="line292-7" />
  <line
     x1="242.00002"
     y1="430.89117"
     x2="322.00006"
     y2="430.89117"
     stroke="#000000"
     stroke-width="2"
     id="line293-3" />
  <rect
     x="242.00002"
     y="420.89117"
     width="80"
     height="170"
     fill-opacity="0"
     stroke="#000000"
     stroke-width="4"
     id="rect293-6" />
</svg>
