---- Minecraft Crash Report ----
// Don't be sad, have a hug! <3

Time: 25/07/19 04:26 PM
Description: Exception in server tick loop

Missing Mods:
	forge : [14.23.5.2768,)

net.minecraftforge.fml.common.MissingModsException: Mod biomesoplenty (Biomes O' Plenty) requires [forge@[14.23.5.2768,)]
	at net.minecraftforge.fml.common.Loader.sortModList(Loader.java:278)
	at net.minecraftforge.fml.common.Loader.loadMods(Loader.java:545)
	at net.minecraftforge.fml.server.FMLServerHandler.beginServerLoading(FMLServerHandler.java:97)
	at net.minecraftforge.fml.common.FMLCommonHandler.onServerStart(FMLCommonHandler.java:331)
	at net.minecraft.server.dedicated.DedicatedServer.func_71197_b(DedicatedServer.java:125)
	at net.minecraft.server.MinecraftServer.run(MinecraftServer.java:484)
	at java.lang.Thread.run(Unknown Source)


A detailed walkthrough of the error, its code path and all known details is as follows:
---------------------------------------------------------------------------------------

-- System Details --
Details:
	Minecraft Version: 1.12.2
	Operating System: Windows 10 (x86) version 10.0
	Java Version: 1.8.0_201, Oracle Corporation
	Java VM Version: Java HotSpot(TM) Client VM (mixed mode, sharing), Oracle Corporation
	Memory: 66303064 bytes (63 MB) / 203689984 bytes (194 MB) up to 259522560 bytes (247 MB)
	JVM Flags: 0 total; 
	IntCache: cache: 0, tcache: 0, allocated: 0, tallocated: 0
	FML: MCP 9.42 Powered by Forge 14.23.1.2590 9 mods loaded, 9 mods active
	States: 'U' = Unloaded 'L' = Loaded 'C' = Constructed 'H' = Pre-initialized 'I' = Initialized 'J' = Post-initialized 'A' = Available 'D' = Disabled 'E' = Errored

	| State | ID                | Version       | Source                                        | Signature                                |
	|:----- |:----------------- |:------------- |:--------------------------------------------- |:---------------------------------------- |
	| U     | minecraft         | 1.12.2        | minecraft.jar                                 | None                                     |
	| U     | mcp               | 9.42          | minecraft.jar                                 | None                                     |
	| U     | FML               | 8.0.99.99     | forge-1.12.2-14.23.1.2590-universal.jar       | e3c3d50c7c986df74c645c0ac54639741c90a557 |
	| U     | forge             | 14.23.1.2590  | forge-1.12.2-14.23.1.2590-universal.jar       | e3c3d50c7c986df74c645c0ac54639741c90a557 |
	| U     | biomesoplenty     | 7.0.1.2438    | BiomesOPlenty-1.12.2-7.0.1.2438-universal.jar | None                                     |
	| U     | customspawner     | 3.11.4        | CustomMobSpawner-3.11.4.jar.zip               | None                                     |
	| U     | mocreatures       | 12.0.5        | DrZharks+MoCreatures+Mod-12.0.5.jar           | None                                     |
	| U     | ic2               | 2.8.170-ex112 | industrialcraft-2-2.8.170-ex112.jar           | None                                     |
	| U     | mercurius_updater | 1.0           | MercuriusUpdater-1.12.2.jar                   | None                                     |

	Loaded coremods (and transformers): 
	Profiler Position: N/A (disabled)
	Is Modded: Definitely; Server brand changed to 'fml,forge'
	Type: Dedicated Server (map_server.txt)