{
  "594e8ed1-cfb4-3b61-b198-123eeb2f56c2": "lordcrts",
  "600f3852-5403-382f-82dd-9dd76ce89b4e": "Niklox",
  "6ee85153-a31e-399e-9676-77ee7bd9d55e": "leo",
  "23989bd8-10eb-3d19-9c2e-a9f10d0e5630": "Gabo",
  "551dd0fd-f25e-3199-8165-b6cd2cea11b6": "Hugo",
  "152e54d6-def6-321b-90b3-da353d204afb": "dandresrivera",
  "9700026a-079f-3a8d-9565-8cad5cbfee46": "TH1AG0",
  "154febfc-24f6-3544-8610-3beb01265b10": "jomazao",
  "50dfa8e6-e5c4-3dec-9655-32fb1b69a83f": "CcamiloG"
}