%YAML 1.1
%TAG !u! tag:unity3d.com,2011:
--- !u!74 &7400000
AnimationClip:
  m_ObjectHideFlags: 0
  m_CorrespondingSourceObject: {fileID: 0}
  m_PrefabInstance: {fileID: 0}
  m_PrefabAsset: {fileID: 0}
  m_Name: Move
  serializedVersion: 6
  m_Legacy: 0
  m_Compressed: 0
  m_UseHighQualityCurve: 1
  m_RotationCurves: []
  m_CompressedRotationCurves: []
  m_EulerCurves: []
  m_PositionCurves: []
  m_ScaleCurves: []
  m_FloatCurves: []
  m_PPtrCurves:
  - curve:
    - time: 0
      value: {fileID: 21300000, guid: 7409dc7f89d001a438c85d01a022165e, type: 3}
    - time: 0.016666668
      value: {fileID: 21300000, guid: 98ad52ec1605217449bebafa6c22aaef, type: 3}
    - time: 0.033333335
      value: {fileID: 21300000, guid: b93022eceb040674d80be4cb93d29a53, type: 3}
    - time: 0.05
      value: {fileID: 21300000, guid: 7b6c3b50377cad14eb7e286cf7524b34, type: 3}
    - time: 0.06666667
      value: {fileID: 21300000, guid: c77a1f42e0c4f2c49b9b54a7ca301992, type: 3}
    - time: 0.083333336
      value: {fileID: 21300000, guid: 39d481f35b550db439e5a419a6280478, type: 3}
    - time: 0.1
      value: {fileID: 21300000, guid: 9e6771914bdfbe34d90434e8758305de, type: 3}
    - time: 0.11666667
      value: {fileID: 21300000, guid: 03a2756cfd94154448d499938fc61d86, type: 3}
    - time: 0.13333334
      value: {fileID: 21300000, guid: 2841578dba49cd648bae954b2b9fc82d, type: 3}
    - time: 0.15
      value: {fileID: 21300000, guid: 99cd39bc2e52f4b40802e61547fbbe8b, type: 3}
    - time: 0.16666667
      value: {fileID: 21300000, guid: d4cffd8732f902443acda56a922a6cd6, type: 3}
    - time: 0.18333334
      value: {fileID: 21300000, guid: e482a2d7e6fdf2945baa658a0e4fb15c, type: 3}
    - time: 0.2
      value: {fileID: 21300000, guid: e3271356ff73b3f4ca7de6c24b9d4901, type: 3}
    - time: 0.21666667
      value: {fileID: 21300000, guid: c4d3a10257636724a869eba50c576575, type: 3}
    - time: 0.23333333
      value: {fileID: 21300000, guid: 9ac224fdb10885d4499397fc72eeef42, type: 3}
    - time: 0.25
      value: {fileID: 21300000, guid: d981974ff3d600946a392ef9a3c9880f, type: 3}
    - time: 0.26666668
      value: {fileID: 21300000, guid: 648f0e8c7d31b494abc6cd272793ce7c, type: 3}
    - time: 0.28333333
      value: {fileID: 21300000, guid: a81219737cd04574aaa387a5bd09fcf9, type: 3}
    attribute: m_Sprite
    path: 
    classID: 212
    script: {fileID: 0}
  m_SampleRate: 60
  m_WrapMode: 0
  m_Bounds:
    m_Center: {x: 0, y: 0, z: 0}
    m_Extent: {x: 0, y: 0, z: 0}
  m_ClipBindingConstant:
    genericBindings:
    - serializedVersion: 2
      path: 0
      attribute: 0
      script: {fileID: 0}
      typeID: 212
      customType: 23
      isPPtrCurve: 1
    pptrCurveMapping:
    - {fileID: 21300000, guid: 7409dc7f89d001a438c85d01a022165e, type: 3}
    - {fileID: 21300000, guid: 98ad52ec1605217449bebafa6c22aaef, type: 3}
    - {fileID: 21300000, guid: b93022eceb040674d80be4cb93d29a53, type: 3}
    - {fileID: 21300000, guid: 7b6c3b50377cad14eb7e286cf7524b34, type: 3}
    - {fileID: 21300000, guid: c77a1f42e0c4f2c49b9b54a7ca301992, type: 3}
    - {fileID: 21300000, guid: 39d481f35b550db439e5a419a6280478, type: 3}
    - {fileID: 21300000, guid: 9e6771914bdfbe34d90434e8758305de, type: 3}
    - {fileID: 21300000, guid: 03a2756cfd94154448d499938fc61d86, type: 3}
    - {fileID: 21300000, guid: 2841578dba49cd648bae954b2b9fc82d, type: 3}
    - {fileID: 21300000, guid: 99cd39bc2e52f4b40802e61547fbbe8b, type: 3}
    - {fileID: 21300000, guid: d4cffd8732f902443acda56a922a6cd6, type: 3}
    - {fileID: 21300000, guid: e482a2d7e6fdf2945baa658a0e4fb15c, type: 3}
    - {fileID: 21300000, guid: e3271356ff73b3f4ca7de6c24b9d4901, type: 3}
    - {fileID: 21300000, guid: c4d3a10257636724a869eba50c576575, type: 3}
    - {fileID: 21300000, guid: 9ac224fdb10885d4499397fc72eeef42, type: 3}
    - {fileID: 21300000, guid: d981974ff3d600946a392ef9a3c9880f, type: 3}
    - {fileID: 21300000, guid: 648f0e8c7d31b494abc6cd272793ce7c, type: 3}
    - {fileID: 21300000, guid: a81219737cd04574aaa387a5bd09fcf9, type: 3}
  m_AnimationClipSettings:
    serializedVersion: 2
    m_AdditiveReferencePoseClip: {fileID: 0}
    m_AdditiveReferencePoseTime: 0
    m_StartTime: 0
    m_StopTime: 0.3
    m_OrientationOffsetY: 0
    m_Level: 0
    m_CycleOffset: 0
    m_HasAdditiveReferencePose: 0
    m_LoopTime: 1
    m_LoopBlend: 0
    m_LoopBlendOrientation: 0
    m_LoopBlendPositionY: 0
    m_LoopBlendPositionXZ: 0
    m_KeepOriginalOrientation: 0
    m_KeepOriginalPositionY: 1
    m_KeepOriginalPositionXZ: 0
    m_HeightFromFeet: 0
    m_Mirror: 0
  m_EditorCurves: []
  m_EulerEditorCurves: []
  m_HasGenericRootTransform: 0
  m_HasMotionFloatCurves: 0
  m_Events: []
