%YAML 1.1
%TAG !u! tag:unity3d.com,2011:
--- !u!114 &8841239857944669260
MonoBehaviour:
  m_ObjectHideFlags: 0
  m_CorrespondingSourceObject: {fileID: 0}
  m_PrefabInstance: {fileID: 0}
  m_PrefabAsset: {fileID: 0}
  m_GameObject: {fileID: 2952838188626515253}
  m_Enabled: 1
  m_EditorHideFlags: 0
  m_Script: {fileID: 11500000, guid: fbc6d1dfa12cd8c4383899855f5be9ba, type: 3}
  m_Name: 
  m_EditorClassIdentifier: 
  speed: 5
  xMinPos: 0
  xMaxPos: 0
  directionX: 1
--- !u!1001 &2610961205166581860
PrefabInstance:
  m_ObjectHideFlags: 0
  serializedVersion: 2
  m_Modification:
    m_TransformParent: {fileID: 0}
    m_Modifications:
    - target: {fileID: -8679921383154817045, guid: b5eaa30fb5f3fa847bac721e1e1dc0bb,
        type: 3}
      propertyPath: m_LocalPosition.x
      value: 3.015305
      objectReference: {fileID: 0}
    - target: {fileID: -8679921383154817045, guid: b5eaa30fb5f3fa847bac721e1e1dc0bb,
        type: 3}
      propertyPath: m_LocalPosition.y
      value: 3.7862952e-17
      objectReference: {fileID: 0}
    - target: {fileID: -8679921383154817045, guid: b5eaa30fb5f3fa847bac721e1e1dc0bb,
        type: 3}
      propertyPath: m_LocalPosition.z
      value: -0.48938516
      objectReference: {fileID: 0}
    - target: {fileID: -8679921383154817045, guid: b5eaa30fb5f3fa847bac721e1e1dc0bb,
        type: 3}
      propertyPath: m_LocalRotation.x
      value: 0
      objectReference: {fileID: 0}
    - target: {fileID: -8679921383154817045, guid: b5eaa30fb5f3fa847bac721e1e1dc0bb,
        type: 3}
      propertyPath: m_LocalRotation.y
      value: 0.7071068
      objectReference: {fileID: 0}
    - target: {fileID: -8679921383154817045, guid: b5eaa30fb5f3fa847bac721e1e1dc0bb,
        type: 3}
      propertyPath: m_LocalRotation.z
      value: 0
      objectReference: {fileID: 0}
    - target: {fileID: -8679921383154817045, guid: b5eaa30fb5f3fa847bac721e1e1dc0bb,
        type: 3}
      propertyPath: m_LocalRotation.w
      value: 0.7071068
      objectReference: {fileID: 0}
    - target: {fileID: -8679921383154817045, guid: b5eaa30fb5f3fa847bac721e1e1dc0bb,
        type: 3}
      propertyPath: m_RootOrder
      value: 0
      objectReference: {fileID: 0}
    - target: {fileID: -8679921383154817045, guid: b5eaa30fb5f3fa847bac721e1e1dc0bb,
        type: 3}
      propertyPath: m_LocalEulerAnglesHint.x
      value: 0
      objectReference: {fileID: 0}
    - target: {fileID: -8679921383154817045, guid: b5eaa30fb5f3fa847bac721e1e1dc0bb,
        type: 3}
      propertyPath: m_LocalEulerAnglesHint.y
      value: 90
      objectReference: {fileID: 0}
    - target: {fileID: -8679921383154817045, guid: b5eaa30fb5f3fa847bac721e1e1dc0bb,
        type: 3}
      propertyPath: m_LocalEulerAnglesHint.z
      value: 0
      objectReference: {fileID: 0}
    - target: {fileID: 919132149155446097, guid: b5eaa30fb5f3fa847bac721e1e1dc0bb,
        type: 3}
      propertyPath: m_Name
      value: Car Variant
      objectReference: {fileID: 0}
    m_RemovedComponents: []
  m_SourcePrefab: {fileID: 100100000, guid: b5eaa30fb5f3fa847bac721e1e1dc0bb, type: 3}
--- !u!1 &2952838188626515253 stripped
GameObject:
  m_CorrespondingSourceObject: {fileID: 919132149155446097, guid: b5eaa30fb5f3fa847bac721e1e1dc0bb,
    type: 3}
  m_PrefabInstance: {fileID: 2610961205166581860}
  m_PrefabAsset: {fileID: 0}
