[gd_scene load_steps=3 format=2]

[ext_resource path="res://assets/sprites/Farol.png" type="Texture" id=1]

[sub_resource type="BoxShape" id=1]
extents = Vector3( 0.071203, 0.304806, 0.306744 )

[node name="StreetLampSpecial" type="Sprite3D"]
transform = Transform( 6, 0, 0, 0, 6, 0, 0, 0, 1, 0, 0, 0 )
billboard = 2
texture = ExtResource( 1 )

[node name="StaticBody" type="StaticBody" parent="."]
transform = Transform( 1, 0, 0, 0, 1, 0, 0, 0, 1, 0, 0, 0.0683893 )

[node name="CollisionShape" type="CollisionShape" parent="StaticBody"]
transform = Transform( 1, 0, 0, 0, 1, 0, 0, 0, 1, 0.0057295, -0.0315602, -0.0700617 )
shape = SubResource( 1 )

[node name="OmniLight" type="OmniLight" parent="."]
transform = Transform( 0.166667, 0, 0, 0, 0.166667, 0, 0, 0, 1, 0, -0.266731, 0 )
light_energy = 1.7
omni_range = 6.7
omni_attenuation = 2.82843
