[gd_resource type="Environment" format=2]

[resource]
background_mode = 1
ambient_light_energy = 0.0
fog_color = Color( 0.411765, 0.419608, 0.431373, 1 )
fog_depth_begin = 0.0
fog_height_enabled = true
fog_height_min = 0.1
fog_height_max = 16.6
tonemap_mode = 3
ss_reflections_fade_in = 0.0265165
