[gd_scene load_steps=5 format=2]

[ext_resource path="res://assets/sprites/Bandera.png" type="Texture" id=1]
[ext_resource path="res://scripts/Propaganda.gd" type="Script" id=2]
[ext_resource path="res://assets/sprites/Pseudo_revolucion_barata.png" type="Texture" id=3]

[sub_resource type="BoxShape" id=1]

[node name="Propaganda" type="Spatial"]
transform = Transform( 4, 0, 0, 0, 4, 0, 0, 0, 1, 0, 0, 0 )

[node name="Sprite3D" type="Sprite3D" parent="."]
shaded = true
double_sided = false
texture = ExtResource( 1 )

[node name="Area" type="Area" parent="Sprite3D"]
transform = Transform( 1.4, 0, 0, 0, 2, 0, 0, 0, 0.7, 0, 0, 0 )
script = ExtResource( 2 )

[node name="CollisionShape" type="CollisionShape" parent="Sprite3D/Area"]
transform = Transform( 0.2, 0, 0, 0, 0.25, 0, 0, 0, 1, -0.000129461, -0.00463903, 0.012713 )
shape = SubResource( 1 )

[node name="PseudoKilroy" type="Sprite3D" parent="."]
visible = false
shaded = true
double_sided = false
texture = ExtResource( 3 )
[connection signal="area_entered" from="Sprite3D/Area" to="Sprite3D/Area" method="_on_Area_area_entered"]
[connection signal="area_exited" from="Sprite3D/Area" to="Sprite3D/Area" method="_on_Area_area_exited"]
