[gd_resource type="DynamicFont" load_steps=2 format=2]

[ext_resource path="res://assets/Font/HeadlinerNo.45 DEMO.ttf" type="DynamicFontData" id=1]

[resource]
size = 120
font_data = ExtResource( 1 )
