\relax 
\providecommand\hyper@newdestlabel[2]{}
\providecommand\HyperFirstAtBeginDocument{\AtBeginDocument}
\HyperFirstAtBeginDocument{\ifx\hyper@anchor\@undefined
\global\let\oldcontentsline\contentsline
\gdef\contentsline#1#2#3#4{\oldcontentsline{#1}{#2}{#3}}
\global\let\oldnewlabel\newlabel
\gdef\newlabel#1#2{\newlabelxx{#1}#2}
\gdef\newlabelxx#1#2#3#4#5#6{\oldnewlabel{#1}{{#2}{#3}}}
\AtEndDocument{\ifx\hyper@anchor\@undefined
\let\contentsline\oldcontentsline
\let\newlabel\oldnewlabel
\fi}
\fi}
\global\let\hyper@last\relax 
\gdef\HyperFirstAtBeginDocument#1{#1}
\providecommand\HyField@AuxAddToFields[1]{}
\providecommand\HyField@AuxAddToCoFields[2]{}
\bbl@beforestart
\babel@aux{italian}{}
\babel@aux{italian}{}
\@writefile{nav}{\headcommand {\slideentry {0}{0}{1}{1/1}{}{0}}}
\@writefile{nav}{\headcommand {\beamer@framepages {1}{1}}}
\@writefile{toc}{\beamer@sectionintoc {1}{Leggi}{2}{0}{1}}
\@writefile{nav}{\headcommand {\beamer@sectionpages {1}{1}}}
\@writefile{nav}{\headcommand {\beamer@subsectionpages {1}{1}}}
\@writefile{nav}{\headcommand {\sectionentry {1}{Leggi}{2}{Leggi}{0}}}
\@writefile{toc}{\beamer@subsectionintoc {1}{1}{Leggi empiriche}{2}{0}{1}}
\@writefile{nav}{\headcommand {\beamer@subsectionpages {2}{1}}}
\@writefile{nav}{\headcommand {\beamer@subsectionentry {0}{1}{1}{2}{Leggi empiriche}}}
\@writefile{nav}{\headcommand {\slideentry {1}{1}{1}{2/2}{Leggi empiriche}{0}}}
\@writefile{nav}{\headcommand {\beamer@framepages {2}{2}}}
\citation{zipf}
\@writefile{toc}{\beamer@subsectionintoc {1}{2}{Legge di Zipf}{3}{0}{1}}
\@writefile{nav}{\headcommand {\beamer@subsectionpages {2}{2}}}
\@writefile{nav}{\headcommand {\beamer@subsectionentry {0}{1}{2}{3}{Legge di Zipf}}}
\@writefile{nav}{\headcommand {\slideentry {1}{2}{1}{3/3}{Legge di Zipf}{0}}}
\@writefile{nav}{\headcommand {\beamer@framepages {3}{3}}}
\@writefile{nav}{\headcommand {\slideentry {1}{2}{2}{4/4}{Legge di Zipf}{0}}}
\@writefile{nav}{\headcommand {\beamer@framepages {4}{4}}}
\citation{heaps}
\citation{egghe}
\@writefile{toc}{\beamer@subsectionintoc {1}{3}{Legge di Heaps}{5}{0}{1}}
\@writefile{nav}{\headcommand {\beamer@subsectionpages {3}{4}}}
\@writefile{nav}{\headcommand {\beamer@subsectionentry {0}{1}{3}{5}{Legge di Heaps}}}
\providecommand*\caption@xref[2]{\@setref\relax\@undefined{#1}}
\newlabel{heaps_all}{{2}{5}{Grafico log-log. Fit di forma $Ax^{\beta }$ per la libreria concatenata.\relax }{Doc-Start}{}}
\@writefile{snm}{\beamer@slide {heaps_all}{5}}
\@writefile{nav}{\headcommand {\slideentry {1}{3}{1}{5/5}{Legge di Heaps}{0}}}
\@writefile{nav}{\headcommand {\beamer@framepages {5}{5}}}
\citation{zhang}
\@writefile{nav}{\headcommand {\slideentry {1}{3}{2}{6/6}{Legge di Heaps}{0}}}
\@writefile{nav}{\headcommand {\beamer@framepages {6}{6}}}
\@writefile{toc}{\beamer@sectionintoc {2}{Modello}{7}{0}{2}}
\@writefile{nav}{\headcommand {\beamer@sectionpages {2}{6}}}
\@writefile{nav}{\headcommand {\beamer@subsectionpages {5}{6}}}
\@writefile{nav}{\headcommand {\sectionentry {2}{Modello}{7}{Modello}{0}}}
\@writefile{toc}{\beamer@subsectionintoc {2}{1}{Scambiabilità}{7}{0}{2}}
\@writefile{nav}{\headcommand {\beamer@subsectionpages {7}{6}}}
\@writefile{nav}{\headcommand {\beamer@subsectionentry {0}{2}{1}{7}{Scambiabilità}}}
\@writefile{nav}{\headcommand {\slideentry {2}{1}{1}{7/7}{Scambiabilità}{0}}}
\@writefile{nav}{\headcommand {\beamer@framepages {7}{7}}}
\@writefile{nav}{\headcommand {\slideentry {2}{1}{2}{8/8}{Scambiabilità}{0}}}
\@writefile{nav}{\headcommand {\beamer@framepages {8}{8}}}
\@writefile{toc}{\beamer@subsubsectionintoc {2}{1}{1}{Teorema della rappresentazione di De Finetti}{9}{0}{2}}
\@writefile{nav}{\headcommand {\beamer@subsubsectionentry {0}{2}{1}{1}{9}{Teorema della rappresentazione di De Finetti}}}
\@writefile{nav}{\headcommand {\slideentry {2}{1}{3}{9/9}{Scambiabilità}{0}}}
\@writefile{nav}{\headcommand {\beamer@framepages {9}{9}}}
\citation{polya}
\@writefile{toc}{\beamer@subsubsectionintoc {2}{1}{2}{Urna di Pólya}{10}{0}{2}}
\@writefile{nav}{\headcommand {\beamer@subsubsectionentry {0}{2}{1}{2}{10}{Urna di Pólya}}}
\@writefile{nav}{\headcommand {\slideentry {2}{1}{4}{10/10}{Scambiabilità}{0}}}
\@writefile{nav}{\headcommand {\beamer@framepages {10}{10}}}
\@writefile{nav}{\headcommand {\slideentry {2}{1}{5}{11/11}{Scambiabilità}{0}}}
\@writefile{nav}{\headcommand {\beamer@framepages {11}{11}}}
\@writefile{nav}{\headcommand {\slideentry {2}{1}{6}{12/12}{Scambiabilità}{0}}}
\@writefile{nav}{\headcommand {\beamer@framepages {12}{12}}}
\citation{ferguson}
\citation{teh}
\@writefile{toc}{\beamer@sectionintoc {3}{Dirichlet}{13}{0}{3}}
\@writefile{nav}{\headcommand {\beamer@sectionpages {7}{12}}}
\@writefile{nav}{\headcommand {\beamer@subsectionpages {7}{12}}}
\@writefile{nav}{\headcommand {\sectionentry {3}{Dirichlet}{13}{Dirichlet}{0}}}
\@writefile{toc}{\beamer@subsectionintoc {3}{1}{Processo di Dirichlet}{13}{0}{3}}
\@writefile{nav}{\headcommand {\beamer@subsectionpages {13}{12}}}
\@writefile{nav}{\headcommand {\beamer@subsectionentry {0}{3}{1}{13}{Processo di Dirichlet}}}
\@writefile{nav}{\headcommand {\slideentry {3}{1}{1}{13/13}{Processo di Dirichlet}{0}}}
\@writefile{nav}{\headcommand {\beamer@framepages {13}{13}}}
\@writefile{nav}{\headcommand {\slideentry {3}{1}{2}{14/14}{Processo di Dirichlet}{0}}}
\@writefile{nav}{\headcommand {\beamer@framepages {14}{14}}}
\@writefile{nav}{\headcommand {\slideentry {3}{1}{3}{15/15}{Processo di Dirichlet}{0}}}
\@writefile{nav}{\headcommand {\beamer@framepages {15}{15}}}
\citation{blackwell}
\@writefile{toc}{\beamer@subsectionintoc {3}{2}{Modello di Blackwell MacQueen}{16}{0}{3}}
\@writefile{nav}{\headcommand {\beamer@subsectionpages {13}{15}}}
\@writefile{nav}{\headcommand {\beamer@subsectionentry {0}{3}{2}{16}{Modello di Blackwell MacQueen}}}
\@writefile{nav}{\headcommand {\slideentry {3}{2}{1}{16/16}{Modello di Blackwell MacQueen}{0}}}
\@writefile{nav}{\headcommand {\beamer@framepages {16}{16}}}
\@writefile{nav}{\headcommand {\slideentry {3}{2}{2}{17/17}{Modello di Blackwell MacQueen}{0}}}
\@writefile{nav}{\headcommand {\beamer@framepages {17}{17}}}
\@writefile{nav}{\headcommand {\slideentry {3}{2}{3}{18/18}{Modello di Blackwell MacQueen}{0}}}
\@writefile{nav}{\headcommand {\beamer@framepages {18}{18}}}
\@writefile{nav}{\headcommand {\slideentry {3}{2}{4}{19/19}{Modello di Blackwell MacQueen}{0}}}
\@writefile{nav}{\headcommand {\beamer@framepages {19}{19}}}
\@writefile{nav}{\headcommand {\slideentry {3}{2}{5}{20/20}{Modello di Blackwell MacQueen}{0}}}
\@writefile{nav}{\headcommand {\beamer@framepages {20}{20}}}
\citation{pitman}
\@writefile{toc}{\beamer@sectionintoc {4}{Poisson-Dirichlet}{21}{0}{4}}
\@writefile{nav}{\headcommand {\beamer@sectionpages {13}{20}}}
\@writefile{nav}{\headcommand {\beamer@subsectionpages {16}{20}}}
\@writefile{nav}{\headcommand {\sectionentry {4}{Poisson-Dirichlet}{21}{Poisson-Dirichlet}{0}}}
\@writefile{toc}{\beamer@subsectionintoc {4}{1}{Processo di Poisson-Dirichlet}{21}{0}{4}}
\@writefile{nav}{\headcommand {\beamer@subsectionpages {21}{20}}}
\@writefile{nav}{\headcommand {\beamer@subsectionentry {0}{4}{1}{21}{Processo di Poisson-Dirichlet}}}
\@writefile{nav}{\headcommand {\slideentry {4}{1}{1}{21/21}{Processo di Poisson-Dirichlet}{0}}}
\@writefile{nav}{\headcommand {\beamer@framepages {21}{21}}}
\@writefile{nav}{\headcommand {\slideentry {4}{1}{2}{22/22}{Processo di Poisson-Dirichlet}{0}}}
\@writefile{nav}{\headcommand {\beamer@framepages {22}{22}}}
\@writefile{nav}{\headcommand {\slideentry {4}{1}{3}{23/23}{Processo di Poisson-Dirichlet}{0}}}
\@writefile{nav}{\headcommand {\beamer@framepages {23}{23}}}
\@writefile{nav}{\headcommand {\slideentry {4}{1}{4}{24/24}{Processo di Poisson-Dirichlet}{0}}}
\@writefile{nav}{\headcommand {\beamer@framepages {24}{24}}}
\@writefile{nav}{\headcommand {\slideentry {4}{1}{5}{25/25}{Processo di Poisson-Dirichlet}{0}}}
\@writefile{nav}{\headcommand {\beamer@framepages {25}{25}}}
\@writefile{nav}{\headcommand {\slideentry {4}{1}{6}{26/26}{Processo di Poisson-Dirichlet}{0}}}
\@writefile{nav}{\headcommand {\beamer@framepages {26}{26}}}
\citation{buntine}
\@writefile{nav}{\headcommand {\slideentry {4}{1}{7}{27/27}{Processo di Poisson-Dirichlet}{0}}}
\@writefile{nav}{\headcommand {\beamer@framepages {27}{27}}}
\@writefile{nav}{\headcommand {\slideentry {4}{1}{8}{28/28}{Processo di Poisson-Dirichlet}{0}}}
\@writefile{nav}{\headcommand {\beamer@framepages {28}{28}}}
\@writefile{nav}{\headcommand {\slideentry {4}{1}{9}{29/29}{Processo di Poisson-Dirichlet}{0}}}
\@writefile{nav}{\headcommand {\beamer@framepages {29}{29}}}
\citation{adjacent}
\@writefile{toc}{\beamer@subsectionintoc {4}{2}{Modello del possibile adiacente}{30}{0}{4}}
\@writefile{nav}{\headcommand {\beamer@subsectionpages {21}{29}}}
\@writefile{nav}{\headcommand {\beamer@subsectionentry {0}{4}{2}{30}{Modello del possibile adiacente}}}
\@writefile{nav}{\headcommand {\slideentry {4}{2}{1}{30/30}{Modello del possibile adiacente}{0}}}
\@writefile{nav}{\headcommand {\beamer@framepages {30}{30}}}
\@writefile{nav}{\headcommand {\slideentry {4}{2}{2}{31/31}{Modello del possibile adiacente}{0}}}
\@writefile{nav}{\headcommand {\beamer@framepages {31}{31}}}
\@writefile{nav}{\headcommand {\slideentry {4}{2}{3}{32/32}{Modello del possibile adiacente}{0}}}
\@writefile{nav}{\headcommand {\beamer@framepages {32}{32}}}
\@writefile{nav}{\headcommand {\slideentry {4}{2}{4}{33/33}{Modello del possibile adiacente}{0}}}
\@writefile{nav}{\headcommand {\beamer@framepages {33}{33}}}
\@writefile{nav}{\headcommand {\slideentry {4}{2}{5}{34/34}{Modello del possibile adiacente}{0}}}
\@writefile{nav}{\headcommand {\beamer@framepages {34}{34}}}
\@writefile{toc}{\beamer@sectionintoc {5}{Attribuzione}{35}{0}{5}}
\@writefile{nav}{\headcommand {\beamer@sectionpages {21}{34}}}
\@writefile{nav}{\headcommand {\beamer@subsectionpages {30}{34}}}
\@writefile{nav}{\headcommand {\sectionentry {5}{Attribuzione}{35}{Attribuzione}{0}}}
\@writefile{toc}{\beamer@subsectionintoc {5}{1}{Stima dei parametri continui}{35}{0}{5}}
\@writefile{nav}{\headcommand {\beamer@subsectionpages {35}{34}}}
\@writefile{nav}{\headcommand {\beamer@subsectionentry {0}{5}{1}{35}{Stima dei parametri continui}}}
\@writefile{nav}{\headcommand {\slideentry {5}{1}{1}{35/35}{Stima dei parametri continui}{0}}}
\@writefile{nav}{\headcommand {\beamer@framepages {35}{35}}}
\@writefile{nav}{\headcommand {\slideentry {5}{1}{2}{36/36}{Stima dei parametri continui}{0}}}
\@writefile{nav}{\headcommand {\beamer@framepages {36}{36}}}
\@writefile{toc}{\beamer@subsectionintoc {5}{2}{Stima dei parametri discreti}{37}{0}{5}}
\@writefile{nav}{\headcommand {\beamer@subsectionpages {35}{36}}}
\@writefile{nav}{\headcommand {\beamer@subsectionentry {0}{5}{2}{37}{Stima dei parametri discreti}}}
\@writefile{nav}{\headcommand {\slideentry {5}{2}{1}{37/37}{Stima dei parametri discreti}{0}}}
\@writefile{nav}{\headcommand {\beamer@framepages {37}{37}}}
\@writefile{nav}{\headcommand {\slideentry {5}{2}{2}{38/38}{Stima dei parametri discreti}{0}}}
\@writefile{nav}{\headcommand {\beamer@framepages {38}{38}}}
\citation{pitman}
\@writefile{nav}{\headcommand {\slideentry {5}{2}{3}{39/39}{Stima dei parametri discreti}{0}}}
\@writefile{nav}{\headcommand {\beamer@framepages {39}{39}}}
\@writefile{nav}{\headcommand {\slideentry {5}{2}{4}{40/40}{Stima dei parametri discreti}{0}}}
\@writefile{nav}{\headcommand {\beamer@framepages {40}{40}}}
\citation{barnard}
\@writefile{toc}{\beamer@subsectionintoc {5}{3}{Legge della verosimiglianza}{41}{0}{5}}
\@writefile{nav}{\headcommand {\beamer@subsectionpages {37}{40}}}
\@writefile{nav}{\headcommand {\beamer@subsectionentry {0}{5}{3}{41}{Legge della verosimiglianza}}}
\@writefile{nav}{\headcommand {\slideentry {5}{3}{1}{41/41}{Legge della verosimiglianza}{0}}}
\@writefile{nav}{\headcommand {\beamer@framepages {41}{41}}}
\@writefile{toc}{\beamer@sectionintoc {6}{Testi sintetici}{42}{0}{6}}
\@writefile{nav}{\headcommand {\beamer@sectionpages {35}{41}}}
\@writefile{nav}{\headcommand {\beamer@subsectionpages {41}{41}}}
\@writefile{nav}{\headcommand {\sectionentry {6}{Testi sintetici}{42}{Testi sintetici}{0}}}
\@writefile{nav}{\headcommand {\slideentry {6}{0}{1}{42/42}{}{0}}}
\@writefile{nav}{\headcommand {\beamer@framepages {42}{42}}}
\@writefile{toc}{\beamer@subsectionintoc {6}{1}{Dizionario variabile}{43}{0}{6}}
\@writefile{nav}{\headcommand {\beamer@subsectionpages {42}{42}}}
\@writefile{nav}{\headcommand {\beamer@subsectionentry {0}{6}{1}{43}{Dizionario variabile}}}
\@writefile{nav}{\headcommand {\slideentry {6}{1}{1}{43/43}{Dizionario variabile}{0}}}
\@writefile{nav}{\headcommand {\beamer@framepages {43}{43}}}
\@writefile{nav}{\headcommand {\slideentry {6}{1}{2}{44/44}{Dizionario variabile}{0}}}
\@writefile{nav}{\headcommand {\beamer@framepages {44}{44}}}
\@writefile{nav}{\headcommand {\slideentry {6}{1}{3}{45/45}{Dizionario variabile}{0}}}
\@writefile{nav}{\headcommand {\beamer@framepages {45}{45}}}
\@writefile{nav}{\headcommand {\slideentry {6}{1}{4}{46/46}{Dizionario variabile}{0}}}
\@writefile{nav}{\headcommand {\beamer@framepages {46}{46}}}
\@writefile{toc}{\beamer@subsectionintoc {6}{2}{Processi differenti}{47}{0}{6}}
\@writefile{nav}{\headcommand {\beamer@subsectionpages {43}{46}}}
\@writefile{nav}{\headcommand {\beamer@subsectionentry {0}{6}{2}{47}{Processi differenti}}}
\@writefile{nav}{\headcommand {\slideentry {6}{2}{1}{47/47}{Processi differenti}{0}}}
\@writefile{nav}{\headcommand {\beamer@framepages {47}{47}}}
\@writefile{nav}{\headcommand {\slideentry {6}{2}{2}{48/48}{Processi differenti}{0}}}
\@writefile{nav}{\headcommand {\beamer@framepages {48}{48}}}
\@writefile{nav}{\headcommand {\slideentry {6}{2}{3}{49/49}{Processi differenti}{0}}}
\@writefile{nav}{\headcommand {\beamer@framepages {49}{49}}}
\@writefile{toc}{\beamer@subsectionintoc {6}{3}{Parti differenti}{50}{0}{6}}
\@writefile{nav}{\headcommand {\beamer@subsectionpages {47}{49}}}
\@writefile{nav}{\headcommand {\beamer@subsectionentry {0}{6}{3}{50}{Parti differenti}}}
\@writefile{nav}{\headcommand {\slideentry {6}{3}{1}{50/50}{Parti differenti}{0}}}
\@writefile{nav}{\headcommand {\beamer@framepages {50}{50}}}
\@writefile{nav}{\headcommand {\slideentry {6}{3}{2}{51/51}{Parti differenti}{0}}}
\@writefile{nav}{\headcommand {\beamer@framepages {51}{51}}}
\@writefile{toc}{\beamer@sectionintoc {7}{Testi reali}{52}{0}{7}}
\@writefile{nav}{\headcommand {\beamer@sectionpages {42}{51}}}
\@writefile{nav}{\headcommand {\beamer@subsectionpages {50}{51}}}
\@writefile{nav}{\headcommand {\sectionentry {7}{Testi reali}{52}{Testi reali}{0}}}
\@writefile{toc}{\beamer@subsectionintoc {7}{1}{Dizionario Italiano}{52}{0}{7}}
\@writefile{nav}{\headcommand {\beamer@subsectionpages {52}{51}}}
\@writefile{nav}{\headcommand {\beamer@subsectionentry {0}{7}{1}{52}{Dizionario Italiano}}}
\@writefile{nav}{\headcommand {\slideentry {7}{1}{1}{52/52}{Dizionario Italiano}{0}}}
\@writefile{nav}{\headcommand {\beamer@framepages {52}{52}}}
\@writefile{nav}{\headcommand {\slideentry {7}{1}{2}{53/53}{Dizionario Italiano}{0}}}
\@writefile{nav}{\headcommand {\beamer@framepages {53}{53}}}
\@writefile{toc}{\beamer@subsectionintoc {7}{2}{Percentuali di attribuzione}{54}{0}{7}}
\@writefile{nav}{\headcommand {\beamer@subsectionpages {52}{53}}}
\@writefile{nav}{\headcommand {\beamer@subsectionentry {0}{7}{2}{54}{Percentuali di attribuzione}}}
\newlabel{italian_results}{{16}{54}{Attribuzione continua.\relax }{Doc-Start}{}}
\@writefile{snm}{\beamer@slide {italian_results}{54}}
\@writefile{nav}{\headcommand {\slideentry {7}{2}{1}{54/54}{Percentuali di attribuzione}{0}}}
\@writefile{nav}{\headcommand {\beamer@framepages {54}{54}}}
\@writefile{toc}{\beamer@subsectionintoc {7}{3}{Algoritmo LZ77}{55}{0}{7}}
\@writefile{nav}{\headcommand {\beamer@subsectionpages {54}{54}}}
\@writefile{nav}{\headcommand {\beamer@subsectionentry {0}{7}{3}{55}{Algoritmo LZ77}}}
\@writefile{nav}{\headcommand {\slideentry {7}{3}{1}{55/55}{Algoritmo LZ77}{0}}}
\@writefile{nav}{\headcommand {\beamer@framepages {55}{55}}}
\@writefile{nav}{\headcommand {\slideentry {7}{3}{2}{56/56}{Algoritmo LZ77}{0}}}
\@writefile{nav}{\headcommand {\beamer@framepages {56}{56}}}
\@writefile{nav}{\headcommand {\slideentry {7}{3}{3}{57/57}{Algoritmo LZ77}{0}}}
\@writefile{nav}{\headcommand {\beamer@framepages {57}{57}}}
\@writefile{toc}{\beamer@subsectionintoc {7}{4}{Dizionario LZ77}{58}{0}{7}}
\@writefile{nav}{\headcommand {\beamer@subsectionpages {55}{57}}}
\@writefile{nav}{\headcommand {\beamer@subsectionentry {0}{7}{4}{58}{Dizionario LZ77}}}
\@writefile{nav}{\headcommand {\slideentry {7}{4}{1}{58/58}{Dizionario LZ77}{0}}}
\@writefile{nav}{\headcommand {\beamer@framepages {58}{58}}}
\@writefile{toc}{\beamer@subsectionintoc {7}{5}{Percentuali di attribuzione}{59}{0}{7}}
\@writefile{nav}{\headcommand {\beamer@subsectionpages {58}{58}}}
\@writefile{nav}{\headcommand {\beamer@subsectionentry {0}{7}{5}{59}{Percentuali di attribuzione}}}
\@writefile{nav}{\headcommand {\slideentry {7}{5}{1}{59/59}{Percentuali di attribuzione}{0}}}
\@writefile{nav}{\headcommand {\beamer@framepages {59}{59}}}
\citation{margh}
\@writefile{toc}{\beamer@sectionintoc {8}{Conclusioni}{60}{0}{8}}
\@writefile{nav}{\headcommand {\beamer@sectionpages {52}{59}}}
\@writefile{nav}{\headcommand {\beamer@subsectionpages {59}{59}}}
\@writefile{nav}{\headcommand {\sectionentry {8}{Conclusioni}{60}{Conclusioni}{0}}}
\@writefile{nav}{\headcommand {\slideentry {8}{0}{1}{60/60}{}{0}}}
\@writefile{nav}{\headcommand {\beamer@framepages {60}{60}}}
\bibstyle{naturemag}
\bibdata{pres.bib}
\bibcite{zipf}{\hyperlink {beamerbibzipf}{1}}
\bibcite{heaps}{\hyperlink {beamerbibheaps}{2}}
\bibcite{egghe}{\hyperlink {beamerbibegghe}{3}}
\bibcite{zhang}{\hyperlink {beamerbibzhang}{4}}
\bibcite{polya}{\hyperlink {beamerbibpolya}{5}}
\bibcite{ferguson}{\hyperlink {beamerbibferguson}{6}}
\bibcite{teh}{\hyperlink {beamerbibteh}{7}}
\bibcite{blackwell}{\hyperlink {beamerbibblackwell}{8}}
\bibcite{pitman}{\hyperlink {beamerbibpitman}{9}}
\bibcite{buntine}{\hyperlink {beamerbibbuntine}{10}}
\bibcite{adjacent}{\hyperlink {beamerbibadjacent}{11}}
\bibcite{barnard}{\hyperlink {beamerbibbarnard}{12}}
\bibcite{margh}{\hyperlink {beamerbibmargh}{13}}
\@writefile{toc}{\beamer@sectionintoc {9}{Riferimenti}{61}{0}{9}}
\@writefile{nav}{\headcommand {\beamer@sectionpages {60}{60}}}
\@writefile{nav}{\headcommand {\beamer@subsectionpages {60}{60}}}
\@writefile{nav}{\headcommand {\sectionentry {9}{Riferimenti}{61}{Riferimenti}{0}}}
\@writefile{nav}{\headcommand {\slideentry {9}{0}{1}{61/61}{}{0}}}
\@writefile{nav}{\headcommand {\beamer@framepages {61}{61}}}
\@writefile{nav}{\headcommand {\slideentry {9}{0}{1}{61/62}{}{0}}}
\@writefile{nav}{\headcommand {\beamer@framepages {61}{62}}}
\@writefile{nav}{\headcommand {\slideentry {9}{0}{1}{61/63}{}{0}}}
\@writefile{nav}{\headcommand {\beamer@framepages {61}{63}}}
\@writefile{nav}{\headcommand {\slideentry {9}{0}{1}{61/64}{}{0}}}
\@writefile{nav}{\headcommand {\beamer@framepages {61}{64}}}
\@writefile{nav}{\headcommand {\slideentry {9}{0}{1}{61/65}{}{0}}}
\@writefile{nav}{\headcommand {\beamer@framepages {61}{65}}}
\@writefile{nav}{\headcommand {\slideentry {9}{0}{1}{61/66}{}{0}}}
\@writefile{nav}{\headcommand {\beamer@framepages {61}{66}}}
\@writefile{nav}{\headcommand {\beamer@partpages {1}{66}}}
\@writefile{nav}{\headcommand {\beamer@subsectionpages {61}{66}}}
\@writefile{nav}{\headcommand {\beamer@sectionpages {61}{66}}}
\@writefile{nav}{\headcommand {\beamer@documentpages {66}}}
\@writefile{nav}{\headcommand {\gdef \inserttotalframenumber {66}}}
