\relax 
\providecommand\hyper@newdestlabel[2]{}
\providecommand\HyperFirstAtBeginDocument{\AtBeginDocument}
\HyperFirstAtBeginDocument{\ifx\hyper@anchor\@undefined
\global\let\oldcontentsline\contentsline
\gdef\contentsline#1#2#3#4{\oldcontentsline{#1}{#2}{#3}}
\global\let\oldnewlabel\newlabel
\gdef\newlabel#1#2{\newlabelxx{#1}#2}
\gdef\newlabelxx#1#2#3#4#5#6{\oldnewlabel{#1}{{#2}{#3}}}
\AtEndDocument{\ifx\hyper@anchor\@undefined
\let\contentsline\oldcontentsline
\let\newlabel\oldnewlabel
\fi}
\fi}
\global\let\hyper@last\relax 
\gdef\HyperFirstAtBeginDocument#1{#1}
\providecommand\HyField@AuxAddToFields[1]{}
\providecommand\HyField@AuxAddToCoFields[2]{}
\bbl@beforestart
\babel@aux{italian}{}
\babel@aux{italian}{}
\@writefile{nav}{\headcommand {\slideentry {0}{0}{1}{1/1}{}{0}}}
\@writefile{nav}{\headcommand {\beamer@framepages {1}{1}}}
\@writefile{nav}{\headcommand {\beamer@sectionpages {1}{1}}}
\@writefile{nav}{\headcommand {\beamer@subsectionpages {1}{1}}}
\@writefile{toc}{\beamer@subsectionintoc {1}{1}{Introduzione}{2}{0}{0}}
\@writefile{nav}{\headcommand {\beamer@subsectionpages {2}{1}}}
\@writefile{nav}{\headcommand {\beamer@subsectionentry {0}{1}{1}{2}{Introduzione}}}
\@writefile{nav}{\headcommand {\slideentry {1}{1}{1}{2/2}{Introduzione}{0}}}
\@writefile{nav}{\headcommand {\beamer@framepages {2}{2}}}
\citation{zipf}
\@writefile{toc}{\beamer@sectionintoc {2}{Leggi}{3}{0}{1}}
\@writefile{nav}{\headcommand {\beamer@sectionpages {2}{2}}}
\@writefile{nav}{\headcommand {\beamer@subsectionpages {2}{2}}}
\@writefile{nav}{\headcommand {\sectionentry {2}{Leggi}{3}{Leggi}{0}}}
\@writefile{toc}{\beamer@subsectionintoc {2}{1}{Legge di Zipf}{3}{0}{1}}
\@writefile{nav}{\headcommand {\beamer@subsectionpages {3}{2}}}
\@writefile{nav}{\headcommand {\beamer@subsectionentry {0}{2}{1}{3}{Legge di Zipf}}}
\@writefile{nav}{\headcommand {\slideentry {2}{1}{1}{3/3}{Legge di Zipf}{0}}}
\@writefile{nav}{\headcommand {\beamer@framepages {3}{3}}}
\@writefile{nav}{\headcommand {\slideentry {2}{1}{2}{4/4}{Legge di Zipf}{0}}}
\@writefile{nav}{\headcommand {\beamer@framepages {4}{4}}}
\@writefile{nav}{\headcommand {\slideentry {2}{1}{3}{5/5}{Legge di Zipf}{0}}}
\@writefile{nav}{\headcommand {\beamer@framepages {5}{5}}}
\citation{heaps}
\citation{egghe}
\@writefile{toc}{\beamer@subsectionintoc {2}{2}{Legge di Heaps}{6}{0}{1}}
\@writefile{nav}{\headcommand {\beamer@subsectionpages {3}{5}}}
\@writefile{nav}{\headcommand {\beamer@subsectionentry {0}{2}{2}{6}{Legge di Heaps}}}
\providecommand*\caption@xref[2]{\@setref\relax\@undefined{#1}}
\newlabel{heaps_all}{{2}{6}{Grafico log-log. Fit di forma $Ax^{\beta }$ per la libreria concatenata.\relax }{Doc-Start}{}}
\@writefile{snm}{\beamer@slide {heaps_all}{6}}
\@writefile{nav}{\headcommand {\slideentry {2}{2}{1}{6/6}{Legge di Heaps}{0}}}
\@writefile{nav}{\headcommand {\beamer@framepages {6}{6}}}
\citation{zhang}
\@writefile{nav}{\headcommand {\slideentry {2}{2}{2}{7/7}{Legge di Heaps}{0}}}
\@writefile{nav}{\headcommand {\beamer@framepages {7}{7}}}
\@writefile{toc}{\beamer@sectionintoc {3}{Modello}{8}{0}{2}}
\@writefile{nav}{\headcommand {\beamer@sectionpages {3}{7}}}
\@writefile{nav}{\headcommand {\beamer@subsectionpages {6}{7}}}
\@writefile{nav}{\headcommand {\sectionentry {3}{Modello}{8}{Modello}{0}}}
\@writefile{toc}{\beamer@subsectionintoc {3}{1}{Scambiabilità}{8}{0}{2}}
\@writefile{nav}{\headcommand {\beamer@subsectionpages {8}{7}}}
\@writefile{nav}{\headcommand {\beamer@subsectionentry {0}{3}{1}{8}{Scambiabilità}}}
\@writefile{nav}{\headcommand {\slideentry {3}{1}{1}{8/8}{Scambiabilità}{0}}}
\@writefile{nav}{\headcommand {\beamer@framepages {8}{8}}}
\@writefile{nav}{\headcommand {\slideentry {3}{1}{2}{9/9}{Scambiabilità}{0}}}
\@writefile{nav}{\headcommand {\beamer@framepages {9}{9}}}
\@writefile{toc}{\beamer@subsubsectionintoc {3}{1}{1}{Teorema della rappresentazione di De Finetti}{10}{0}{2}}
\@writefile{nav}{\headcommand {\beamer@subsubsectionentry {0}{3}{1}{1}{10}{Teorema della rappresentazione di De Finetti}}}
\@writefile{nav}{\headcommand {\slideentry {3}{1}{3}{10/10}{Scambiabilità}{0}}}
\@writefile{nav}{\headcommand {\beamer@framepages {10}{10}}}
\citation{polya}
\@writefile{toc}{\beamer@subsectionintoc {3}{2}{Urna di Pólya}{11}{0}{2}}
\@writefile{nav}{\headcommand {\beamer@subsectionpages {8}{10}}}
\@writefile{nav}{\headcommand {\beamer@subsectionentry {0}{3}{2}{11}{Urna di Pólya}}}
\@writefile{nav}{\headcommand {\slideentry {3}{2}{1}{11/11}{Urna di Pólya}{0}}}
\@writefile{nav}{\headcommand {\beamer@framepages {11}{11}}}
\@writefile{nav}{\headcommand {\slideentry {3}{2}{2}{12/12}{Urna di Pólya}{0}}}
\@writefile{nav}{\headcommand {\beamer@framepages {12}{12}}}
\citation{ferguson}
\citation{teh}
\@writefile{toc}{\beamer@sectionintoc {4}{Dirichlet}{13}{0}{3}}
\@writefile{nav}{\headcommand {\beamer@sectionpages {8}{12}}}
\@writefile{nav}{\headcommand {\beamer@subsectionpages {11}{12}}}
\@writefile{nav}{\headcommand {\sectionentry {4}{Dirichlet}{13}{Dirichlet}{0}}}
\@writefile{toc}{\beamer@subsectionintoc {4}{1}{Processo di Dirichlet}{13}{0}{3}}
\@writefile{nav}{\headcommand {\beamer@subsectionpages {13}{12}}}
\@writefile{nav}{\headcommand {\beamer@subsectionentry {0}{4}{1}{13}{Processo di Dirichlet}}}
\@writefile{nav}{\headcommand {\slideentry {4}{1}{1}{13/13}{Processo di Dirichlet}{0}}}
\@writefile{nav}{\headcommand {\beamer@framepages {13}{13}}}
\@writefile{nav}{\headcommand {\slideentry {4}{1}{2}{14/14}{Processo di Dirichlet}{0}}}
\@writefile{nav}{\headcommand {\beamer@framepages {14}{14}}}
\@writefile{nav}{\headcommand {\slideentry {4}{1}{3}{15/15}{Processo di Dirichlet}{0}}}
\@writefile{nav}{\headcommand {\beamer@framepages {15}{15}}}
\citation{blackwell}
\@writefile{toc}{\beamer@subsectionintoc {4}{2}{Modello di Blackwell MacQueen}{16}{0}{3}}
\@writefile{nav}{\headcommand {\beamer@subsectionpages {13}{15}}}
\@writefile{nav}{\headcommand {\beamer@subsectionentry {0}{4}{2}{16}{Modello di Blackwell MacQueen}}}
\@writefile{nav}{\headcommand {\slideentry {4}{2}{1}{16/16}{Modello di Blackwell MacQueen}{0}}}
\@writefile{nav}{\headcommand {\beamer@framepages {16}{16}}}
\@writefile{nav}{\headcommand {\slideentry {4}{2}{2}{17/17}{Modello di Blackwell MacQueen}{0}}}
\@writefile{nav}{\headcommand {\beamer@framepages {17}{17}}}
\citation{pitman}
\@writefile{toc}{\beamer@sectionintoc {5}{Poisson-Dirichlet}{18}{0}{4}}
\@writefile{nav}{\headcommand {\beamer@sectionpages {13}{17}}}
\@writefile{nav}{\headcommand {\beamer@subsectionpages {16}{17}}}
\@writefile{nav}{\headcommand {\sectionentry {5}{Poisson-Dirichlet}{18}{Poisson-Dirichlet}{0}}}
\@writefile{toc}{\beamer@subsectionintoc {5}{1}{Processo di Poisson-Dirichlet}{18}{0}{4}}
\@writefile{nav}{\headcommand {\beamer@subsectionpages {18}{17}}}
\@writefile{nav}{\headcommand {\beamer@subsectionentry {0}{5}{1}{18}{Processo di Poisson-Dirichlet}}}
\@writefile{nav}{\headcommand {\slideentry {5}{1}{1}{18/18}{Processo di Poisson-Dirichlet}{0}}}
\@writefile{nav}{\headcommand {\beamer@framepages {18}{18}}}
\@writefile{nav}{\headcommand {\slideentry {5}{1}{2}{19/19}{Processo di Poisson-Dirichlet}{0}}}
\@writefile{nav}{\headcommand {\beamer@framepages {19}{19}}}
\@writefile{nav}{\headcommand {\slideentry {5}{1}{3}{20/20}{Processo di Poisson-Dirichlet}{0}}}
\@writefile{nav}{\headcommand {\beamer@framepages {20}{20}}}
\@writefile{nav}{\headcommand {\slideentry {5}{1}{4}{21/21}{Processo di Poisson-Dirichlet}{0}}}
\@writefile{nav}{\headcommand {\beamer@framepages {21}{21}}}
\@writefile{nav}{\headcommand {\slideentry {5}{1}{5}{22/22}{Processo di Poisson-Dirichlet}{0}}}
\@writefile{nav}{\headcommand {\beamer@framepages {22}{22}}}
\citation{buntine}
\@writefile{nav}{\headcommand {\slideentry {5}{1}{6}{23/23}{Processo di Poisson-Dirichlet}{0}}}
\@writefile{nav}{\headcommand {\beamer@framepages {23}{23}}}
\@writefile{nav}{\headcommand {\slideentry {5}{1}{7}{24/24}{Processo di Poisson-Dirichlet}{0}}}
\@writefile{nav}{\headcommand {\beamer@framepages {24}{24}}}
\@writefile{nav}{\headcommand {\slideentry {5}{1}{8}{25/25}{Processo di Poisson-Dirichlet}{0}}}
\@writefile{nav}{\headcommand {\beamer@framepages {25}{25}}}
\citation{adjacent}
\@writefile{toc}{\beamer@subsectionintoc {5}{2}{Modello del possibile adiacente}{26}{0}{4}}
\@writefile{nav}{\headcommand {\beamer@subsectionpages {18}{25}}}
\@writefile{nav}{\headcommand {\beamer@subsectionentry {0}{5}{2}{26}{Modello del possibile adiacente}}}
\@writefile{nav}{\headcommand {\slideentry {5}{2}{1}{26/26}{Modello del possibile adiacente}{0}}}
\@writefile{nav}{\headcommand {\beamer@framepages {26}{26}}}
\@writefile{nav}{\headcommand {\slideentry {5}{2}{2}{27/27}{Modello del possibile adiacente}{0}}}
\@writefile{nav}{\headcommand {\beamer@framepages {27}{27}}}
\@writefile{nav}{\headcommand {\slideentry {5}{2}{3}{28/28}{Modello del possibile adiacente}{0}}}
\@writefile{nav}{\headcommand {\beamer@framepages {28}{28}}}
\@writefile{toc}{\beamer@sectionintoc {6}{Attribuzione}{29}{0}{5}}
\@writefile{nav}{\headcommand {\beamer@sectionpages {18}{28}}}
\@writefile{nav}{\headcommand {\beamer@subsectionpages {26}{28}}}
\@writefile{nav}{\headcommand {\sectionentry {6}{Attribuzione}{29}{Attribuzione}{0}}}
\@writefile{toc}{\beamer@subsectionintoc {6}{1}{Stima dei parametri continui}{29}{0}{5}}
\@writefile{nav}{\headcommand {\beamer@subsectionpages {29}{28}}}
\@writefile{nav}{\headcommand {\beamer@subsectionentry {0}{6}{1}{29}{Stima dei parametri continui}}}
\@writefile{nav}{\headcommand {\slideentry {6}{1}{1}{29/29}{Stima dei parametri continui}{0}}}
\@writefile{nav}{\headcommand {\beamer@framepages {29}{29}}}
\@writefile{nav}{\headcommand {\slideentry {6}{1}{2}{30/30}{Stima dei parametri continui}{0}}}
\@writefile{nav}{\headcommand {\beamer@framepages {30}{30}}}
\@writefile{toc}{\beamer@subsectionintoc {6}{2}{Stima dei parametri discreti}{31}{0}{5}}
\@writefile{nav}{\headcommand {\beamer@subsectionpages {29}{30}}}
\@writefile{nav}{\headcommand {\beamer@subsectionentry {0}{6}{2}{31}{Stima dei parametri discreti}}}
\@writefile{nav}{\headcommand {\slideentry {6}{2}{1}{31/31}{Stima dei parametri discreti}{0}}}
\@writefile{nav}{\headcommand {\beamer@framepages {31}{31}}}
\@writefile{nav}{\headcommand {\slideentry {6}{2}{2}{32/32}{Stima dei parametri discreti}{0}}}
\@writefile{nav}{\headcommand {\beamer@framepages {32}{32}}}
\citation{pitman}
\@writefile{nav}{\headcommand {\slideentry {6}{2}{3}{33/33}{Stima dei parametri discreti}{0}}}
\@writefile{nav}{\headcommand {\beamer@framepages {33}{33}}}
\@writefile{nav}{\headcommand {\slideentry {6}{2}{4}{34/34}{Stima dei parametri discreti}{0}}}
\@writefile{nav}{\headcommand {\beamer@framepages {34}{34}}}
\citation{barnard}
\@writefile{toc}{\beamer@subsectionintoc {6}{3}{Legge della verosimiglianza}{35}{0}{5}}
\@writefile{nav}{\headcommand {\beamer@subsectionpages {31}{34}}}
\@writefile{nav}{\headcommand {\beamer@subsectionentry {0}{6}{3}{35}{Legge della verosimiglianza}}}
\@writefile{nav}{\headcommand {\slideentry {6}{3}{1}{35/35}{Legge della verosimiglianza}{0}}}
\@writefile{nav}{\headcommand {\beamer@framepages {35}{35}}}
\@writefile{toc}{\beamer@sectionintoc {7}{Testi sintetici}{36}{0}{6}}
\@writefile{nav}{\headcommand {\beamer@sectionpages {29}{35}}}
\@writefile{nav}{\headcommand {\beamer@subsectionpages {35}{35}}}
\@writefile{nav}{\headcommand {\sectionentry {7}{Testi sintetici}{36}{Testi sintetici}{0}}}
\@writefile{toc}{\beamer@subsectionintoc {7}{1}{Stima}{36}{0}{6}}
\@writefile{nav}{\headcommand {\beamer@subsectionpages {36}{35}}}
\@writefile{nav}{\headcommand {\beamer@subsectionentry {0}{7}{1}{36}{Stima}}}
\@writefile{toc}{\beamer@subsubsectionintoc {7}{1}{1}{Dizionario variabile}{36}{0}{6}}
\@writefile{nav}{\headcommand {\beamer@subsubsectionentry {0}{7}{1}{1}{36}{Dizionario variabile}}}
\@writefile{nav}{\headcommand {\slideentry {7}{1}{1}{36/36}{Stima}{0}}}
\@writefile{nav}{\headcommand {\beamer@framepages {36}{36}}}
\@writefile{nav}{\headcommand {\slideentry {7}{1}{2}{37/37}{Stima}{0}}}
\@writefile{nav}{\headcommand {\beamer@framepages {37}{37}}}
\@writefile{nav}{\headcommand {\slideentry {7}{1}{3}{38/38}{Stima}{0}}}
\@writefile{nav}{\headcommand {\beamer@framepages {38}{38}}}
\@writefile{nav}{\headcommand {\slideentry {7}{1}{4}{39/39}{Stima}{0}}}
\@writefile{nav}{\headcommand {\beamer@framepages {39}{39}}}
\@writefile{toc}{\beamer@subsectionintoc {7}{2}{Attribuzione}{40}{0}{6}}
\@writefile{nav}{\headcommand {\beamer@subsectionpages {36}{39}}}
\@writefile{nav}{\headcommand {\beamer@subsectionentry {0}{7}{2}{40}{Attribuzione}}}
\@writefile{toc}{\beamer@subsubsectionintoc {7}{2}{1}{Processi differenti}{40}{0}{6}}
\@writefile{nav}{\headcommand {\beamer@subsubsectionentry {0}{7}{2}{1}{40}{Processi differenti}}}
\@writefile{nav}{\headcommand {\slideentry {7}{2}{1}{40/40}{Attribuzione}{0}}}
\@writefile{nav}{\headcommand {\beamer@framepages {40}{40}}}
\@writefile{nav}{\headcommand {\slideentry {7}{2}{2}{41/41}{Attribuzione}{0}}}
\@writefile{nav}{\headcommand {\beamer@framepages {41}{41}}}
\@writefile{nav}{\headcommand {\slideentry {7}{2}{3}{42/42}{Attribuzione}{0}}}
\@writefile{nav}{\headcommand {\beamer@framepages {42}{42}}}
\@writefile{toc}{\beamer@subsubsectionintoc {7}{2}{2}{Parti differenti}{43}{0}{6}}
\@writefile{nav}{\headcommand {\beamer@subsubsectionentry {0}{7}{2}{2}{43}{Parti differenti}}}
\@writefile{nav}{\headcommand {\slideentry {7}{2}{4}{43/43}{Attribuzione}{0}}}
\@writefile{nav}{\headcommand {\beamer@framepages {43}{43}}}
\@writefile{nav}{\headcommand {\slideentry {7}{2}{5}{44/44}{Attribuzione}{0}}}
\@writefile{nav}{\headcommand {\beamer@framepages {44}{44}}}
\@writefile{toc}{\beamer@sectionintoc {8}{Testi reali}{45}{0}{7}}
\@writefile{nav}{\headcommand {\beamer@sectionpages {36}{44}}}
\@writefile{nav}{\headcommand {\beamer@subsectionpages {40}{44}}}
\@writefile{nav}{\headcommand {\sectionentry {8}{Testi reali}{45}{Testi reali}{0}}}
\@writefile{toc}{\beamer@subsectionintoc {8}{1}{Dizionario Italiano}{45}{0}{7}}
\@writefile{nav}{\headcommand {\beamer@subsectionpages {45}{44}}}
\@writefile{nav}{\headcommand {\beamer@subsectionentry {0}{8}{1}{45}{Dizionario Italiano}}}
\@writefile{nav}{\headcommand {\slideentry {8}{1}{1}{45/45}{Dizionario Italiano}{0}}}
\@writefile{nav}{\headcommand {\beamer@framepages {45}{45}}}
\@writefile{nav}{\headcommand {\slideentry {8}{1}{2}{46/46}{Dizionario Italiano}{0}}}
\@writefile{nav}{\headcommand {\beamer@framepages {46}{46}}}
\citation{margh}
\@writefile{toc}{\beamer@subsectionintoc {8}{2}{Percentuali di attribuzione}{47}{0}{7}}
\@writefile{nav}{\headcommand {\beamer@subsectionpages {45}{46}}}
\@writefile{nav}{\headcommand {\beamer@subsectionentry {0}{8}{2}{47}{Percentuali di attribuzione}}}
\newlabel{italian_results}{{16}{47}{Attribuzione continua.\relax }{Doc-Start}{}}
\@writefile{snm}{\beamer@slide {italian_results}{47}}
\@writefile{nav}{\headcommand {\slideentry {8}{2}{1}{47/47}{Percentuali di attribuzione}{0}}}
\@writefile{nav}{\headcommand {\beamer@framepages {47}{47}}}
\@writefile{toc}{\beamer@subsectionintoc {8}{3}{Algoritmo LZ77}{48}{0}{7}}
\@writefile{nav}{\headcommand {\beamer@subsectionpages {47}{47}}}
\@writefile{nav}{\headcommand {\beamer@subsectionentry {0}{8}{3}{48}{Algoritmo LZ77}}}
\@writefile{nav}{\headcommand {\slideentry {8}{3}{1}{48/48}{Algoritmo LZ77}{0}}}
\@writefile{nav}{\headcommand {\beamer@framepages {48}{48}}}
\@writefile{nav}{\headcommand {\slideentry {8}{3}{2}{49/49}{Algoritmo LZ77}{0}}}
\@writefile{nav}{\headcommand {\beamer@framepages {49}{49}}}
\@writefile{nav}{\headcommand {\slideentry {8}{3}{3}{50/50}{Algoritmo LZ77}{0}}}
\@writefile{nav}{\headcommand {\beamer@framepages {50}{50}}}
\@writefile{toc}{\beamer@subsectionintoc {8}{4}{Dizionario LZ77}{51}{0}{7}}
\@writefile{nav}{\headcommand {\beamer@subsectionpages {48}{50}}}
\@writefile{nav}{\headcommand {\beamer@subsectionentry {0}{8}{4}{51}{Dizionario LZ77}}}
\@writefile{nav}{\headcommand {\slideentry {8}{4}{1}{51/51}{Dizionario LZ77}{0}}}
\@writefile{nav}{\headcommand {\beamer@framepages {51}{51}}}
\citation{margh}
\@writefile{toc}{\beamer@subsectionintoc {8}{5}{Percentuali di attribuzione}{52}{0}{7}}
\@writefile{nav}{\headcommand {\beamer@subsectionpages {51}{51}}}
\@writefile{nav}{\headcommand {\beamer@subsectionentry {0}{8}{5}{52}{Percentuali di attribuzione}}}
\@writefile{nav}{\headcommand {\slideentry {8}{5}{1}{52/52}{Percentuali di attribuzione}{0}}}
\@writefile{nav}{\headcommand {\beamer@framepages {52}{52}}}
\@writefile{toc}{\beamer@sectionintoc {9}{Conclusioni}{53}{0}{8}}
\@writefile{nav}{\headcommand {\beamer@sectionpages {45}{52}}}
\@writefile{nav}{\headcommand {\beamer@subsectionpages {52}{52}}}
\@writefile{nav}{\headcommand {\sectionentry {9}{Conclusioni}{53}{Conclusioni}{0}}}
\@writefile{nav}{\headcommand {\slideentry {9}{0}{1}{53/53}{}{0}}}
\@writefile{nav}{\headcommand {\beamer@framepages {53}{53}}}
\@writefile{nav}{\headcommand {\slideentry {9}{0}{2}{54/54}{}{0}}}
\@writefile{nav}{\headcommand {\beamer@framepages {54}{54}}}
\citation{margh}
\@writefile{nav}{\headcommand {\slideentry {9}{0}{3}{55/55}{}{0}}}
\@writefile{nav}{\headcommand {\beamer@framepages {55}{55}}}
\bibstyle{naturemag}
\bibdata{pres.bib}
\bibcite{zipf}{\hyperlink {beamerbibzipf}{1}}
\bibcite{heaps}{\hyperlink {beamerbibheaps}{2}}
\bibcite{egghe}{\hyperlink {beamerbibegghe}{3}}
\bibcite{zhang}{\hyperlink {beamerbibzhang}{4}}
\bibcite{polya}{\hyperlink {beamerbibpolya}{5}}
\bibcite{ferguson}{\hyperlink {beamerbibferguson}{6}}
\bibcite{teh}{\hyperlink {beamerbibteh}{7}}
\bibcite{blackwell}{\hyperlink {beamerbibblackwell}{8}}
\bibcite{pitman}{\hyperlink {beamerbibpitman}{9}}
\bibcite{buntine}{\hyperlink {beamerbibbuntine}{10}}
\bibcite{adjacent}{\hyperlink {beamerbibadjacent}{11}}
\bibcite{barnard}{\hyperlink {beamerbibbarnard}{12}}
\bibcite{margh}{\hyperlink {beamerbibmargh}{13}}
\@writefile{toc}{\beamer@sectionintoc {10}{Riferimenti}{56}{0}{9}}
\@writefile{nav}{\headcommand {\beamer@sectionpages {53}{55}}}
\@writefile{nav}{\headcommand {\beamer@subsectionpages {53}{55}}}
\@writefile{nav}{\headcommand {\sectionentry {10}{Riferimenti}{56}{Riferimenti}{0}}}
\@writefile{nav}{\headcommand {\slideentry {10}{0}{1}{56/56}{}{0}}}
\@writefile{nav}{\headcommand {\beamer@framepages {56}{56}}}
\@writefile{nav}{\headcommand {\slideentry {10}{0}{1}{56/57}{}{0}}}
\@writefile{nav}{\headcommand {\beamer@framepages {56}{57}}}
\@writefile{nav}{\headcommand {\slideentry {10}{0}{1}{56/58}{}{0}}}
\@writefile{nav}{\headcommand {\beamer@framepages {56}{58}}}
\@writefile{nav}{\headcommand {\slideentry {10}{0}{1}{56/59}{}{0}}}
\@writefile{nav}{\headcommand {\beamer@framepages {56}{59}}}
\@writefile{nav}{\headcommand {\slideentry {10}{0}{1}{56/60}{}{0}}}
\@writefile{nav}{\headcommand {\beamer@framepages {56}{60}}}
\@writefile{nav}{\headcommand {\slideentry {10}{0}{1}{56/61}{}{0}}}
\@writefile{nav}{\headcommand {\beamer@framepages {56}{61}}}
\@writefile{toc}{\beamer@sectionintoc {11}{Teorema di Bayes}{62}{0}{10}}
\@writefile{nav}{\headcommand {\beamer@sectionpages {56}{61}}}
\@writefile{nav}{\headcommand {\beamer@subsectionpages {56}{61}}}
\@writefile{nav}{\headcommand {\slideentry {11}{0}{1}{62/62}{}{0}}}
\@writefile{nav}{\headcommand {\beamer@framepages {62}{62}}}
\@writefile{toc}{\beamer@sectionintoc {12}{Urna di Pólya}{63}{0}{11}}
\@writefile{nav}{\headcommand {\beamer@sectionpages {62}{62}}}
\@writefile{nav}{\headcommand {\beamer@subsectionpages {62}{62}}}
\@writefile{nav}{\headcommand {\slideentry {12}{0}{1}{63/63}{}{0}}}
\@writefile{nav}{\headcommand {\beamer@framepages {63}{63}}}
\@writefile{nav}{\headcommand {\slideentry {12}{0}{2}{64/64}{}{0}}}
\@writefile{nav}{\headcommand {\beamer@framepages {64}{64}}}
\@writefile{toc}{\beamer@sectionintoc {13}{Processo di Dirichlet}{65}{0}{12}}
\@writefile{nav}{\headcommand {\beamer@sectionpages {63}{64}}}
\@writefile{nav}{\headcommand {\beamer@subsectionpages {63}{64}}}
\@writefile{nav}{\headcommand {\slideentry {13}{0}{1}{65/65}{}{0}}}
\@writefile{nav}{\headcommand {\beamer@framepages {65}{65}}}
\@writefile{nav}{\headcommand {\slideentry {13}{0}{2}{66/66}{}{0}}}
\@writefile{nav}{\headcommand {\beamer@framepages {66}{66}}}
\@writefile{nav}{\headcommand {\slideentry {13}{0}{3}{67/67}{}{0}}}
\@writefile{nav}{\headcommand {\beamer@framepages {67}{67}}}
\@writefile{toc}{\beamer@sectionintoc {14}{Modello di Blackwell MacQueen}{68}{0}{13}}
\@writefile{nav}{\headcommand {\beamer@sectionpages {65}{67}}}
\@writefile{nav}{\headcommand {\beamer@subsectionpages {65}{67}}}
\@writefile{nav}{\headcommand {\slideentry {14}{0}{1}{68/68}{}{0}}}
\@writefile{nav}{\headcommand {\beamer@framepages {68}{68}}}
\@writefile{nav}{\headcommand {\slideentry {14}{0}{2}{69/69}{}{0}}}
\@writefile{nav}{\headcommand {\beamer@framepages {69}{69}}}
\@writefile{nav}{\headcommand {\slideentry {14}{0}{3}{70/70}{}{0}}}
\@writefile{nav}{\headcommand {\beamer@framepages {70}{70}}}
\@writefile{nav}{\headcommand {\slideentry {14}{0}{4}{71/71}{}{0}}}
\@writefile{nav}{\headcommand {\beamer@framepages {71}{71}}}
\@writefile{toc}{\beamer@sectionintoc {15}{Modello del possibile adiacente}{72}{0}{14}}
\@writefile{nav}{\headcommand {\beamer@sectionpages {68}{71}}}
\@writefile{nav}{\headcommand {\beamer@subsectionpages {68}{71}}}
\@writefile{nav}{\headcommand {\slideentry {15}{0}{1}{72/72}{}{0}}}
\@writefile{nav}{\headcommand {\beamer@framepages {72}{72}}}
\@writefile{nav}{\headcommand {\slideentry {15}{0}{2}{73/73}{}{0}}}
\@writefile{nav}{\headcommand {\beamer@framepages {73}{73}}}
\@writefile{nav}{\headcommand {\beamer@partpages {1}{73}}}
\@writefile{nav}{\headcommand {\beamer@subsectionpages {72}{73}}}
\@writefile{nav}{\headcommand {\beamer@sectionpages {72}{73}}}
\@writefile{nav}{\headcommand {\beamer@documentpages {73}}}
\@writefile{nav}{\headcommand {\gdef \inserttotalframenumber {73}}}
