\relax 
\providecommand\hyper@newdestlabel[2]{}
\providecommand\HyperFirstAtBeginDocument{\AtBeginDocument}
\HyperFirstAtBeginDocument{\ifx\hyper@anchor\@undefined
\global\let\oldcontentsline\contentsline
\gdef\contentsline#1#2#3#4{\oldcontentsline{#1}{#2}{#3}}
\global\let\oldnewlabel\newlabel
\gdef\newlabel#1#2{\newlabelxx{#1}#2}
\gdef\newlabelxx#1#2#3#4#5#6{\oldnewlabel{#1}{{#2}{#3}}}
\AtEndDocument{\ifx\hyper@anchor\@undefined
\let\contentsline\oldcontentsline
\let\newlabel\oldnewlabel
\fi}
\fi}
\global\let\hyper@last\relax 
\gdef\HyperFirstAtBeginDocument#1{#1}
\providecommand\HyField@AuxAddToFields[1]{}
\providecommand\HyField@AuxAddToCoFields[2]{}
\bbl@beforestart
\babel@aux{italian}{}
\babel@aux{italian}{}
\@writefile{nav}{\headcommand {\slideentry {0}{0}{1}{1/1}{}{0}}}
\@writefile{nav}{\headcommand {\beamer@framepages {1}{1}}}
\@writefile{toc}{\beamer@sectionintoc {1}{Leggi}{2}{0}{1}}
\@writefile{nav}{\headcommand {\beamer@sectionpages {1}{1}}}
\@writefile{nav}{\headcommand {\beamer@subsectionpages {1}{1}}}
\@writefile{nav}{\headcommand {\sectionentry {1}{Leggi}{2}{Leggi}{0}}}
\@writefile{toc}{\beamer@subsectionintoc {1}{1}{Leggi empiriche}{2}{0}{1}}
\@writefile{nav}{\headcommand {\beamer@subsectionpages {2}{1}}}
\@writefile{nav}{\headcommand {\beamer@subsectionentry {0}{1}{1}{2}{Leggi empiriche}}}
\@writefile{nav}{\headcommand {\slideentry {1}{1}{1}{2/3}{Leggi empiriche}{0}}}
\@writefile{nav}{\headcommand {\beamer@framepages {2}{3}}}
\citation{zipf}
\@writefile{toc}{\beamer@subsectionintoc {1}{2}{Legge di Zipf}{4}{0}{1}}
\@writefile{nav}{\headcommand {\beamer@subsectionpages {2}{3}}}
\@writefile{nav}{\headcommand {\beamer@subsectionentry {0}{1}{2}{4}{Legge di Zipf}}}
\citation{zipf}
\@writefile{nav}{\headcommand {\slideentry {1}{2}{1}{4/5}{Legge di Zipf}{0}}}
\@writefile{nav}{\headcommand {\beamer@framepages {4}{5}}}
\@writefile{nav}{\headcommand {\slideentry {1}{2}{2}{6/7}{Legge di Zipf}{0}}}
\@writefile{nav}{\headcommand {\beamer@framepages {6}{7}}}
\citation{heaps}
\citation{egghe}
\@writefile{toc}{\beamer@subsectionintoc {1}{3}{Legge di Heaps}{8}{0}{1}}
\@writefile{nav}{\headcommand {\beamer@subsectionpages {4}{7}}}
\@writefile{nav}{\headcommand {\beamer@subsectionentry {0}{1}{3}{8}{Legge di Heaps}}}
\providecommand*\caption@xref[2]{\@setref\relax\@undefined{#1}}
\newlabel{heaps_all}{{2}{8}{Grafico log-log. Fit di forma $Ax^{\beta }$ per la libreria concatenata.\relax }{Doc-Start}{}}
\@writefile{snm}{\beamer@slide {heaps_all}{8}}
\@writefile{nav}{\headcommand {\slideentry {1}{3}{1}{8/8}{Legge di Heaps}{0}}}
\@writefile{nav}{\headcommand {\beamer@framepages {8}{8}}}
\citation{zhang}
\citation{zhang}
\@writefile{nav}{\headcommand {\slideentry {1}{3}{2}{9/10}{Legge di Heaps}{0}}}
\@writefile{nav}{\headcommand {\beamer@framepages {9}{10}}}
\@writefile{toc}{\beamer@sectionintoc {2}{Bayes}{11}{0}{2}}
\@writefile{nav}{\headcommand {\beamer@sectionpages {2}{10}}}
\@writefile{nav}{\headcommand {\beamer@subsectionpages {8}{10}}}
\@writefile{nav}{\headcommand {\sectionentry {2}{Bayes}{11}{Bayes}{0}}}
\@writefile{toc}{\beamer@subsectionintoc {2}{1}{Teorema di Bayes}{11}{0}{2}}
\@writefile{nav}{\headcommand {\beamer@subsectionpages {11}{10}}}
\@writefile{nav}{\headcommand {\beamer@subsectionentry {0}{2}{1}{11}{Teorema di Bayes}}}
\@writefile{nav}{\headcommand {\slideentry {2}{1}{1}{11/12}{Teorema di Bayes}{0}}}
\@writefile{nav}{\headcommand {\beamer@framepages {11}{12}}}
\@writefile{toc}{\beamer@subsectionintoc {2}{2}{Scelta del modello}{13}{0}{2}}
\@writefile{nav}{\headcommand {\beamer@subsectionpages {11}{12}}}
\@writefile{nav}{\headcommand {\beamer@subsectionentry {0}{2}{2}{13}{Scelta del modello}}}
\@writefile{nav}{\headcommand {\slideentry {2}{2}{1}{13/15}{Scelta del modello}{0}}}
\@writefile{nav}{\headcommand {\beamer@framepages {13}{15}}}
\@writefile{toc}{\beamer@subsubsectionintoc {2}{2}{1}{Scambiabilità}{16}{0}{2}}
\@writefile{nav}{\headcommand {\beamer@subsubsectionentry {0}{2}{2}{1}{16}{Scambiabilità}}}
\@writefile{nav}{\headcommand {\slideentry {2}{2}{2}{16/18}{Scelta del modello}{0}}}
\@writefile{nav}{\headcommand {\beamer@framepages {16}{18}}}
\@writefile{toc}{\beamer@subsubsectionintoc {2}{2}{2}{Teorema della rappresentazione di De Finetti}{19}{0}{2}}
\@writefile{nav}{\headcommand {\beamer@subsubsectionentry {0}{2}{2}{2}{19}{Teorema della rappresentazione di De Finetti}}}
\@writefile{nav}{\headcommand {\slideentry {2}{2}{3}{19/20}{Scelta del modello}{0}}}
\@writefile{nav}{\headcommand {\beamer@framepages {19}{20}}}
\citation{polya}
\@writefile{toc}{\beamer@subsubsectionintoc {2}{2}{3}{Urna di Pólya}{21}{0}{2}}
\@writefile{nav}{\headcommand {\beamer@subsubsectionentry {0}{2}{2}{3}{21}{Urna di Pólya}}}
\citation{polya}
\citation{polya}
\citation{polya}
\@writefile{nav}{\headcommand {\slideentry {2}{2}{4}{21/24}{Scelta del modello}{0}}}
\@writefile{nav}{\headcommand {\beamer@framepages {21}{24}}}
\@writefile{nav}{\headcommand {\slideentry {2}{2}{5}{25/26}{Scelta del modello}{0}}}
\@writefile{nav}{\headcommand {\beamer@framepages {25}{26}}}
\@writefile{nav}{\headcommand {\slideentry {2}{2}{6}{27/28}{Scelta del modello}{0}}}
\@writefile{nav}{\headcommand {\beamer@framepages {27}{28}}}
\citation{ferguson}
\citation{teh}
\@writefile{toc}{\beamer@sectionintoc {3}{Dirichlet}{29}{0}{3}}
\@writefile{nav}{\headcommand {\beamer@sectionpages {11}{28}}}
\@writefile{nav}{\headcommand {\beamer@subsectionpages {13}{28}}}
\@writefile{nav}{\headcommand {\sectionentry {3}{Dirichlet}{29}{Dirichlet}{0}}}
\@writefile{toc}{\beamer@subsectionintoc {3}{1}{Processo di Dirichlet}{29}{0}{3}}
\@writefile{nav}{\headcommand {\beamer@subsectionpages {29}{28}}}
\@writefile{nav}{\headcommand {\beamer@subsectionentry {0}{3}{1}{29}{Processo di Dirichlet}}}
\citation{ferguson}
\citation{teh}
\@writefile{nav}{\headcommand {\slideentry {3}{1}{1}{29/30}{Processo di Dirichlet}{0}}}
\@writefile{nav}{\headcommand {\beamer@framepages {29}{30}}}
\@writefile{nav}{\headcommand {\slideentry {3}{1}{2}{31/32}{Processo di Dirichlet}{0}}}
\@writefile{nav}{\headcommand {\beamer@framepages {31}{32}}}
\@writefile{nav}{\headcommand {\slideentry {3}{1}{3}{33/33}{Processo di Dirichlet}{0}}}
\@writefile{nav}{\headcommand {\beamer@framepages {33}{33}}}
\@writefile{nav}{\headcommand {\slideentry {3}{1}{4}{34/34}{Processo di Dirichlet}{0}}}
\@writefile{nav}{\headcommand {\beamer@framepages {34}{34}}}
\@writefile{nav}{\headcommand {\slideentry {3}{1}{5}{35/36}{Processo di Dirichlet}{0}}}
\@writefile{nav}{\headcommand {\beamer@framepages {35}{36}}}
\@writefile{nav}{\headcommand {\slideentry {3}{1}{6}{37/37}{Processo di Dirichlet}{0}}}
\@writefile{nav}{\headcommand {\beamer@framepages {37}{37}}}
\citation{blackwell}
\@writefile{toc}{\beamer@subsectionintoc {3}{2}{Modello di Blackwell MacQueen}{38}{0}{3}}
\@writefile{nav}{\headcommand {\beamer@subsectionpages {29}{37}}}
\@writefile{nav}{\headcommand {\beamer@subsectionentry {0}{3}{2}{38}{Modello di Blackwell MacQueen}}}
\citation{blackwell}
\citation{blackwell}
\@writefile{nav}{\headcommand {\slideentry {3}{2}{1}{38/40}{Modello di Blackwell MacQueen}{0}}}
\@writefile{nav}{\headcommand {\beamer@framepages {38}{40}}}
\@writefile{nav}{\headcommand {\slideentry {3}{2}{2}{41/42}{Modello di Blackwell MacQueen}{0}}}
\@writefile{nav}{\headcommand {\beamer@framepages {41}{42}}}
\@writefile{nav}{\headcommand {\slideentry {3}{2}{3}{43/44}{Modello di Blackwell MacQueen}{0}}}
\@writefile{nav}{\headcommand {\beamer@framepages {43}{44}}}
\@writefile{nav}{\headcommand {\slideentry {3}{2}{4}{45/46}{Modello di Blackwell MacQueen}{0}}}
\@writefile{nav}{\headcommand {\beamer@framepages {45}{46}}}
\@writefile{nav}{\headcommand {\slideentry {3}{2}{5}{47/47}{Modello di Blackwell MacQueen}{0}}}
\@writefile{nav}{\headcommand {\beamer@framepages {47}{47}}}
\citation{pitman}
\@writefile{toc}{\beamer@sectionintoc {4}{Poisson-Dirichlet}{48}{0}{4}}
\@writefile{nav}{\headcommand {\beamer@sectionpages {29}{47}}}
\@writefile{nav}{\headcommand {\beamer@subsectionpages {38}{47}}}
\@writefile{nav}{\headcommand {\sectionentry {4}{Poisson-Dirichlet}{48}{Poisson-Dirichlet}{0}}}
\@writefile{toc}{\beamer@subsectionintoc {4}{1}{Processo di Poisson-Dirichlet}{48}{0}{4}}
\@writefile{nav}{\headcommand {\beamer@subsectionpages {48}{47}}}
\@writefile{nav}{\headcommand {\beamer@subsectionentry {0}{4}{1}{48}{Processo di Poisson-Dirichlet}}}
\citation{pitman}
\@writefile{nav}{\headcommand {\slideentry {4}{1}{1}{48/49}{Processo di Poisson-Dirichlet}{0}}}
\@writefile{nav}{\headcommand {\beamer@framepages {48}{49}}}
\@writefile{nav}{\headcommand {\slideentry {4}{1}{2}{50/50}{Processo di Poisson-Dirichlet}{0}}}
\@writefile{nav}{\headcommand {\beamer@framepages {50}{50}}}
\@writefile{nav}{\headcommand {\slideentry {4}{1}{3}{51/51}{Processo di Poisson-Dirichlet}{0}}}
\@writefile{nav}{\headcommand {\beamer@framepages {51}{51}}}
\@writefile{nav}{\headcommand {\slideentry {4}{1}{4}{52/52}{Processo di Poisson-Dirichlet}{0}}}
\@writefile{nav}{\headcommand {\beamer@framepages {52}{52}}}
\@writefile{nav}{\headcommand {\slideentry {4}{1}{5}{53/56}{Processo di Poisson-Dirichlet}{0}}}
\@writefile{nav}{\headcommand {\beamer@framepages {53}{56}}}
\@writefile{nav}{\headcommand {\slideentry {4}{1}{6}{57/57}{Processo di Poisson-Dirichlet}{0}}}
\@writefile{nav}{\headcommand {\beamer@framepages {57}{57}}}
\citation{buntine}
\@writefile{nav}{\headcommand {\slideentry {4}{1}{7}{58/58}{Processo di Poisson-Dirichlet}{0}}}
\@writefile{nav}{\headcommand {\beamer@framepages {58}{58}}}
\@writefile{nav}{\headcommand {\slideentry {4}{1}{8}{59/60}{Processo di Poisson-Dirichlet}{0}}}
\@writefile{nav}{\headcommand {\beamer@framepages {59}{60}}}
\@writefile{nav}{\headcommand {\slideentry {4}{1}{9}{61/61}{Processo di Poisson-Dirichlet}{0}}}
\@writefile{nav}{\headcommand {\beamer@framepages {61}{61}}}
\citation{adjacent}
\@writefile{toc}{\beamer@subsectionintoc {4}{2}{Modello del possibile adiacente}{62}{0}{4}}
\@writefile{nav}{\headcommand {\beamer@subsectionpages {48}{61}}}
\@writefile{nav}{\headcommand {\beamer@subsectionentry {0}{4}{2}{62}{Modello del possibile adiacente}}}
\citation{adjacent}
\citation{adjacent}
\@writefile{nav}{\headcommand {\slideentry {4}{2}{1}{62/64}{Modello del possibile adiacente}{0}}}
\@writefile{nav}{\headcommand {\beamer@framepages {62}{64}}}
\@writefile{nav}{\headcommand {\slideentry {4}{2}{2}{65/66}{Modello del possibile adiacente}{0}}}
\@writefile{nav}{\headcommand {\beamer@framepages {65}{66}}}
\@writefile{nav}{\headcommand {\slideentry {4}{2}{3}{67/67}{Modello del possibile adiacente}{0}}}
\@writefile{nav}{\headcommand {\beamer@framepages {67}{67}}}
\@writefile{nav}{\headcommand {\slideentry {4}{2}{4}{68/70}{Modello del possibile adiacente}{0}}}
\@writefile{nav}{\headcommand {\beamer@framepages {68}{70}}}
\@writefile{nav}{\headcommand {\slideentry {4}{2}{5}{71/71}{Modello del possibile adiacente}{0}}}
\@writefile{nav}{\headcommand {\beamer@framepages {71}{71}}}
\@writefile{toc}{\beamer@sectionintoc {5}{Attribuzione}{72}{0}{5}}
\@writefile{nav}{\headcommand {\beamer@sectionpages {48}{71}}}
\@writefile{nav}{\headcommand {\beamer@subsectionpages {62}{71}}}
\@writefile{nav}{\headcommand {\sectionentry {5}{Attribuzione}{72}{Attribuzione}{0}}}
\@writefile{toc}{\beamer@subsectionintoc {5}{1}{Stima dei parametri continui}{72}{0}{5}}
\@writefile{nav}{\headcommand {\beamer@subsectionpages {72}{71}}}
\@writefile{nav}{\headcommand {\beamer@subsectionentry {0}{5}{1}{72}{Stima dei parametri continui}}}
\@writefile{nav}{\headcommand {\slideentry {5}{1}{1}{72/72}{Stima dei parametri continui}{0}}}
\@writefile{nav}{\headcommand {\beamer@framepages {72}{72}}}
\@writefile{nav}{\headcommand {\slideentry {5}{1}{2}{73/73}{Stima dei parametri continui}{0}}}
\@writefile{nav}{\headcommand {\beamer@framepages {73}{73}}}
\@writefile{toc}{\beamer@subsectionintoc {5}{2}{Stima dei parametri discreti}{74}{0}{5}}
\@writefile{nav}{\headcommand {\beamer@subsectionpages {72}{73}}}
\@writefile{nav}{\headcommand {\beamer@subsectionentry {0}{5}{2}{74}{Stima dei parametri discreti}}}
\@writefile{nav}{\headcommand {\slideentry {5}{2}{1}{74/74}{Stima dei parametri discreti}{0}}}
\@writefile{nav}{\headcommand {\beamer@framepages {74}{74}}}
\@writefile{nav}{\headcommand {\slideentry {5}{2}{2}{75/75}{Stima dei parametri discreti}{0}}}
\@writefile{nav}{\headcommand {\beamer@framepages {75}{75}}}
\citation{pitman}
\citation{pitman}
\@writefile{nav}{\headcommand {\slideentry {5}{2}{3}{76/77}{Stima dei parametri discreti}{0}}}
\@writefile{nav}{\headcommand {\beamer@framepages {76}{77}}}
\@writefile{nav}{\headcommand {\slideentry {5}{2}{4}{78/79}{Stima dei parametri discreti}{0}}}
\@writefile{nav}{\headcommand {\beamer@framepages {78}{79}}}
\citation{barnard}
\@writefile{toc}{\beamer@subsectionintoc {5}{3}{Legge della verosimiglianza}{80}{0}{5}}
\@writefile{nav}{\headcommand {\beamer@subsectionpages {74}{79}}}
\@writefile{nav}{\headcommand {\beamer@subsectionentry {0}{5}{3}{80}{Legge della verosimiglianza}}}
\citation{barnard}
\@writefile{nav}{\headcommand {\slideentry {5}{3}{1}{80/81}{Legge della verosimiglianza}{0}}}
\@writefile{nav}{\headcommand {\beamer@framepages {80}{81}}}
\@writefile{toc}{\beamer@sectionintoc {6}{Testi sintetici}{82}{0}{6}}
\@writefile{nav}{\headcommand {\beamer@sectionpages {72}{81}}}
\@writefile{nav}{\headcommand {\beamer@subsectionpages {80}{81}}}
\@writefile{nav}{\headcommand {\sectionentry {6}{Testi sintetici}{82}{Testi sintetici}{0}}}
\@writefile{nav}{\headcommand {\slideentry {6}{0}{1}{82/84}{}{0}}}
\@writefile{nav}{\headcommand {\beamer@framepages {82}{84}}}
\@writefile{toc}{\beamer@subsectionintoc {6}{1}{Dizionario variabile}{85}{0}{6}}
\@writefile{nav}{\headcommand {\beamer@subsectionpages {82}{84}}}
\@writefile{nav}{\headcommand {\beamer@subsectionentry {0}{6}{1}{85}{Dizionario variabile}}}
\@writefile{nav}{\headcommand {\slideentry {6}{1}{1}{85/85}{Dizionario variabile}{0}}}
\@writefile{nav}{\headcommand {\beamer@framepages {85}{85}}}
\@writefile{nav}{\headcommand {\slideentry {6}{1}{2}{86/86}{Dizionario variabile}{0}}}
\@writefile{nav}{\headcommand {\beamer@framepages {86}{86}}}
\@writefile{nav}{\headcommand {\slideentry {6}{1}{3}{87/87}{Dizionario variabile}{0}}}
\@writefile{nav}{\headcommand {\beamer@framepages {87}{87}}}
\@writefile{nav}{\headcommand {\slideentry {6}{1}{4}{88/88}{Dizionario variabile}{0}}}
\@writefile{nav}{\headcommand {\beamer@framepages {88}{88}}}
\@writefile{toc}{\beamer@subsectionintoc {6}{2}{Processi differenti}{89}{0}{6}}
\@writefile{nav}{\headcommand {\beamer@subsectionpages {85}{88}}}
\@writefile{nav}{\headcommand {\beamer@subsectionentry {0}{6}{2}{89}{Processi differenti}}}
\@writefile{nav}{\headcommand {\slideentry {6}{2}{1}{89/90}{Processi differenti}{0}}}
\@writefile{nav}{\headcommand {\beamer@framepages {89}{90}}}
\@writefile{nav}{\headcommand {\slideentry {6}{2}{2}{91/91}{Processi differenti}{0}}}
\@writefile{nav}{\headcommand {\beamer@framepages {91}{91}}}
\@writefile{nav}{\headcommand {\slideentry {6}{2}{3}{92/92}{Processi differenti}{0}}}
\@writefile{nav}{\headcommand {\beamer@framepages {92}{92}}}
\@writefile{toc}{\beamer@subsectionintoc {6}{3}{Parti differenti}{93}{0}{6}}
\@writefile{nav}{\headcommand {\beamer@subsectionpages {89}{92}}}
\@writefile{nav}{\headcommand {\beamer@subsectionentry {0}{6}{3}{93}{Parti differenti}}}
\@writefile{nav}{\headcommand {\slideentry {6}{3}{1}{93/95}{Parti differenti}{0}}}
\@writefile{nav}{\headcommand {\beamer@framepages {93}{95}}}
\@writefile{nav}{\headcommand {\slideentry {6}{3}{2}{96/96}{Parti differenti}{0}}}
\@writefile{nav}{\headcommand {\beamer@framepages {96}{96}}}
\@writefile{toc}{\beamer@sectionintoc {7}{Testi reali}{97}{0}{7}}
\@writefile{nav}{\headcommand {\beamer@sectionpages {82}{96}}}
\@writefile{nav}{\headcommand {\beamer@subsectionpages {93}{96}}}
\@writefile{nav}{\headcommand {\sectionentry {7}{Testi reali}{97}{Testi reali}{0}}}
\@writefile{toc}{\beamer@subsectionintoc {7}{1}{Dizionario Italiano}{97}{0}{7}}
\@writefile{nav}{\headcommand {\beamer@subsectionpages {97}{96}}}
\@writefile{nav}{\headcommand {\beamer@subsectionentry {0}{7}{1}{97}{Dizionario Italiano}}}
\@writefile{nav}{\headcommand {\slideentry {7}{1}{1}{97/100}{Dizionario Italiano}{0}}}
\@writefile{nav}{\headcommand {\beamer@framepages {97}{100}}}
\@writefile{nav}{\headcommand {\slideentry {7}{1}{2}{101/101}{Dizionario Italiano}{0}}}
\@writefile{nav}{\headcommand {\beamer@framepages {101}{101}}}
\@writefile{toc}{\beamer@subsectionintoc {7}{2}{Percentuali di attribuzione}{102}{0}{7}}
\@writefile{nav}{\headcommand {\beamer@subsectionpages {97}{101}}}
\@writefile{nav}{\headcommand {\beamer@subsectionentry {0}{7}{2}{102}{Percentuali di attribuzione}}}
\newlabel{italian_results}{{16}{102}{Attribuzione continua.\relax }{Doc-Start}{}}
\@writefile{snm}{\beamer@slide {italian_results}{102}}
\@writefile{nav}{\headcommand {\slideentry {7}{2}{1}{102/102}{Percentuali di attribuzione}{0}}}
\@writefile{nav}{\headcommand {\beamer@framepages {102}{102}}}
\@writefile{toc}{\beamer@subsectionintoc {7}{3}{Algoritmo LZ77}{103}{0}{7}}
\@writefile{nav}{\headcommand {\beamer@subsectionpages {102}{102}}}
\@writefile{nav}{\headcommand {\beamer@subsectionentry {0}{7}{3}{103}{Algoritmo LZ77}}}
\@writefile{nav}{\headcommand {\slideentry {7}{3}{1}{103/105}{Algoritmo LZ77}{0}}}
\@writefile{nav}{\headcommand {\beamer@framepages {103}{105}}}
\@writefile{nav}{\headcommand {\slideentry {7}{3}{2}{106/106}{Algoritmo LZ77}{0}}}
\@writefile{nav}{\headcommand {\beamer@framepages {106}{106}}}
\@writefile{nav}{\headcommand {\slideentry {7}{3}{3}{107/107}{Algoritmo LZ77}{0}}}
\@writefile{nav}{\headcommand {\beamer@framepages {107}{107}}}
\@writefile{toc}{\beamer@subsectionintoc {7}{4}{Dizionario LZ77}{108}{0}{7}}
\@writefile{nav}{\headcommand {\beamer@subsectionpages {103}{107}}}
\@writefile{nav}{\headcommand {\beamer@subsectionentry {0}{7}{4}{108}{Dizionario LZ77}}}
\@writefile{nav}{\headcommand {\slideentry {7}{4}{1}{108/108}{Dizionario LZ77}{0}}}
\@writefile{nav}{\headcommand {\beamer@framepages {108}{108}}}
\@writefile{toc}{\beamer@subsectionintoc {7}{5}{Percentuali di attribuzione}{109}{0}{7}}
\@writefile{nav}{\headcommand {\beamer@subsectionpages {108}{108}}}
\@writefile{nav}{\headcommand {\beamer@subsectionentry {0}{7}{5}{109}{Percentuali di attribuzione}}}
\@writefile{nav}{\headcommand {\slideentry {7}{5}{1}{109/109}{Percentuali di attribuzione}{0}}}
\@writefile{nav}{\headcommand {\beamer@framepages {109}{109}}}
\citation{margh}
\@writefile{toc}{\beamer@sectionintoc {8}{Conclusioni}{110}{0}{8}}
\@writefile{nav}{\headcommand {\beamer@sectionpages {97}{109}}}
\@writefile{nav}{\headcommand {\beamer@subsectionpages {109}{109}}}
\@writefile{nav}{\headcommand {\sectionentry {8}{Conclusioni}{110}{Conclusioni}{0}}}
\citation{margh}
\citation{margh}
\@writefile{nav}{\headcommand {\slideentry {8}{0}{1}{110/112}{}{0}}}
\@writefile{nav}{\headcommand {\beamer@framepages {110}{112}}}
\bibstyle{naturemag}
\bibdata{pres.bib}
\bibcite{zipf}{\hyperlink {beamerbibzipf}{1}}
\bibcite{heaps}{\hyperlink {beamerbibheaps}{2}}
\bibcite{egghe}{\hyperlink {beamerbibegghe}{3}}
\bibcite{zhang}{\hyperlink {beamerbibzhang}{4}}
\bibcite{polya}{\hyperlink {beamerbibpolya}{5}}
\bibcite{ferguson}{\hyperlink {beamerbibferguson}{6}}
\bibcite{teh}{\hyperlink {beamerbibteh}{7}}
\bibcite{blackwell}{\hyperlink {beamerbibblackwell}{8}}
\bibcite{pitman}{\hyperlink {beamerbibpitman}{9}}
\bibcite{buntine}{\hyperlink {beamerbibbuntine}{10}}
\bibcite{adjacent}{\hyperlink {beamerbibadjacent}{11}}
\bibcite{barnard}{\hyperlink {beamerbibbarnard}{12}}
\bibcite{margh}{\hyperlink {beamerbibmargh}{13}}
\@writefile{toc}{\beamer@sectionintoc {9}{Riferimenti}{113}{0}{9}}
\@writefile{nav}{\headcommand {\beamer@sectionpages {110}{112}}}
\@writefile{nav}{\headcommand {\beamer@subsectionpages {110}{112}}}
\@writefile{nav}{\headcommand {\sectionentry {9}{Riferimenti}{113}{Riferimenti}{0}}}
\@writefile{nav}{\headcommand {\slideentry {9}{0}{1}{113/113}{}{0}}}
\@writefile{nav}{\headcommand {\beamer@framepages {113}{113}}}
\@writefile{nav}{\headcommand {\slideentry {9}{0}{1}{113/114}{}{0}}}
\@writefile{nav}{\headcommand {\beamer@framepages {113}{114}}}
\@writefile{nav}{\headcommand {\slideentry {9}{0}{1}{113/115}{}{0}}}
\@writefile{nav}{\headcommand {\beamer@framepages {113}{115}}}
\@writefile{nav}{\headcommand {\slideentry {9}{0}{1}{113/116}{}{0}}}
\@writefile{nav}{\headcommand {\beamer@framepages {113}{116}}}
\@writefile{nav}{\headcommand {\slideentry {9}{0}{1}{113/117}{}{0}}}
\@writefile{nav}{\headcommand {\beamer@framepages {113}{117}}}
\@writefile{nav}{\headcommand {\slideentry {9}{0}{1}{113/118}{}{0}}}
\@writefile{nav}{\headcommand {\beamer@framepages {113}{118}}}
\@writefile{nav}{\headcommand {\beamer@partpages {1}{118}}}
\@writefile{nav}{\headcommand {\beamer@subsectionpages {113}{118}}}
\@writefile{nav}{\headcommand {\beamer@sectionpages {113}{118}}}
\@writefile{nav}{\headcommand {\beamer@documentpages {118}}}
\@writefile{nav}{\headcommand {\gdef \inserttotalframenumber {70}}}
