\BOOKMARK [2][]{Outline0.1}{Leggi}{}% 1
\BOOKMARK [3][]{Outline0.1.1.2}{Leggi empiriche}{Outline0.1}% 2
\BOOKMARK [3][]{Outline0.1.2.3}{Legge di Zipf}{Outline0.1}% 3
\BOOKMARK [3][]{Outline0.1.3.5}{Legge di Heaps}{Outline0.1}% 4
\BOOKMARK [2][]{Outline0.2}{Modello}{}% 5
\BOOKMARK [3][]{Outline0.2.1.7}{Scambiabilit\340}{Outline0.2}% 6
\BOOKMARK [2][]{Outline0.3}{Dirichlet}{}% 7
\BOOKMARK [3][]{Outline0.3.1.13}{Processo di Dirichlet}{Outline0.3}% 8
\BOOKMARK [3][]{Outline0.3.2.16}{Modello di Blackwell MacQueen}{Outline0.3}% 9
\BOOKMARK [2][]{Outline0.4}{Poisson-Dirichlet}{}% 10
\BOOKMARK [3][]{Outline0.4.1.21}{Processo di Poisson-Dirichlet}{Outline0.4}% 11
\BOOKMARK [3][]{Outline0.4.2.30}{Modello del possibile adiacente}{Outline0.4}% 12
\BOOKMARK [2][]{Outline0.5}{Attribuzione}{}% 13
\BOOKMARK [3][]{Outline0.5.1.35}{Stima dei parametri continui}{Outline0.5}% 14
\BOOKMARK [3][]{Outline0.5.2.37}{Stima dei parametri discreti}{Outline0.5}% 15
\BOOKMARK [3][]{Outline0.5.3.41}{Legge della verosimiglianza}{Outline0.5}% 16
\BOOKMARK [2][]{Outline0.6}{Testi sintetici}{}% 17
\BOOKMARK [3][]{Outline0.6.1.43}{Dizionario variabile}{Outline0.6}% 18
\BOOKMARK [3][]{Outline0.6.2.47}{Processi differenti}{Outline0.6}% 19
\BOOKMARK [3][]{Outline0.6.3.50}{Parti differenti}{Outline0.6}% 20
\BOOKMARK [2][]{Outline0.7}{Testi reali}{}% 21
\BOOKMARK [3][]{Outline0.7.1.52}{Dizionario Italiano}{Outline0.7}% 22
\BOOKMARK [3][]{Outline0.7.2.54}{Percentuali di attribuzione}{Outline0.7}% 23
\BOOKMARK [3][]{Outline0.7.3.55}{Algoritmo LZ77}{Outline0.7}% 24
\BOOKMARK [3][]{Outline0.7.4.58}{Dizionario LZ77}{Outline0.7}% 25
\BOOKMARK [3][]{Outline0.7.5.59}{Percentuali di attribuzione}{Outline0.7}% 26
\BOOKMARK [2][]{Outline0.8}{Conclusioni}{}% 27
\BOOKMARK [2][]{Outline0.9}{Riferimenti}{}% 28
