Nominativo;Data scadenza;Importo;Ha pagato
Marco;2017-01-13;15;true
Stefano;2019-10-22;24;false
Leonardo;2022-02-10;97;true
Paolo;2015-04-25;151;false
Fabio;2016-06-12;214;false
Pietro;2018-09-05;62;true
Mattia;2019-04-06;53;false
Nicola;2021-01-19;25;true
Giovanni;2022-03-20;1;true
Bruno;2015-12-13;100;false