<?xml version="1.0" encoding="UTF-8"?>
<svg width="94px" height="70px" viewBox="0 0 94 70" version="1.1" xmlns="http://www.w3.org/2000/svg" xmlns:xlink="http://www.w3.org/1999/xlink">
    <!-- Generator: Sketch 56.2 (81672) - https://sketch.com -->
    <title>Oval_right</title>
    <desc>Created with Sketch.</desc>
    <g id="Page-1" stroke="none" stroke-width="1" fill="none" fill-rule="evenodd">
        <g id="Card" transform="translate(-274.000000, 0.000000)" fill-rule="nonzero" stroke="#FFFFFF" stroke-width="28">
            <g id="layout">
                <g id="Header-Copy">
                    <g id="bg-copy">
                        <g id="Oval_right" transform="translate(288.000000, -71.000000)">
                            <ellipse id="oval-blue2" opacity="0.08" style="mix-blend-mode: overlay;" cx="95" cy="106" rx="50" ry="53"></ellipse>
                            <ellipse id="oval-blue1" opacity="0.154817708" style="mix-blend-mode: overlay;" cx="100" cy="106" rx="100" ry="106"></ellipse>
                        </g>
                    </g>
                </g>
            </g>
        </g>
    </g>
</svg>