<?xml version="1.0" encoding="UTF-8"?>
<svg width="22px" height="22px" viewBox="0 0 22 22" version="1.1" xmlns="http://www.w3.org/2000/svg" xmlns:xlink="http://www.w3.org/1999/xlink">
    <!-- Generator: Sketch 56.2 (81672) - https://sketch.com -->
    <title>Close_icon</title>
    <desc>Created with Sketch.</desc>
    <g id="Page-1" stroke="none" stroke-width="1" fill="none" fill-rule="evenodd" stroke-linecap="round" stroke-linejoin="round">
        <g id="Card" transform="translate(-330.000000, -24.000000)" stroke="#FFFFFF" stroke-width="2">
            <g id="layout">
                <g id="Header-Copy">
                    <g id="Group" transform="translate(15.029297, 21.043945)">
                        <g id="Close_icon" transform="translate(315.970703, 3.956055)">
                            <g id="remove">
                                <path d="M0.625,19.375 L19.375,0.625" id="Shape"></path>
                                <path d="M0.625,0.625 L19.375,19.375" id="Shape"></path>
                            </g>
                        </g>
                    </g>
                </g>
            </g>
        </g>
    </g>
</svg>