-- Merging decision tree log ---
manifest
ADDED from /home/leonardo/AndroidStudioProjects/Agenda/app/src/main/AndroidManifest.xml:2:1-41:12
	package
		ADDED from /home/leonardo/AndroidStudioProjects/Agenda/app/src/main/AndroidManifest.xml:3:5-34
		INJECTED from /home/leonardo/AndroidStudioProjects/Agenda/app/src/main/AndroidManifest.xml
		INJECTED from /home/leonardo/AndroidStudioProjects/Agenda/app/src/main/AndroidManifest.xml
	android:versionName
		INJECTED from /home/leonardo/AndroidStudioProjects/Agenda/app/src/main/AndroidManifest.xml
		INJECTED from /home/leonardo/AndroidStudioProjects/Agenda/app/src/main/AndroidManifest.xml
	xmlns:android
		ADDED from /home/leonardo/AndroidStudioProjects/Agenda/app/src/main/AndroidManifest.xml:2:11-69
	android:versionCode
		INJECTED from /home/leonardo/AndroidStudioProjects/Agenda/app/src/main/AndroidManifest.xml
		INJECTED from /home/leonardo/AndroidStudioProjects/Agenda/app/src/main/AndroidManifest.xml
uses-permission#android.permission.CALL_PHONE
ADDED from /home/leonardo/AndroidStudioProjects/Agenda/app/src/main/AndroidManifest.xml:5:5-69
	android:name
		ADDED from /home/leonardo/AndroidStudioProjects/Agenda/app/src/main/AndroidManifest.xml:5:22-66
application
ADDED from /home/leonardo/AndroidStudioProjects/Agenda/app/src/main/AndroidManifest.xml:7:5-39:22
MERGED from [com.android.support:design:25.2.0] /home/leonardo/.android/build-cache/4b9a0df76dc174b952de49c286197cd408b90da2/output/AndroidManifest.xml:25:5-20
MERGED from [com.android.support:appcompat-v7:25.2.0] /home/leonardo/.android/build-cache/a060d3f942d09714af1fc0a745f09e1d7e0019e9/output/AndroidManifest.xml:25:5-20
MERGED from [com.android.support:animated-vector-drawable:25.2.0] /home/leonardo/.android/build-cache/d7794801d598bc82072506d7852b16761abdb977/output/AndroidManifest.xml:22:5-20
MERGED from [com.android.support:support-vector-drawable:25.2.0] /home/leonardo/.android/build-cache/32bcd9bffa09f26cee7d2e54ac4ae80fbbf91644/output/AndroidManifest.xml:23:5-20
MERGED from [com.android.support:transition:25.2.0] /home/leonardo/.android/build-cache/da2fb7bd5a4781456ac942bf4898fefa9179b4d4/output/AndroidManifest.xml:22:5-20
MERGED from [com.android.support.constraint:constraint-layout:1.0.2] /home/leonardo/.android/build-cache/335aaf4c03abd545b79f5f2fc326537bc5dc51cf/output/AndroidManifest.xml:9:5-20
MERGED from [com.google.android.gms:play-services-maps:10.2.1] /home/leonardo/.android/build-cache/0aa4c5b7be29932dd914076af3da35936dfc9fae/output/AndroidManifest.xml:24:5-19
MERGED from [com.google.android.gms:play-services-base:10.2.1] /home/leonardo/.android/build-cache/fe0f494c8d70722806a34cab9bf41fb1468a33e4/output/AndroidManifest.xml:18:5-20:19
MERGED from [com.google.android.gms:play-services-tasks:10.2.1] /home/leonardo/.android/build-cache/9a9325c73470b58f41a73e70fdfad64df5a6d148/output/AndroidManifest.xml:4:5-19
MERGED from [com.google.android.gms:play-services-basement:10.2.1] /home/leonardo/.android/build-cache/810fd93727d68610180cf00fd298775b4583155a/output/AndroidManifest.xml:19:5-21:19
MERGED from [com.android.support:support-v4:25.2.0] /home/leonardo/.android/build-cache/0f52d35ef7c3dcce83ebbf5a0e2dff45d54a39cf/output/AndroidManifest.xml:25:5-20
MERGED from [com.android.support:support-fragment:25.2.0] /home/leonardo/.android/build-cache/397925acbabfdcc301d6b39dada6ced0818ac7b5/output/AndroidManifest.xml:25:5-20
MERGED from [com.android.support:support-media-compat:25.2.0] /home/leonardo/.android/build-cache/ddf931930990da3060e147fe355815a6e4ad15c6/output/AndroidManifest.xml:25:5-20
MERGED from [com.android.support:support-core-ui:25.2.0] /home/leonardo/.android/build-cache/3876153abcba289860a74c533b0c8770d7a2aa5b/output/AndroidManifest.xml:25:5-20
MERGED from [com.android.support:support-core-utils:25.2.0] /home/leonardo/.android/build-cache/875a804d47acd2e4c1230798c274847c21a6662b/output/AndroidManifest.xml:25:5-20
MERGED from [com.android.support:support-compat:25.2.0] /home/leonardo/.android/build-cache/8841966ca99d7deabb8f65d55f3bfc2ffc57b9a6/output/AndroidManifest.xml:25:5-20
	android:label
		ADDED from /home/leonardo/AndroidStudioProjects/Agenda/app/src/main/AndroidManifest.xml:10:9-41
	android:supportsRtl
		ADDED from /home/leonardo/AndroidStudioProjects/Agenda/app/src/main/AndroidManifest.xml:12:9-35
	android:roundIcon
		ADDED from /home/leonardo/AndroidStudioProjects/Agenda/app/src/main/AndroidManifest.xml:11:9-54
	android:allowBackup
		ADDED from /home/leonardo/AndroidStudioProjects/Agenda/app/src/main/AndroidManifest.xml:8:9-35
	android:icon
		ADDED from /home/leonardo/AndroidStudioProjects/Agenda/app/src/main/AndroidManifest.xml:9:9-43
	android:theme
		ADDED from /home/leonardo/AndroidStudioProjects/Agenda/app/src/main/AndroidManifest.xml:13:9-40
activity#br.com.costa.agenda.utils.SplashScreen
ADDED from /home/leonardo/AndroidStudioProjects/Agenda/app/src/main/AndroidManifest.xml:15:9-24:20
	android:screenOrientation
		ADDED from /home/leonardo/AndroidStudioProjects/Agenda/app/src/main/AndroidManifest.xml:18:13-49
	android:label
		ADDED from /home/leonardo/AndroidStudioProjects/Agenda/app/src/main/AndroidManifest.xml:17:13-45
	android:noHistory
		ADDED from /home/leonardo/AndroidStudioProjects/Agenda/app/src/main/AndroidManifest.xml:19:13-37
	android:name
		ADDED from /home/leonardo/AndroidStudioProjects/Agenda/app/src/main/AndroidManifest.xml:16:13-47
intent-filter#android.intent.action.MAIN+android.intent.category.LAUNCHER
ADDED from /home/leonardo/AndroidStudioProjects/Agenda/app/src/main/AndroidManifest.xml:20:13-23:29
action#android.intent.action.MAIN
ADDED from /home/leonardo/AndroidStudioProjects/Agenda/app/src/main/AndroidManifest.xml:21:17-69
	android:name
		ADDED from /home/leonardo/AndroidStudioProjects/Agenda/app/src/main/AndroidManifest.xml:21:25-66
category#android.intent.category.LAUNCHER
ADDED from /home/leonardo/AndroidStudioProjects/Agenda/app/src/main/AndroidManifest.xml:22:17-77
	android:name
		ADDED from /home/leonardo/AndroidStudioProjects/Agenda/app/src/main/AndroidManifest.xml:22:27-74
activity#br.com.costa.agenda.StudentsListActivity
ADDED from /home/leonardo/AndroidStudioProjects/Agenda/app/src/main/AndroidManifest.xml:26:9-33:20
	android:label
		ADDED from /home/leonardo/AndroidStudioProjects/Agenda/app/src/main/AndroidManifest.xml:28:13-45
	android:name
		ADDED from /home/leonardo/AndroidStudioProjects/Agenda/app/src/main/AndroidManifest.xml:27:13-49
intent-filter#android.intent.action.VIEW+android.intent.category.ALTERNATIVE
ADDED from /home/leonardo/AndroidStudioProjects/Agenda/app/src/main/AndroidManifest.xml:29:13-32:29
action#android.intent.action.VIEW
ADDED from /home/leonardo/AndroidStudioProjects/Agenda/app/src/main/AndroidManifest.xml:30:17-69
	android:name
		ADDED from /home/leonardo/AndroidStudioProjects/Agenda/app/src/main/AndroidManifest.xml:30:25-66
category#android.intent.category.ALTERNATIVE
ADDED from /home/leonardo/AndroidStudioProjects/Agenda/app/src/main/AndroidManifest.xml:31:17-80
	android:name
		ADDED from /home/leonardo/AndroidStudioProjects/Agenda/app/src/main/AndroidManifest.xml:31:27-77
activity#br.com.costa.agenda.StudentsInsertActivity
ADDED from /home/leonardo/AndroidStudioProjects/Agenda/app/src/main/AndroidManifest.xml:35:9-37:79
	android:label
		ADDED from /home/leonardo/AndroidStudioProjects/Agenda/app/src/main/AndroidManifest.xml:37:13-67
	android:name
		ADDED from /home/leonardo/AndroidStudioProjects/Agenda/app/src/main/AndroidManifest.xml:36:13-51
uses-sdk
INJECTED from /home/leonardo/AndroidStudioProjects/Agenda/app/src/main/AndroidManifest.xml reason: use-sdk injection requested
MERGED from [com.android.support:design:25.2.0] /home/leonardo/.android/build-cache/4b9a0df76dc174b952de49c286197cd408b90da2/output/AndroidManifest.xml:21:5-23:62
MERGED from [com.android.support:appcompat-v7:25.2.0] /home/leonardo/.android/build-cache/a060d3f942d09714af1fc0a745f09e1d7e0019e9/output/AndroidManifest.xml:21:5-23:78
MERGED from [com.android.support:animated-vector-drawable:25.2.0] /home/leonardo/.android/build-cache/d7794801d598bc82072506d7852b16761abdb977/output/AndroidManifest.xml:20:5-44
MERGED from [com.android.support:support-vector-drawable:25.2.0] /home/leonardo/.android/build-cache/32bcd9bffa09f26cee7d2e54ac4ae80fbbf91644/output/AndroidManifest.xml:21:5-43
MERGED from [com.android.support:recyclerview-v7:25.2.0] /home/leonardo/.android/build-cache/88e25f4eb5342fba79919ec63d0d7c083841c6b1/output/AndroidManifest.xml:20:5-43
MERGED from [com.android.support:transition:25.2.0] /home/leonardo/.android/build-cache/da2fb7bd5a4781456ac942bf4898fefa9179b4d4/output/AndroidManifest.xml:20:5-44
MERGED from [com.android.support.constraint:constraint-layout:1.0.2] /home/leonardo/.android/build-cache/335aaf4c03abd545b79f5f2fc326537bc5dc51cf/output/AndroidManifest.xml:5:5-7:41
MERGED from [com.google.android.gms:play-services-maps:10.2.1] /home/leonardo/.android/build-cache/0aa4c5b7be29932dd914076af3da35936dfc9fae/output/AndroidManifest.xml:23:5-43
MERGED from [com.google.android.gms:play-services-base:10.2.1] /home/leonardo/.android/build-cache/fe0f494c8d70722806a34cab9bf41fb1468a33e4/output/AndroidManifest.xml:17:5-43
MERGED from [com.google.android.gms:play-services-tasks:10.2.1] /home/leonardo/.android/build-cache/9a9325c73470b58f41a73e70fdfad64df5a6d148/output/AndroidManifest.xml:3:5-43
MERGED from [com.google.android.gms:play-services-basement:10.2.1] /home/leonardo/.android/build-cache/810fd93727d68610180cf00fd298775b4583155a/output/AndroidManifest.xml:17:5-43
MERGED from [com.android.support:support-v4:25.2.0] /home/leonardo/.android/build-cache/0f52d35ef7c3dcce83ebbf5a0e2dff45d54a39cf/output/AndroidManifest.xml:21:5-23:54
MERGED from [com.android.support:support-fragment:25.2.0] /home/leonardo/.android/build-cache/397925acbabfdcc301d6b39dada6ced0818ac7b5/output/AndroidManifest.xml:21:5-23:60
MERGED from [com.android.support:support-media-compat:25.2.0] /home/leonardo/.android/build-cache/ddf931930990da3060e147fe355815a6e4ad15c6/output/AndroidManifest.xml:21:5-23:63
MERGED from [com.android.support:support-core-ui:25.2.0] /home/leonardo/.android/build-cache/3876153abcba289860a74c533b0c8770d7a2aa5b/output/AndroidManifest.xml:21:5-23:58
MERGED from [com.android.support:support-core-utils:25.2.0] /home/leonardo/.android/build-cache/875a804d47acd2e4c1230798c274847c21a6662b/output/AndroidManifest.xml:21:5-23:61
MERGED from [com.android.support:support-compat:25.2.0] /home/leonardo/.android/build-cache/8841966ca99d7deabb8f65d55f3bfc2ffc57b9a6/output/AndroidManifest.xml:21:5-23:58
	tools:overrideLibrary
		ADDED from [com.android.support:design:25.2.0] /home/leonardo/.android/build-cache/4b9a0df76dc174b952de49c286197cd408b90da2/output/AndroidManifest.xml:23:9-59
	android:targetSdkVersion
		INJECTED from /home/leonardo/AndroidStudioProjects/Agenda/app/src/main/AndroidManifest.xml
		INJECTED from /home/leonardo/AndroidStudioProjects/Agenda/app/src/main/AndroidManifest.xml
	android:minSdkVersion
		INJECTED from /home/leonardo/AndroidStudioProjects/Agenda/app/src/main/AndroidManifest.xml
		INJECTED from /home/leonardo/AndroidStudioProjects/Agenda/app/src/main/AndroidManifest.xml
uses-permission#android.permission.ACCESS_NETWORK_STATE
ADDED from [com.google.android.gms:play-services-maps:10.2.1] /home/leonardo/.android/build-cache/0aa4c5b7be29932dd914076af3da35936dfc9fae/output/AndroidManifest.xml:19:5-78
	android:name
		ADDED from [com.google.android.gms:play-services-maps:10.2.1] /home/leonardo/.android/build-cache/0aa4c5b7be29932dd914076af3da35936dfc9fae/output/AndroidManifest.xml:19:22-76
uses-permission#android.permission.INTERNET
ADDED from [com.google.android.gms:play-services-maps:10.2.1] /home/leonardo/.android/build-cache/0aa4c5b7be29932dd914076af3da35936dfc9fae/output/AndroidManifest.xml:20:5-66
	android:name
		ADDED from [com.google.android.gms:play-services-maps:10.2.1] /home/leonardo/.android/build-cache/0aa4c5b7be29932dd914076af3da35936dfc9fae/output/AndroidManifest.xml:20:22-64
uses-feature#0x00020000
ADDED from [com.google.android.gms:play-services-maps:10.2.1] /home/leonardo/.android/build-cache/0aa4c5b7be29932dd914076af3da35936dfc9fae/output/AndroidManifest.xml:21:5-77
	android:glEsVersion
		ADDED from [com.google.android.gms:play-services-maps:10.2.1] /home/leonardo/.android/build-cache/0aa4c5b7be29932dd914076af3da35936dfc9fae/output/AndroidManifest.xml:21:19-51
	android:required
		ADDED from [com.google.android.gms:play-services-maps:10.2.1] /home/leonardo/.android/build-cache/0aa4c5b7be29932dd914076af3da35936dfc9fae/output/AndroidManifest.xml:21:52-75
activity#com.google.android.gms.common.api.GoogleApiActivity
ADDED from [com.google.android.gms:play-services-base:10.2.1] /home/leonardo/.android/build-cache/fe0f494c8d70722806a34cab9bf41fb1468a33e4/output/AndroidManifest.xml:19:9-172
	android:exported
		ADDED from [com.google.android.gms:play-services-base:10.2.1] /home/leonardo/.android/build-cache/fe0f494c8d70722806a34cab9bf41fb1468a33e4/output/AndroidManifest.xml:19:146-170
	android:theme
		ADDED from [com.google.android.gms:play-services-base:10.2.1] /home/leonardo/.android/build-cache/fe0f494c8d70722806a34cab9bf41fb1468a33e4/output/AndroidManifest.xml:19:86-145
	android:name
		ADDED from [com.google.android.gms:play-services-base:10.2.1] /home/leonardo/.android/build-cache/fe0f494c8d70722806a34cab9bf41fb1468a33e4/output/AndroidManifest.xml:19:19-85
meta-data#com.google.android.gms.version
ADDED from [com.google.android.gms:play-services-basement:10.2.1] /home/leonardo/.android/build-cache/810fd93727d68610180cf00fd298775b4583155a/output/AndroidManifest.xml:20:9-121
	android:value
		ADDED from [com.google.android.gms:play-services-basement:10.2.1] /home/leonardo/.android/build-cache/810fd93727d68610180cf00fd298775b4583155a/output/AndroidManifest.xml:20:66-119
	android:name
		ADDED from [com.google.android.gms:play-services-basement:10.2.1] /home/leonardo/.android/build-cache/810fd93727d68610180cf00fd298775b4583155a/output/AndroidManifest.xml:20:20-65
