result,data,num_ativos,lista_ativos,oper_ativos,volatilidade
0.9322293821885065,"Jan 04, 2010","9","['CYRE3', 'LREN3', 'MRVE3', 'USIM5', 'BRKM5', 'VALE3', 'ITSA4', 'DTEX3', 'TRPL4']","[1.5, 1.5, 1.25, 1.0, 0.75, 0.5, 0.5, 0.5, 0.5]","nan"
1.016193796859866,"Feb 01, 2010","9","['BTOW3', 'MMXM3', 'ELET3', 'EMBR3', 'CPFE3', 'ITSA4', 'USIM3', 'MRVE3', 'CSAN3']","[0.375, 0.25, 0.25, 0.25, 0.25, 0.0, 0.0, 0.0, 0.0]","0.000768721990159044"
1.113640893016646,"Mar 01, 2010","9","['PETR3', 'RDCD3', 'BRAP4', 'GOAU4', 'USIM3', 'PETR4', 'USIM5', 'VALE3', 'MMXM3']","[1.75, 1.75, 1.75, 1.75, 1.75, 1.5, 1.5, 1.25, 0.25]","0.0005592910437167393"
0.9636855935055253,"Apr 01, 2010","9","['VALE3', 'GGBR4', 'BRAP4', 'EMBR3', 'BBAS3', 'GFSA3', 'MMXM3', 'RSID3', 'DTEX3']","[0.375, 0.25, 0.25, 0.25, 0.0, 0.0, 0.0, 0.0, 0.0]","0.0007341695935497158"
0.9351500022973188,"May 03, 2010","9","['GGBR4', 'SBSP3', 'RDCD3', 'ELET3', 'GOAU4', 'ABEV3', 'ELET6', 'JBSS3', 'KLBN4']","[0.25, 0.25, 0.0, 0.0, 0.0, 0.0, 0.0, 0.0, 0.0]","nan"
1.0588064045448,"Jun 01, 2010","9","['RSID3', 'MRVE3', 'BRFS3', 'LIGT3', 'LREN3', 'CMIG4', 'ABEV3', 'CPFE3', 'TIMP3']","[1.75, 1.5, 1.0, 0.75, 0.25, 0.0, 0.0, 0.0, 0.0]","0.00032870975569065865"
1.0836887527518835,"Jul 01, 2010","9","['PDGR3', 'LAME4', 'CPFE3', 'TRPL4', 'TIMP3', 'LIGT3', 'BRAP4', 'GOAU4', 'CSNA3']","[2.0, 1.75, 0.5, 0.25, 0.25, 0.0, 0.0, 0.0, 0.0]","0.0035598705726660154"
0.9876126354810163,"Aug 02, 2010","9","['CMIG4', 'DTEX3', 'PETR4', 'ABEV3', 'CPFE3', 'BRKM5', 'RSID3', 'GGBR4', 'ITSA4']","[2.0, 1.0, 1.0, 0.25, 0.25, 0.25, 0.25, 0.25, 0.25]","0.0002987436509735124"
1.0688646623066937,"Sep 01, 2010","9","['BTOW3', 'GOAU4', 'PETR4', 'PDGR3', 'CSAN3', 'GOLL4', 'VALE3', 'EMBR3', 'GGBR4']","[1.75, 0.5, 0.5, 0.25, 0.0, 0.0, 0.0, 0.0, 0.0]","0.0008273629206097541"
1.0374625641328246,"Oct 01, 2010","9","['BRFS3', 'USIM5', 'BRAP4', 'GOLL4', 'BRKM5', 'MRVE3', 'RSID3', 'LAME4', 'EMBR3']","[2.0, 1.5, 0.25, 0.25, 0.25, 0.25, 0.25, 0.25, 0.25]","0.00026761983065722516"
0.9972843914602393,"Nov 01, 2010","9","['CESP6', 'BRAP4', 'ABEV3', 'CCRO3', 'ELET6', 'DTEX3', 'ELET3', 'GOLL4', 'BRKM5']","[1.25, 0.75, 0.25, 0.25, 0.25, 0.25, 0.25, 0.25, 0.25]","nan"
0.9781922517740742,"Dec 01, 2010","9","['ABEV3', 'BRKM5', 'USIM5', 'BTOW3', 'LREN3', 'TIMP3', 'GOLL4', 'BBAS3', 'LAME4']","[0.25, 0.25, 0.25, 0.0, 0.0, 0.0, 0.0, 0.0, 0.0]","0.000175978776846817"
0.9624679196845776,"Jan 03, 2011","9","['CCRO3', 'GOAU4', 'CSAN3', 'BRKM5', 'CMIG4', 'GGBR4', 'BRFS3', 'KLBN4', 'SBSP3']","[2.0, 2.0, 1.0, 1.0, 0.75, 0.75, 0.375, 0.375, 0.25]","9.764612164190628e-05"
0.9968339826446808,"Feb 01, 2011","9","['CESP6', 'SANB11', 'RDCD3', 'SBSP3', 'GOAU4', 'CPLE6', 'GFSA3', 'LREN3', 'BTOW3']","[2.0, 1.625, 1.5, 1.0, 1.0, 0.75, 0.625, 0.375, 0.375]","8.7094469145642e-05"
1.043046503543541,"Mar 01, 2011","9","['ITSA4', 'KLBN4', 'SANB11', 'RDCD3', 'LIGT3', 'PETR3', 'DTEX3', 'TIMP3', 'USIM3']","[1.75, 1.625, 1.5, 1.0, 0.75, 0.625, 0.5, 0.25, 0.25]","7.124695589319121e-05"
0.9758611001032268,"Apr 04, 2011","9","['CCRO3', 'DTEX3', 'GOLL4', 'MMXM3', 'LREN3', 'TIMP3', 'USIM3', 'LIGT3', 'ELET6']","[2.75, 1.875, 1.75, 1.75, 0.25, 0.25, 0.25, 0.25, 0.25]","0.00014460087052871364"
1.0150192700724803,"May 02, 2011","9","['BBAS3', 'JBSS3', 'USIM5', 'SBSP3', 'CPFE3', 'TIMP3', 'CCRO3', 'CESP6', 'BRKM5']","[1.5, 0.625, 0.375, 0.25, 0.25, 0.25, 0.25, 0.25, 0.25]","0.00012817938014288076"
0.9822532522281849,"Jun 01, 2011","9","['LREN3', 'CSAN3', 'CYRE3', 'TIMP3', 'MRVE3', 'CIEL3', 'ABEV3', 'BTOW3', 'MRFG3']","[2.0, 1.75, 1.75, 0.25, 0.25, 0.25, 0.0, 0.0, 0.0]","0.00011318815537518048"
0.9216970257828019,"Jul 01, 2011","9","['RDCD3', 'ITUB4', 'TIMP3', 'LREN3', 'BBDC4', 'ITSA4', 'GFSA3', 'LIGT3', 'BTOW3']","[2.0, 1.5, 1.25, 1.25, 1.0, 1.0, 0.75, 0.5, 0.25]","5.3079109172893095e-05"
0.8948196011148818,"Aug 01, 2011","9","['PETR3', 'JBSS3', 'CPLE6', 'BRKM5', 'MRFG3', 'BRFS3', 'MMXM3', 'PETR4', 'CPFE3']","[1.5, 0.75, 0.625, 0.25, 0.25, 0.0, 0.0, 0.0, -0.25]","0.00016374358706999678"
0.8887231953736626,"Sep 01, 2011","9","['TIMP3', 'SANB11', 'RSID3', 'GGBR4', 'BTOW3', 'BRKM5', 'KLBN4', 'USIM3', 'BRFS3']","[2.0, 1.75, 1.75, 1.75, 1.5, 1.5, 1.5, 0.25, 0.25]","9.761274609734456e-05"
1.1346681051407004,"Oct 03, 2011","9","['PCAR4', 'EMBR3', 'LIGT3', 'CSAN3', 'GOAU4', 'BRFS3', 'RDCD3', 'CSNA3', 'GGBR4']","[1.75, 1.25, 0.25, 0.25, 0.25, 0.25, 0.25, 0.25, 0.25]","9.609225762355092e-05"
1.2732507731066989,"Jun 01, 2016","9","['ELET3', 'OIBR3', 'PCAR4', 'RADL3', 'EQTL3', 'CSAN3', 'QUAL3', 'ECOR3', 'ABEV3']","[1.75, 1.5, 1.375, 0.25, 0.25, 0.25, 0.25, 0.25, 0.0]","0.00027035893761098094"
1.151145772774627,"Jul 01, 2016","9","['CPFE3', 'VIVT4', 'MRVE3', 'LREN3', 'SBSP3', 'LAME4', 'QUAL3', 'BBDC4', 'PETR4']","[2.0, 1.0, 1.0, 0.25, 0.25, 0.25, 0.25, 0.0, 0.0]","0.0003377408470551341"
1.0322391868216543,"Aug 01, 2016","9","['HYPE3', 'GGBR4', 'CSNA3', 'BBAS3', 'ENBR3', 'WEGE3', 'BRAP4', 'GOAU4', 'LREN3']","[1.125, 1.125, 1.125, 1.0, 0.75, 0.625, 0.5, 0.5, 0.25]","0.0006314622579304185"
0.9831825249623687,"Sep 01, 2016","9","['BRFS3', 'UGPA3', 'VIVT4', 'WEGE3', 'PCAR4', 'KLBN11', 'TIMP3', 'GGBR4', 'QUAL3']","[0.25, 0.25, 0.25, 0.25, 0.25, 0.25, 0.25, 0.25, 0.25]","0.00026857916172733055"
1.1510629710575042,"Oct 03, 2016","9","['CSNA3', 'VALE3', 'ITUB4', 'ABEV3', 'BBAS3', 'BBSE3', 'CESP6', 'BBDC4', 'PETR4']","[1.75, 1.5, 1.25, 1.25, 1.25, 1.25, 1.25, 0.25, 0.25]","0.0007748506383349612"
0.8806947630142782,"Nov 01, 2016","9","['TIMP3', 'MRVE3', 'PETR4', 'ECOR3', 'LREN3', 'LAME4', 'BRML3', 'BRKM5', 'CSAN3']","[2.0, 1.25, 1.0, 0.375, 0.25, 0.25, 0.25, 0.25, 0.25]","0.000388583223110702"
0.9606940313763352,"Dec 01, 2016","9","['GOAU4', 'GGBR4', 'CSNA3', 'BRAP4', 'BBAS3', 'SANB11', 'USIM5', 'CPFE3', 'BBDC4']","[1.0, 0.5, 0.5, 0.5, 0.25, 0.25, 0.25, 0.125, 0.0]","0.001335191194454892"
1.051837202499723,"Jan 02, 2017","9","['BBAS3', 'PCAR4', 'MULT3', 'ECOR3', 'JBSS3', 'LAME4', 'CYRE3', 'BRKM5', 'KLBN11']","[1.75, 1.5, 1.5, 1.5, 1.25, 1.0, 0.5, 0.25, 0.25]","0.00024904025187212956"
1.0265763621825363,"Feb 01, 2017","9","['BBSE3', 'WEGE3', 'TIMP3', 'BBDC4', 'BBDC3', 'HYPE3', 'ITUB4', 'SBSP3', 'VALE3']","[2.75, 2.0, 1.75, 1.0, 1.0, 1.0, 0.75, 0.75, 0.25]","0.00039497386611487683"
0.9725543277522353,"Mar 01, 2017","9","['BBAS3', 'CMIG4', 'ITSA4', 'ABEV3', 'BRML3', 'BBDC3', 'CCRO3', 'ITUB4', 'BBDC4']","[1.25, 1.25, 1.125, 0.75, 0.75, 0.5, 0.5, 0.25, 0.25]","0.00039057612090531236"
1.0532381309771728,"Apr 03, 2017","9","['MULT3', 'PCAR4', 'EGIE3', 'JBSS3', 'ABEV3', 'TIMP3', 'RENT3', 'MRVE3', 'ITUB4']","[1.75, 1.25, 1.0, 0.75, 0.25, 0.25, 0.25, 0.25, 0.0]","0.00019938803243510015"
0.9545982755502307,"Jul 01, 2015","9","['ITUB4', 'BBDC4', 'ITSA4', 'TIMP3', 'BBSE3', 'BRFS3', 'ABEV3', 'PETR4', 'JBSS3']","[1.75, 1.75, 1.75, 1.25, 1.0, 0.25, 0.0, 0.0, 0.0]","0.0001319102965804195"
0.9053002372771602,"Aug 03, 2015","9","['ENBR3', 'CIEL3', 'KLBN11', 'BRPR3', 'BBDC3', 'TIMP3', 'SANB11', 'SBSP3', 'BBDC4']","[0.375, 0.25, 0.25, 0.25, 0.0, 0.0, 0.0, 0.0, -0.25]","0.00012597967438448843"
1.0434203537184932,"Sep 01, 2015","9","['CMIG4', 'MRFG3', 'OIBR4', 'BRFS3', 'KLBN11', 'ENBR3', 'GFSA3', 'CIEL3', 'JBSS3']","[0.75, 0.25, 0.25, 0.0, 0.0, 0.0, 0.0, -0.25, -0.25]","0.00014155018912009854"
1.0277151961078541,"Oct 01, 2015","9","['BRFS3', 'EMBR3', 'CSNA3', 'BBDC4', 'ITSA4', 'BBSE3', 'BBDC3', 'SANB11', 'BRML3']","[1.75, 1.75, 1.75, 0.75, 0.75, 0.75, 0.75, 0.75, 0.75]","0.0002481231800706555"
1.0334174579226505,"Nov 03, 2015","9","['HYPE3', 'ABEV3', 'UGPA3', 'KLBN11', 'CSNA3', 'MULT3', 'BRPR3', 'DTEX3', 'ELET6']","[1.75, 0.25, 0.25, 0.25, 0.25, 0.25, 0.25, 0.25, 0.25]","0.00020277992533563737"
0.9331599663680279,"Dec 01, 2015","9","['ITUB4', 'GGBR4', 'HYPE3', 'GOAU4', 'SBSP3', 'KLBN11', 'SANB11', 'BRML3', 'CPFE3']","[2.0, 1.0, 0.875, 0.75, 0.5, 0.25, 0.25, 0.25, 0.25]","0.00026727169509528105"
0.9833921354736334,"Jan 04, 2016","9","['USIM5', 'SANB11', 'CCRO3', 'EQTL3', 'SBSP3', 'BRML3', 'CPFE3', 'CSAN3', 'ENBR3']","[0.75, 0.25, 0.0, 0.0, 0.0, 0.0, 0.0, 0.0, 0.0]","0.0002249859938946891"
1.125309259215471,"Feb 01, 2016","9","['HYPE3', 'USIM5', 'BRKM5', 'VIVT4', 'BBDC3', 'CSAN3', 'CSNA3', 'CESP6', 'MRFG3']","[1.75, 0.375, 0.0, -0.25, -0.25, -0.25, -0.25, -0.25, -0.25]","0.00017515822049664283"
1.18889960475767,"Mar 01, 2016","9","['ABEV3', 'CYRE3', 'ELET3', 'PETR4', 'UGPA3', 'BRFS3', 'BBAS3', 'LAME4', 'RADL3']","[2.0, 1.25, 1.25, 1.0, 0.5, 0.25, 0.25, 0.25, 0.25]","0.00019948409297021694"
1.0492376924160185,"Apr 01, 2016","9","['UGPA3', 'OIBR3', 'ABEV3', 'RADL3', 'GGBR4', 'ITUB4', 'BBDC4', 'PETR4', 'CIEL3']","[1.25, 0.75, 0.375, 0.375, 0.375, 0.25, 0.25, 0.25, 0.25]","0.00045284614808711193"
0.8324391583100449,"May 02, 2016","9","['TIMP3', 'PETR3', 'BBDC4', 'PETR4', 'ITSA4', 'VALE3', 'BBSE3', 'BBAS3', 'BBDC3']","[2.0, 0.625, 0.25, 0.25, 0.25, 0.25, 0.25, 0.25, 0.25]","0.0009271308983107801"
1.0207838237407327,"Nov 01, 2011","9","['PETR3', 'BBAS3', 'GGBR4', 'USIM5', 'CESP6', 'TIMP3', 'CMIG4', 'CPFE3', 'ITUB4']","[1.75, 1.75, 1.75, 1.75, 1.5, 1.25, 1.0, 0.75, 0.625]","0.00024372237450996547"
1.0017266937878997,"Dec 01, 2011","7","['USIM5', 'MRVE3', 'USIM3', 'CPFE3', 'TRPL4', 'HYPE3', 'BRAP4']","[2.75, 1.0, 0.375, 0.25, -0.25, -0.25, -1.75]","0.006295409921406224"
1.0997791114637714,"Jan 02, 2012","9","['BBAS3', 'MMXM3', 'CSNA3', 'CPLE6', 'EMBR3', 'ELET6', 'GFSA3', 'CMIG4', 'SBSP3']","[1.75, 1.75, 1.5, 1.0, 1.0, 0.75, 0.625, 0.5, 0.25]","0.0002535245661839582"
1.0518488025198167,"Feb 01, 2012","9","['BRKM5', 'PDGR3', 'BRML3', 'JBSS3', 'USIM5', 'PCAR4', 'LREN3', 'DTEX3', 'GOAU4']","[2.875, 2.5, 2.25, 2.0, 2.0, 0.75, 0.75, 0.25, 0.25]","0.0002857349994070099"
0.9598261860486699,"Mar 01, 2012","9","['GOLL4', 'RDCD3', 'CESP6', 'BRAP4', 'BTOW3', 'CSAN3', 'BRKM5', 'ELET3', 'DTEX3']","[1.75, 0.5, 0.25, 0.25, 0.25, 0.25, 0.25, 0.25, 0.25]","0.000209510460005301"
0.9814871248192014,"Apr 02, 2012","9","['CCRO3', 'SANB11', 'PCAR4', 'ABEV3', 'PETR4', 'UGPA3', 'VIVT4', 'MRFG3', 'HYPE3']","[1.0, 1.0, 0.75, 0.75, 0.75, 0.25, 0.25, 0.25, 0.25]","0.00024035315893618285"
0.8311715929770438,"May 02, 2012","9","['BRML3', 'RSID3', 'MRVE3', 'PDGR3', 'GFSA3', 'SBSP3', 'PCAR4', 'UGPA3', 'DTEX3']","[1.75, 1.75, 0.75, 0.75, 0.625, 0.5, 0.25, 0.25, 0.25]","0.00027308537810804754"
1.036387804438124,"Jun 01, 2012","9","['GOLL4', 'RSID3', 'MRVE3', 'GFSA3', 'CSNA3', 'SBSP3', 'CMIG4', 'EMBR3', 'CCRO3']","[0.75, 0.625, 0.625, 0.625, 0.25, 0.0, 0.0, 0.0, 0.0]","0.00024500654297965454"
1.0487657387515732,"Jul 02, 2012","9","['UGPA3', 'BBDC4', 'OIBR4', 'CCRO3', 'ABEV3', 'LIGT3', 'CSAN3', 'BRAP4', 'ELET6']","[2.0, 2.0, 1.0, 0.25, 0.0, 0.0, 0.0, 0.0, 0.0]","0.0001305691105195186"
1.027657944543181,"Aug 01, 2012","9","['ABEV3', 'RENT3', 'BBDC4', 'LREN3', 'LAME4', 'UGPA3', 'GOAU4', 'BTOW3', 'HYPE3']","[2.0, 2.0, 2.0, 1.5, 0.625, 0.375, 0.25, 0.25, 0.25]","0.0003131552062019331"
1.0999403659612395,"Sep 03, 2012","9","['PCAR4', 'GFSA3', 'MRFG3', 'USIM3', 'LREN3', 'RENT3', 'BRML3', 'BRFS3', 'BTOW3']","[0.75, 0.5, 0.375, 0.25, 0.25, 0.25, 0.25, 0.25, 0.25]","0.0001624111058718356"
0.9447101974956129,"May 02, 2017","9","['ITSA4', 'BBDC4', 'VIVT4', 'WEGE3', 'ITUB4', 'ABEV3', 'CIEL3', 'HYPE3', 'MRVE3']","[1.75, 1.5, 1.25, 1.25, 1.0, 0.25, 0.25, 0.25, 0.25]","0.00011066529002075597"
1.01435935524964,"Jun 01, 2017","9","['BRKM5', 'GGBR4', 'ITSA4', 'PCAR4', 'CPFE3', 'QUAL3', 'GOAU4', 'KLBN11', 'ABEV3']","[2.0, 1.75, 1.5, 1.25, 1.125, 1.0, 1.0, 0.75, 0.25]","0.0002123975672073262"
1.0601835857831576,"Jul 03, 2017","9","['ENBR3', 'VALE3', 'ITUB4', 'GGBR4', 'QUAL3', 'GOAU4', 'BBDC4', 'CIEL3', 'BBDC3']","[1.75, 1.25, 1.0, 1.0, 0.25, 0.25, 0.0, 0.0, 0.0]","0.00021739809271158314"
1.067743809585896,"Aug 01, 2017","9","['LAME4', 'CSAN3', 'CCRO3', 'MULT3', 'ITUB4', 'BBDC4', 'ITSA4', 'LREN3', 'BBDC3']","[2.0, 2.0, 1.25, 0.375, 0.25, 0.25, 0.25, 0.25, 0.25]","0.0001564511768532811"
1.0559643235605747,"Sep 01, 2017","9","['CMIG4', 'UGPA3', 'CCRO3', 'PETR4', 'BBDC4', 'PETR3', 'LREN3', 'BBDC3', 'HYPE3']","[1.75, 1.0, 0.75, 0.5, 0.25, 0.25, 0.25, 0.25, 0.25]","0.00010591553282930581"
1.018447318520625,"Oct 02, 2017","9","['BBAS3', 'MRFG3', 'CMIG4', 'ITUB4', 'BBDC4', 'PETR4', 'PETR3', 'BRFS3', 'UGPA3']","[0.75, 0.625, 0.5, 0.25, 0.25, 0.25, 0.25, 0.25, 0.25]","0.00011000163975402752"
0.9198289405040866,"Nov 01, 2017","9","['PETR4', 'ELET3', 'UGPA3', 'CCRO3', 'HYPE3', 'PCAR4', 'USIM5', 'ECOR3', 'ABEV3']","[1.25, 0.75, 0.25, 0.25, 0.25, 0.25, 0.25, 0.25, 0.0]","0.0002217895941895675"
1.0494913004670412,"Dec 01, 2017","9","['GGBR4', 'ABEV3', 'MRFG3', 'RADL3', 'QUAL3', 'BRFS3', 'CIEL3', 'SANB11', 'ECOR3']","[1.875, 1.75, 1.75, 1.125, 0.625, 0.25, 0.25, 0.25, 0.25]","8.490928444408524e-05"
1.063727935772251,"Jan 02, 2018","9","['USIM5', 'EQTL3', 'TAEE11', 'CYRE3', 'BRML3', 'ELET6', 'LREN3', 'MULT3', 'ABEV3']","[3.0, 2.0, 2.0, 2.0, 1.75, 1.75, 1.5, 1.5, 1.25]","0.0001978710095333391"
0.9740286561658835,"Feb 01, 2018","9","['SMLS3', 'CPLE6', 'CSAN3', 'CYRE3', 'LREN3', 'PCAR4', 'LAME4', 'BRKM5', 'MULT3']","[2.0, 2.0, 1.0, 1.0, 0.25, 0.25, 0.25, 0.25, 0.25]","0.00016549338055270318"
0.9715175196822441,"Mar 01, 2018","9","['ELET6', 'EQTL3', 'PETR4', 'PETR3', 'USIM5', 'ABEV3', 'ITSA4', 'JBSS3', 'RAIL3']","[1.0, 0.75, 0.625, 0.5, 0.5, 0.25, 0.25, 0.25, 0.25]","0.0003787832895152271"
0.9925152093296442,"Oct 01, 2012","9","['CSAN3', 'LREN3', 'GOAU4', 'DTEX3', 'BRKM5', 'LAME4', 'GOLL4', 'MRFG3', 'CSNA3']","[0.375, 0.25, 0.25, 0.25, 0.25, 0.25, 0.25, 0.25, 0.25]","0.00027155205941513226"
1.0203652801585172,"Nov 01, 2012","9","['BRAP4', 'DASA3', 'USIM3', 'CYRE3', 'CPLE6', 'MRVE3', 'CPFE3', 'EMBR3', 'BRFS3']","[1.75, 1.25, 1.0, 1.0, 0.75, 0.375, 0.25, 0.25, 0.25]","0.00019260807186929194"
1.0296028959127308,"Dec 03, 2012","9","['CYRE3', 'BRML3', 'SANB11', 'KLBN4', 'CCRO3', 'PCAR4', 'RENT3', 'EMBR3', 'TIMP3']","[1.75, 1.5, 1.0, 0.25, 0.25, 0.0, 0.0, 0.0, 0.0]","0.00019125737358319047"
1.0532337484599366,"Dec 28, 2012","9","['UGPA3', 'ELET6', 'SANB11', 'SBSP3', 'EMBR3', 'CYRE3', 'VIVT4', 'GOAU4', 'CPLE6']","[1.75, 1.75, 1.75, 1.5, 1.5, 1.5, 1.125, 0.75, 0.5]","8.639892385989971e-05"
0.9771479702263309,"Feb 01, 2013","9","['LREN3', 'PETR3', 'PETR4', 'TRPL4', 'SBSP3', 'UGPA3', 'VIVT4', 'ABEV3', 'BRFS3']","[1.75, 1.0, 1.0, 0.25, 0.25, 0.25, 0.25, 0.25, 0.25]","0.001767463062052808"
0.9976535687212098,"Mar 01, 2013","9","['BBAS3', 'CIEL3', 'ITSA4', 'TRPL4', 'SBSP3', 'UGPA3', 'BRKM5', 'CESP6', 'RENT3']","[1.875, 1.5, 0.5, 0.25, 0.25, 0.25, 0.25, 0.0, 0.0]","0.0018422109208777785"
0.9945882590587453,"Mar 28, 2013","9","['TIMP3', 'PCAR4', 'VIVT4', 'EMBR3', 'BBAS3', 'ITUB4', 'CESP6', 'UGPA3', 'RENT3']","[1.5, 0.25, 0.25, 0.25, 0.25, 0.25, 0.0, 0.0, 0.0]","7.647499488016072e-05"
0.9768506672668472,"May 02, 2013","9","['RENT3', 'UGPA3', 'PETR3', 'USIM3', 'KLBN4', 'GOLL4', 'BBDC4', 'PDGR3', 'ELET6']","[1.75, 0.5, 0.25, 0.0, 0.0, 0.0, 0.0, -0.125, -0.25]","0.00012259003339339043"
0.917588980876768,"Jun 03, 2013","9","['CIEL3', 'CSNA3', 'UGPA3', 'ELET6', 'BBDC4', 'ITUB4', 'TIMP3', 'GGBR4', 'USIM5']","[1.25, 0.625, 0.25, 0.0, 0.0, 0.0, 0.0, -0.25, -0.25]","4.2109309132354134e-05"
0.9790052256815416,"Jul 01, 2013","9","['LREN3', 'EMBR3', 'TRPL4', 'CPFE3', 'ENBR3', 'ELET6', 'MRFG3', 'ELET3', 'RSID3']","[0.75, 0.25, 0.0, 0.0, 0.0, 0.0, 0.0, 0.0, 0.0]","0.0002411420410012084"
1.0375666477175352,"Aug 01, 2013","9","['TRPL4', 'KLBN4', 'TIMP3', 'RSID3', 'CIEL3', 'DASA3', 'CMIG4', 'CCRO3', 'MMXM3']","[1.5, 1.5, 1.25, 1.0, 0.25, 0.25, 0.125, 0.125, 0.125]","0.00016776611598805596"
1.0076695512019744,"Apr 02, 2018","9","['EQTL3', 'TAEE11', 'ABEV3', 'PETR4', 'PETR3', 'RENT3', 'EGIE3', 'CMIG4', 'MGLU3']","[2.0, 1.25, 0.25, 0.25, 0.25, 0.25, 0.25, 0.25, 0.25]","0.00016806779087132203"
0.9191156416253904,"May 02, 2018","9","['VALE3', 'CMIG4', 'SMLS3', 'PETR4', 'PETR3', 'SANB11', 'LAME4', 'KLBN11', 'TAEE11']","[2.125, 1.75, 1.75, 0.25, 0.25, 0.25, 0.25, 0.25, 0.25]","0.00016453911657910187"
0.9881341556330773,"Jun 01, 2018","9","['BRAP4', 'CSNA3', 'BBDC3', 'WEGE3', 'SUZB3', 'MGLU3', 'MRFG3', 'BRFS3', 'JBSS3']","[1.0, 0.75, 0.375, 0.25, 0.25, 0.25, 0.25, 0.0, 0.0]","0.0002677323916389419"
1.0295900256619603,"Jul 02, 2018","9","['PCAR4', 'FLRY3', 'EMBR3', 'JBSS3', 'BRKM5', 'MGLU3', 'VALE3', 'SUZB3', 'RADL3']","[2.0, 1.0, 0.25, 0.25, 0.25, 0.25, 0.0, 0.0, 0.0]","0.00020577501376735472"
0.9304759895210893,"Aug 01, 2018","9","['WEGE3', 'LAME4', 'BRML3', 'MULT3', 'GOAU4', 'ELET3', 'LREN3', 'PCAR4', 'QUAL3']","[2.0, 2.0, 2.0, 2.0, 2.0, 2.0, 1.75, 1.75, 1.75]","0.00015021486303680966"
1.0006045091911024,"Sep 03, 2018","9","['WEGE3', 'TIMP3', 'CIEL3', 'KLBN11', 'EMBR3', 'BRKM5', 'VALE3', 'PCAR4', 'HYPE3']","[1.75, 1.75, 1.5, 1.25, 0.5, 0.5, 0.25, 0.25, 0.25]","6.64586069757496e-05"
1.1598139534852823,"Oct 01, 2018","9","['LAME4', 'MULT3', 'BBAS3', 'EMBR3', 'GOLL4', 'BRAP4', 'VALE3', 'JBSS3', 'WEGE3']","[1.75, 1.75, 1.0, 1.0, 1.0, 0.5, 0.25, 0.25, 0.25]","0.00016097422060948425"
1.047229915689849,"Nov 01, 2018","9","['QUAL3', 'PETR4', 'CMIG4', 'PETR3', 'B3SA3', 'RAIL3', 'JBSS3', 'LAME4', 'CCRO3']","[2.0, 0.75, 0.75, 0.25, 0.25, 0.25, 0.25, 0.25, 0.25]","0.00019502103597087634"
0.9838783690626457,"Dec 03, 2018","9","['MGLU3', 'EQTL3', 'SBSP3', 'EGIE3', 'LAME4', 'RADL3', 'KLBN11', 'BBAS3', 'UGPA3']","[1.75, 1.25, 1.25, 1.125, 0.875, 0.75, 0.75, 0.5, 0.5]","8.344367736646466e-05"
1.1198596191901586,"Dec 28, 2018","9","['EMBR3', 'BRKM5', 'MGLU3', 'BBDC4', 'BBAS3', 'LREN3', 'BBDC3', 'JBSS3', 'BRFS3']","[1.75, 0.875, 0.625, 0.25, 0.25, 0.25, 0.25, 0.25, 0.25]","0.00015915092645231682"
0.9503650874915807,"Feb 01, 2019","9","['VIVT4', 'FLRY3', 'CCRO3', 'CPLE6', 'UGPA3', 'B3SA3', 'ITSA4', 'LREN3', 'BRFS3']","[1.75, 1.75, 1.125, 1.0, 0.875, 0.75, 0.75, 0.25, 0.25]","0.0002699507793703209"
0.9722542987390179,"Mar 01, 2019","9","['USIM5', 'EMBR3', 'MGLU3', 'CVCB3', 'BBAS3', 'RAIL3', 'RENT3', 'CMIG4', 'PCAR4']","[1.75, 1.5, 1.5, 1.0, 0.25, 0.25, 0.25, 0.25, 0.25]","0.0002837754120518903"
0.9742481761136201,"Apr 01, 2019","9","['BRKM5', 'SANB11', 'UGPA3', 'WEGE3', 'PETR4', 'PETR3', 'RADL3', 'BBAS3', 'RAIL3']","[1.0, 0.75, 0.5, 0.5, 0.25, 0.25, 0.25, 0.0, 0.0]","0.0002229557821486867"
1.0476353890908752,"May 02, 2019","9","['BBDC4', 'HYPE3', 'BBAS3', 'EQTL3', 'BRML3', 'CVCB3', 'ENBR3', 'RENT3', 'EGIE3']","[2.0, 1.875, 1.5, 1.5, 1.5, 1.5, 1.5, 0.625, 0.375]","0.0003264280368981236"
1.041235476789782,"Jun 03, 2019","9","['VVAR3', 'SANB11', 'RADL3', 'CMIG4', 'CSAN3', 'BRML3', 'CCRO3', 'LREN3', 'BBSE3']","[2.0, 1.75, 1.75, 1.5, 1.25, 1.0, 0.375, 0.25, 0.25]","0.00016286736370050458"
0.9660930608884171,"Jul 01, 2019","9","['VALE3', 'HYPE3', 'BRAP4', 'CIEL3', 'ITSA4', 'ITUB4', 'BBDC4', 'B3SA3', 'BBAS3']","[2.0, 2.0, 2.0, 1.0, 0.5, 0.25, 0.25, 0.25, 0.25]","0.00010191195603252263"
1.0222153445371756,"Aug 01, 2019","9","['PCAR4', 'MRVE3', 'ABEV3', 'EGIE3', 'RADL3', 'JBSS3', 'BRFS3', 'VIVT4', 'EQTL3']","[2.0, 2.0, 1.125, 1.125, 0.5, 0.25, 0.25, 0.25, 0.25]","0.00024456067469257704"
1.0168412186947897,"Sep 02, 2019","9","['B3SA3', 'JBSS3', 'RADL3', 'CCRO3', 'HYPE3', 'ELET3', 'ELET6', 'CVCB3', 'FLRY3']","[0.25, 0.25, 0.25, 0.25, 0.25, 0.25, 0.25, 0.25, 0.25]","0.00031441082853202407"
1.0397198537286734,"Oct 01, 2019","9","['TAEE11', 'PETR4', 'PETR3', 'AZUL4', 'GOAU4', 'JBSS3', 'MGLU3', 'LAME4', 'BTOW3']","[2.0, 1.75, 1.25, 1.0, 1.0, 0.75, 0.5, 0.5, 0.5]","0.00022848858476240438"
1.0272821463020014,"Nov 01, 2019","9","['ELET6', 'ELET3', 'FLRY3', 'B3SA3', 'UGPA3', 'BBSE3', 'GGBR4', 'IRBR3', 'BRML3']","[2.25, 1.75, 1.75, 0.25, 0.25, 0.25, 0.25, 0.25, 0.25]","0.00017711549796362133"
1.060453458765387,"Sep 02, 2013","9","['BTOW3', 'BRAP4', 'CIEL3', 'ELET3', 'JBSS3', 'MRVE3', 'USIM5', 'RSID3', 'UGPA3']","[0.25, 0.25, 0.25, 0.25, 0.25, 0.25, 0.25, 0.25, 0.0]","0.0001824436749925682"
1.059069142968844,"Oct 01, 2013","9","['LIGT3', 'CMIG4', 'ELET3', 'CPLE6', 'USIM3', 'GOLL4', 'CCRO3', 'JBSS3', 'TIMP3']","[1.75, 1.5, 0.375, 0.25, 0.25, 0.25, 0.25, 0.25, 0.25]","0.00020003205297593662"
0.9567880696912728,"Nov 01, 2013","9","['VIVT4', 'ITUB4', 'CPLE6', 'LREN3', 'CSAN3', 'UGPA3', 'RENT3', 'LIGT3', 'BTOW3']","[1.25, 0.5, 0.25, 0.25, 0.25, 0.25, 0.25, 0.25, 0.25]","0.00014426419408451881"
1.0308548380873752,"Dec 02, 2013","9","['CCRO3', 'ABEV3', 'SBSP3', 'USIM3', 'GOAU4', 'CIEL3', 'BRKM5', 'JBSS3', 'GGBR4']","[0.75, 0.25, 0.25, 0.25, 0.25, 0.25, 0.25, 0.25, 0.25]","0.00012328460879779522"
0.9290532918514133,"Jan 02, 2014","9","['BRKM5', 'KLBN4', 'TIMP3', 'BRPR3', 'LAME4', 'CPFE3', 'TESA3', 'ELET3', 'SBSP3']","[2.0, 2.0, 1.75, 1.75, 1.5, 1.5, 1.5, 1.0, 0.625]","9.701320796592843e-05"
0.9500538254479176,"Feb 03, 2014","9","['USIM5', 'CSNA3', 'BRML3', 'HYPE3', 'LIGT3', 'OIBR4', 'KLBN4', 'DASA3', 'MRFG3']","[2.0, 1.375, 0.625, 0.625, 0.5, 0.25, 0.25, 0.25, 0.25]","0.00020827064466205945"
1.0399527757065272,"Mar 05, 2014","9","['CESP6', 'BBDC3', 'TRPL4', 'LREN3', 'GGBR4', 'GOAU4', 'GOLL4', 'DASA3', 'EMBR3']","[1.75, 1.5, 1.5, 1.0, 0.75, 0.75, 0.25, 0.25, 0.25]","6.454582067738423e-05"
0.9850413732058352,"Apr 01, 2014","9","['USIM3', 'USIM5', 'BRFS3', 'GOLL4', 'RSID3', 'CCRO3', 'GGBR4', 'ABEV3', 'BRML3']","[2.25, 2.0, 2.0, 2.0, 1.75, 0.75, 0.25, 0.25, 0.25]","0.00019457932247567998"
0.9901469136559641,"May 02, 2014","9","['HYPE3', 'CYRE3', 'RSID3', 'TIMP3', 'CESP6', 'OIBR4', 'PETR4', 'BBDC4', 'BBAS3']","[1.75, 1.75, 1.75, 1.5, 0.75, 0.625, 0.25, 0.25, 0.25]","0.00019771624667433898"
1.0096557915451279,"Jun 02, 2014","9","['SANB11', 'BBDC3', 'USIM5', 'DTEX3', 'USIM3', 'CIEL3', 'PDGR3', 'HYPE3', 'SBSP3']","[1.0, 1.0, 0.75, 0.75, 0.625, 0.25, 0.25, 0.25, 0.25]","0.00020349133127669944"
0.9922806770677419,"Jul 01, 2014","9","['MRVE3', 'CYRE3', 'CIEL3', 'BBSE3', 'BBAS3', 'CCRO3', 'CMIG4', 'TIMP3', 'LREN3']","[2.0, 1.75, 0.875, 0.25, 0.25, 0.25, 0.25, 0.25, 0.25]","0.00011699934834690866"
1.026838193607477,"Aug 01, 2014","9","['USIM5', 'ECOR3', 'MMXM3', 'VIVT4', 'RSID3', 'BBDC4', 'BBDC3', 'EGIE3', 'RENT3']","[1.0, 1.0, 0.75, 0.5, 0.375, 0.25, 0.25, 0.25, 0.25]","0.00018474100716095001"
0.9460768248479616,"Sep 01, 2014","9","['BRKM5', 'SANB11', 'SBSP3', 'TIMP3', 'ECOR3', 'BRAP4', 'BRPR3', 'ABEV3', 'PCAR4']","[2.0, 1.75, 1.75, 1.5, 1.5, 0.875, 0.5, 0.25, 0.25]","9.2545943916261e-05"
0.9637681864570705,"Oct 01, 2014","9","['SBSP3', 'EVEN3', 'CSNA3', 'ABEV3', 'EMBR3', 'SANB11', 'VIVT4', 'TIMP3', 'OIBR4']","[1.0, 1.0, 0.625, 0.25, 0.25, 0.25, 0.25, 0.25, 0.25]","8.538017995503564e-05"
1.0870405486812278,"Nov 03, 2014","9","['MMXM3', 'ITUB4', 'PETR4', 'BBDC4', 'PETR3', 'ITSA4', 'BBSE3', 'BBAS3', 'PCAR4']","[0.75, -0.25, -0.25, -0.25, -0.25, -0.25, -0.25, -0.25, -0.25]","0.0002549715852015858"
0.968709854422725,"Dec 01, 2014","9","['UGPA3', 'CIEL3', 'ABEV3', 'BBSE3', 'VIVT4', 'GOLL4', 'CSAN3', 'ECOR3', 'ELET3']","[2.5, 2.25, 2.0, 2.0, 2.0, 2.0, 1.75, 1.75, 1.75]","0.00015447313332993203"
0.8946296116501409,"Jan 02, 2015","9","['MRFG3', 'ABEV3', 'EGIE3', 'CSNA3', 'BRAP4', 'GOLL4', 'ELET3', 'ECOR3', 'DTEX3']","[3.25, 1.75, 1.75, 1.75, 1.75, 1.75, 1.75, 1.5, 1.5]","0.0001595845671180549"
1.112210830412685,"Feb 02, 2015","9","['JBSS3', 'USIM5', 'UGPA3', 'BBDC4', 'ITSA4', 'CYRE3', 'ITUB4', 'VALE3', 'CIEL3']","[1.0, 0.625, 0.5, 0.0, 0.0, 0.0, -0.25, -0.25, -0.25]","8.985054589984586e-05"
1.0415316238280354,"Mar 02, 2015","9","['PETR4', 'PETR3', 'CESP6', 'CYRE3', 'USIM5', 'VIVT4', 'GGBR4', 'CMIG4', 'EGIE3']","[2.0, 1.75, 1.5, 1.25, 1.0, 0.25, 0.25, 0.0, 0.0]","0.00038094429566197714"
1.1377391081983974,"Apr 01, 2015","9","['ELET3', 'EVEN3', 'BRPR3', 'CYRE3', 'GFSA3', 'ABEV3', 'PETR4', 'CIEL3', 'PETR3']","[2.25, 1.25, 1.0, 0.75, 0.75, 0.25, 0.25, 0.25, 0.25]","0.0004401390231713121"
0.9034042672491985,"May 04, 2015","9","['USIM5', 'TIMP3', 'BBAS3', 'ENBR3', 'ITUB4', 'ABEV3', 'BBDC4', 'PETR4', 'ITSA4']","[0.75, 0.625, 0.5, 0.375, 0.25, 0.25, 0.25, 0.25, 0.25]","0.00024686127389399025"
1.012470903371119,"Jun 01, 2015","9","['BRFS3', 'HYPE3', 'KLBN11', 'LIGT3', 'LREN3', 'ABEV3', 'BBDC4', 'VALE3', 'PETR3']","[0.25, 0.25, 0.25, 0.25, 0.125, 0.0, 0.0, 0.0, 0.0]","9.74977545381771e-05"