result,data,num_ativos,lista_ativos,oper_ativos,volatilidade
0.9540970558685274,"May 02, 2017","9","['BBDC4', 'BBDC3', 'KLBN11', 'USIM5', 'ITSA4', 'BRFS3', 'BRKM5', 'WEGE3', 'JBSS3']","[3.25, 1.75, 1.75, 1.75, 1.5, 1.25, 1.25, 1.25, 1.0]","0.00023137103068675527"
1.0070643362672804,"Jun 01, 2017","9","['BRKM5', 'ENBR3', 'CPLE6', 'GOAU4', 'PETR3', 'KLBN11', 'UGPA3', 'CPFE3', 'QUAL3']","[1.75, 1.5, 1.5, 1.25, 1.0, 0.75, 0.25, 0.25, 0.25]","0.00016702017608198768"
0.9746265379746918,"Mar 01, 2017","9","['BBSE3', 'ABEV3', 'BBAS3', 'CMIG4', 'ITSA4', 'ITUB4', 'BBDC4', 'BBDC3', 'CCRO3']","[1.75, 0.5, 0.5, 0.5, 0.375, 0.25, 0.25, 0.25, 0.25]","0.00037822236706914385"
0.9874852088577553,"Apr 03, 2017","9","['BBAS3', 'BBDC4', 'PETR4', 'PETR3', 'SBSP3', 'PCAR4', 'EQTL3', 'CSAN3', 'ENBR3']","[2.0, 1.75, 1.75, 1.75, 1.75, 1.75, 1.5, 1.5, 1.5]","0.00045426721915540824"
1.1274953930569462,"Jan 02, 2017","9","['QUAL3', 'ITUB4', 'BBDC4', 'BBDC3', 'LREN3', 'CYRE3', 'MRFG3', 'USIM5', 'BBAS3']","[2.0, 1.75, 1.75, 1.75, 1.75, 1.75, 1.75, 1.75, 1.5]","0.0005493908215127445"
1.0107250750028016,"Feb 01, 2017","9","['MRFG3', 'ITUB4', 'BBDC4', 'ABEV3', 'VALE3', 'BBAS3', 'VIVT4', 'JBSS3', 'BBDC3']","[1.0, 0.25, 0.25, 0.25, 0.25, 0.25, 0.25, 0.25, 0.25]","0.00032806124886412575"
1.0598237774956192,"Jul 03, 2017","9","['ECOR3', 'BBDC4', 'BRKM5', 'ITSA4', 'CCRO3', 'BBDC3', 'GOAU4', 'CSAN3', 'CYRE3']","[2.25, 2.0, 2.0, 1.75, 1.75, 1.75, 1.75, 1.5, 1.5]","0.0003171547113078859"
1.0490618315631917,"Aug 01, 2017","9","['PETR3', 'PCAR4', 'ITUB4', 'BBDC4', 'ABEV3', 'PETR4', 'ITSA4', 'BBAS3', 'LREN3']","[1.75, 1.25, 0.25, 0.25, 0.25, 0.25, 0.25, 0.25, 0.25]","0.0001664084031355167"