result,data,num_ativos,lista_ativos,oper_ativos,volatilidade
0.9581195190124705,"Jan 04, 2010","9","['EMBR3', 'DTEX3', 'VALE3', 'ITSA4', 'LAME4', 'ELET3', 'GOLL4', 'CSAN3', 'CPLE6']","[2.0, 0.5, 0.25, 0.25, 0.25, 0.25, 0.25, 0.25, 0.25]","nan"
1.008478058482315,"Feb 01, 2010","9","['BTOW3', 'MMXM3', 'ELET3', 'EMBR3', 'ITSA4', 'USIM3', 'CSAN3', 'PDGR3', 'KLBN4']","[0.375, 0.25, 0.25, 0.25, 0.0, 0.0, 0.0, 0.0, -0.125]","nan"
1.0364970186370022,"Mar 01, 2010","9","['CSNA3', 'USIM5', 'BBAS3', 'BTOW3', 'CSAN3', 'GGBR4', 'PDGR3', 'PETR4', 'PETR3']","[2.0, 1.75, 1.75, 1.75, 1.75, 1.5, 1.25, 1.0, 1.0]","0.0019307364611144374"
0.9374020369388094,"Apr 01, 2010","9","['GGBR4', 'VALE3', 'USIM5', 'CSNA3', 'BRAP4', 'EMBR3', 'BBAS3', 'GFSA3', 'MMXM3']","[0.25, 0.25, 0.25, 0.25, 0.25, 0.25, 0.0, 0.0, 0.0]","0.0006454543769278045"
0.9440475317407122,"May 03, 2010","9","['SBSP3', 'RDCD3', 'ELET3', 'GOAU4', 'ABEV3', 'JBSS3', 'CSAN3', 'KLBN4', 'VALE3']","[0.25, 0.0, 0.0, 0.0, 0.0, 0.0, 0.0, 0.0, -0.125]","nan"
1.02448646390894,"Jun 01, 2010","9","['LREN3', 'LIGT3', 'CPFE3', 'BRFS3', 'ABEV3', 'TIMP3', 'VALE3', 'CSNA3', 'ITSA4']","[0.75, 0.75, 0.25, 0.0, 0.0, 0.0, -0.25, -0.25, -0.25]","0.00025747365028566704"
1.1165071917883056,"Jul 01, 2010","9","['GFSA3', 'PETR3', 'TRPL4', 'CPFE3', 'TIMP3', 'LAME4', 'CYRE3', 'JBSS3', 'PDGR3']","[2.0, 1.75, 0.25, 0.25, 0.25, 0.25, 0.25, 0.25, 0.25]","0.0036942921092048718"
0.9942262101938534,"Aug 02, 2010","9","['CPFE3', 'DTEX3', 'GFSA3', 'ABEV3', 'BRKM5', 'RSID3', 'ITSA4', 'TIMP3', 'CMIG4']","[1.25, 0.5, 0.375, 0.25, 0.25, 0.25, 0.25, 0.0, 0.0]","0.00036581910305379643"
1.0793523027710126,"Sep 01, 2010","9","['PETR4', 'PDGR3', 'BRAP4', 'GOLL4', 'VALE3', 'EMBR3', 'GGBR4', 'CSNA3', 'RDCD3']","[0.5, 0.25, 0.0, 0.0, 0.0, 0.0, 0.0, -0.125, -0.25]","0.0008526787130207281"
1.02667279939482,"Oct 01, 2010","9","['TRPL4', 'BRAP4', 'CSAN3', 'BBDC4', 'CYRE3', 'ITUB4', 'USIM5', 'LREN3', 'LIGT3']","[2.0, 1.75, 1.75, 1.75, 1.25, 1.25, 1.0, 0.5, 0.25]","0.0032734885329925973"
0.9853715186474674,"Nov 01, 2010","9","['CESP6', 'ABEV3', 'BRAP4', 'ELET6', 'DTEX3', 'ELET3', 'GOLL4', 'CMIG4', 'VALE3']","[1.25, 0.25, 0.25, 0.25, 0.25, 0.25, 0.25, 0.25, 0.25]","nan"
0.9953427860922179,"Dec 01, 2010","9","['ABEV3', 'BTOW3', 'BRKM5', 'USIM5', 'TRPL4', 'LREN3', 'TIMP3', 'GOLL4', 'VALE3']","[0.25, 0.25, 0.25, 0.25, 0.0, 0.0, 0.0, 0.0, 0.0]","0.0030754709747506763"
0.9572331108959423,"Jan 03, 2011","9","['CCRO3', 'CSAN3', 'GOAU4', 'CMIG4', 'BRFS3', 'SBSP3', 'ABEV3', 'BRKM5', 'KLBN4']","[1.5, 1.5, 1.25, 0.75, 0.375, 0.25, 0.25, 0.25, 0.25]","0.00013865533886241036"
1.0395681940526154,"Feb 01, 2011","9","['RDCD3', 'SANB11', 'SBSP3', 'GFSA3', 'LREN3', 'CPLE6', 'TIMP3', 'LIGT3', 'CESP6']","[1.75, 1.625, 1.0, 0.625, 0.375, 0.25, 0.25, 0.25, 0.25]","0.00012357158726359208"
1.029785125054562,"Mar 01, 2011","9","['CCRO3', 'RDCD3', 'LAME4', 'KLBN4', 'MMXM3', 'PETR4', 'ABEV3', 'MRFG3', 'LIGT3']","[1.75, 1.5, 1.5, 1.5, 1.5, 1.25, 1.0, 1.0, 0.75]","5.597355939136808e-05"
0.9600062423495697,"Apr 01, 2011","9","['MMXM3', 'DTEX3', 'TRPL4', 'LREN3', 'USIM3', 'LIGT3', 'ELET6', 'ELET3', 'CMIG4']","[1.5, 1.375, 1.25, 0.25, 0.25, 0.25, 0.25, 0.25, 0.25]","0.003752166835882031"
0.9995313055775389,"May 02, 2011","9","['CCRO3', 'JBSS3', 'USIM5', 'SBSP3', 'CPFE3', 'TIMP3', 'BRKM5', 'MRFG3', 'RSID3']","[1.75, 0.625, 0.375, 0.25, 0.25, 0.25, 0.25, 0.25, 0.25]","8.466894701732744e-05"
0.9714689006220315,"May 31, 2011","9","['CYRE3', 'BRAP4', 'TIMP3', 'BTOW3', 'MRVE3', 'CIEL3', 'LREN3', 'ABEV3', 'RDCD3']","[2.0, 1.875, 0.25, 0.25, 0.25, 0.25, 0.0, 0.0, 0.0]","9.81256689992578e-05"
0.9005270782469188,"Jul 01, 2011","9","['CESP6', 'DTEX3', 'BBDC4', 'ITUB4', 'ITSA4', 'LIGT3', 'GFSA3', 'TIMP3', 'BTOW3']","[2.0, 1.875, 1.5, 1.5, 1.5, 0.75, 0.75, 0.25, 0.25]","4.7469678468799665e-05"
0.9798708973798261,"Aug 01, 2011","9","['LIGT3', 'JBSS3', 'CPLE6', 'BRKM5', 'BRFS3', 'SBSP3', 'LREN3', 'GOAU4', 'DTEX3']","[1.75, 0.75, 0.625, 0.25, 0.25, -0.25, -0.25, -0.25, -0.25]","4.174533690000828e-05"
0.8713824830224716,"Sep 01, 2011","9","['CESP6', 'LIGT3', 'CMIG4', 'LAME4', 'CYRE3', 'PCAR4', 'GOLL4', 'CSNA3', 'BTOW3']","[1.75, 1.75, 1.75, 1.75, 1.75, 1.5, 1.5, 1.5, 1.0]","0.00012362572390598437"
1.1187568240847972,"Oct 03, 2011","9","['ELET6', 'CPFE3', 'CSAN3', 'GOAU4', 'EMBR3', 'RDCD3', 'GGBR4', 'TRPL4', 'PCAR4']","[1.25, 0.25, 0.25, 0.25, 0.25, 0.25, 0.25, 0.0, 0.0]","0.0038493672456851504"
1.197834293598989,"Jun 01, 2016","9","['OIBR3', 'PCAR4', 'JBSS3', 'RADL3', 'EQTL3', 'CSAN3', 'ECOR3', 'ABEV3', 'PETR4']","[1.75, 1.375, 1.25, 0.25, 0.25, 0.25, 0.25, 0.0, 0.0]","0.0003300484297049913"
1.1242127318854447,"Jul 01, 2016","9","['CMIG4', 'CCRO3', 'VIVT4', 'MULT3', 'VALE3', 'BBSE3', 'LAME4', 'BRML3', 'LREN3']","[2.125, 2.0, 1.75, 1.75, 1.0, 1.0, 1.0, 1.0, 0.25]","0.00039884302646647844"
1.0223485142019593,"Aug 01, 2016","9","['BRKM5', 'ENBR3', 'WEGE3', 'EQTL3', 'VIVT4', 'BBAS3', 'LREN3', 'BRML3', 'CPFE3']","[1.5, 0.75, 0.5, 0.375, 0.25, 0.25, 0.25, 0.25, 0.25]","0.00022216287130188378"
1.0193609663523908,"Sep 01, 2016","9","['ABEV3', 'CESP6', 'BRFS3', 'UGPA3', 'VIVT4', 'WEGE3', 'KLBN11', 'BRKM5', 'GGBR4']","[1.25, 0.75, 0.25, 0.25, 0.25, 0.25, 0.25, 0.25, 0.25]","0.00012920879233568254"
1.1401063265551172,"Oct 03, 2016","9","['LAME4', 'CSAN3', 'CSNA3', 'MULT3', 'VALE3', 'BBDC4', 'CPLE6', 'EQTL3', 'PETR4']","[2.0, 2.0, 1.75, 1.75, 1.5, 1.25, 1.25, 1.0, 0.25]","0.0006933711669934732"
0.9871914797894388,"Nov 01, 2016","9","['CCRO3', 'UGPA3', 'CIEL3', 'PETR4', 'VALE3', 'GGBR4', 'BRAP4', 'ECOR3', 'LREN3']","[2.0, 1.75, 1.5, 0.75, 0.375, 0.375, 0.375, 0.375, 0.25]","0.0007936108575789966"
1.0060683622708055,"Dec 01, 2016","9","['UGPA3', 'BBAS3', 'HYPE3', 'USIM5', 'CPFE3', 'JBSS3', 'SANB11', 'GGBR4', 'CSNA3']","[1.75, 1.75, 1.75, 1.25, 1.125, 1.0, 0.25, 0.25, 0.25]","0.0006850482220306652"
1.0751100254045647,"Jan 02, 2017","9","['BBAS3', 'BBSE3', 'CMIG4', 'LAME4', 'ECOR3', 'MULT3', 'CYRE3', 'JBSS3', 'BRKM5']","[1.75, 1.75, 1.75, 1.5, 1.0, 0.5, 0.5, 0.25, 0.25]","0.00041666077519942257"
1.0148719400619244,"Feb 01, 2017","9","['GGBR4', 'MRFG3', 'ITUB4', 'BBDC4', 'ABEV3', 'PETR3', 'VALE3', 'BBAS3', 'VIVT4']","[1.75, 1.75, 0.25, 0.25, 0.25, 0.25, 0.25, 0.25, 0.25]","0.0005114069475995864"
0.9710667507456281,"Mar 01, 2017","9","['BBDC3', 'ITSA4', 'CMIG4', 'ABEV3', 'BBAS3', 'ITUB4', 'BBDC4', 'PETR4', 'BBSE3']","[1.75, 1.125, 1.0, 0.5, 0.5, 0.25, 0.25, 0.25, 0.25]","0.00044482013939187897"
1.0505823777780026,"Apr 03, 2017","9","['PCAR4', 'RADL3', 'MULT3', 'BRKM5', 'JBSS3', 'GGBR4', 'EGIE3', 'TIMP3', 'RENT3']","[2.0, 1.75, 1.75, 1.0, 0.75, 0.75, 0.75, 0.25, 0.25]","0.0002770924673445291"
0.9618047580439677,"May 02, 2017","9","['KLBN11', 'BRFS3', 'LAME4', 'ENBR3', 'ECOR3', 'ITUB4', 'JBSS3', 'ABEV3', 'BRKM5']","[2.0, 1.75, 1.75, 1.75, 1.75, 1.5, 1.0, 0.75, 0.5]","0.00012490336531474833"
1.0113876261084038,"Jun 01, 2017","9","['KLBN11', 'UGPA3', 'CPFE3', 'QUAL3', 'BBDC4', 'BBSE3', 'VIVT4', 'LREN3', 'SANB11']","[0.75, 0.25, 0.25, 0.25, 0.0, 0.0, 0.0, 0.0, 0.0]","0.00012455327307632169"
1.0539694771437504,"Jul 03, 2017","9","['ECOR3', 'GGBR4', 'TIMP3', 'CIEL3', 'GOAU4', 'VALE3', 'QUAL3', 'ENBR3', 'ITUB4']","[2.25, 1.5, 1.5, 1.25, 1.25, 1.0, 0.25, 0.25, 0.0]","0.00020385894754140267"
1.050407264105599,"Aug 01, 2017","9","['JBSS3', 'PCAR4', 'CPLE6', 'PETR4', 'CCRO3', 'BBSE3', 'ITUB4', 'BBDC4', 'ABEV3']","[2.0, 2.0, 2.0, 1.75, 1.25, 1.0, 0.25, 0.25, 0.25]","0.0001347051824697715"
0.9904512754100565,"Sep 01, 2017","9","['MULT3', 'RENT3', 'UGPA3', 'VALE3', 'CPFE3', 'PETR4', 'CCRO3', 'BRAP4', 'BBDC4']","[2.0, 1.5, 1.0, 0.75, 0.625, 0.5, 0.5, 0.375, 0.25]","0.00015867343614860908"
1.0055596244029754,"Oct 02, 2017","9","['JBSS3', 'BBAS3', 'MRFG3', 'ITUB4', 'BBDC4', 'PETR4', 'PETR3', 'BRFS3', 'UGPA3']","[1.25, 0.75, 0.625, 0.25, 0.25, 0.25, 0.25, 0.25, 0.25]","0.00011526157471172495"
0.8947317286307954,"Nov 01, 2017","9","['RENT3', 'CCRO3', 'PETR4', 'CPFE3', 'PETR3', 'UGPA3', 'BRML3', 'PCAR4', 'ELET3']","[1.75, 1.25, 0.5, 0.375, 0.25, 0.25, 0.25, 0.25, 0.25]","0.00013090621350424087"
1.0470083243901025,"Dec 01, 2017","9","['GGBR4', 'BBDC4', 'BBDC3', 'CYRE3', 'QUAL3', 'RADL3', 'ITSA4', 'BRFS3', 'CIEL3']","[1.625, 1.5, 1.5, 1.25, 0.625, 0.375, 0.25, 0.25, 0.25]","0.0001074648306330822"
1.045817778574107,"Jan 02, 2018","9","['CPFE3', 'LREN3', 'PCAR4', 'KLBN11', 'ELET6', 'IGTA3', 'MRFG3', 'ITUB4', 'EGIE3']","[2.0, 1.75, 1.75, 1.75, 1.75, 1.75, 1.75, 1.5, 1.5]","0.00013593953609083865"
0.993757478571162,"Feb 01, 2018","9","['PCAR4', 'LAME4', 'PETR4', 'PETR3', 'LREN3', 'BRKM5', 'MULT3', 'CSAN3', 'MGLU3']","[2.0, 1.25, 1.0, 1.0, 0.25, 0.25, 0.25, 0.25, 0.25]","0.0002982249800941981"
1.0036346107614869,"Mar 01, 2018","9","['RAIL3', 'MGLU3', 'EQTL3', 'ELET3', 'ABEV3', 'PETR4', 'PETR3', 'ITSA4', 'HYPE3']","[1.75, 1.75, 0.75, 0.75, 0.25, 0.25, 0.25, 0.25, 0.25]","0.00041052500154807955"
0.968611633944024,"Jul 01, 2015","9","['BBSE3', 'UGPA3', 'BRFS3', 'TIMP3', 'MRFG3', 'ITUB4', 'BBDC4', 'ABEV3', 'PETR4']","[1.0, 0.625, 0.25, 0.25, 0.25, 0.0, 0.0, 0.0, 0.0]","0.0001248388631727114"
0.8972748927704307,"Aug 03, 2015","9","['VIVT4', 'KLBN11', 'SBSP3', 'BRPR3', 'ENBR3', 'BBDC3', 'PCAR4', 'SANB11', 'BBDC4']","[1.75, 0.25, 0.25, 0.25, 0.25, 0.0, 0.0, 0.0, -0.25]","0.00013422488683999557"
1.0569623685229526,"Sep 01, 2015","9","['CMIG4', 'MRFG3', 'OIBR4', 'BRFS3', 'KLBN11', 'CIEL3', 'JBSS3', 'EMBR3', 'VIVT4']","[0.75, 0.25, 0.25, 0.0, 0.0, -0.25, -0.25, -0.25, -0.25]","4.6543239416394504e-05"
1.0655693479264639,"Oct 01, 2015","9","['BBDC4', 'BBSE3', 'SANB11', 'GFSA3', 'ABEV3', 'JBSS3', 'EMBR3', 'KLBN11', 'BRKM5']","[0.75, 0.75, 0.75, 0.625, 0.25, 0.25, 0.25, 0.25, 0.25]","0.00010004557122846921"
0.9994095491664436,"Nov 03, 2015","9","['SANB11', 'CESP6', 'ABEV3', 'BBSE3', 'PETR4', 'CIEL3', 'UGPA3', 'HYPE3', 'BRKM5']","[2.0, 1.75, 1.25, 1.25, 0.25, 0.25, 0.25, 0.25, 0.25]","0.00015397029777367417"
0.9383914447609011,"Dec 01, 2015","9","['GGBR4', 'GOAU4', 'SBSP3', 'ITUB4', 'ITSA4', 'BBSE3', 'HYPE3', 'KLBN11', 'SANB11']","[1.5, 0.75, 0.5, 0.25, 0.25, 0.25, 0.25, 0.25, 0.25]","0.0002522110841017952"
0.9388245427483378,"Jan 04, 2016","9","['CESP6', 'VALE3', 'MRVE3', 'USIM5', 'SANB11', 'CCRO3', 'SBSP3', 'MRFG3', 'ABEV3']","[1.75, 1.5, 1.25, 0.75, 0.25, 0.0, 0.0, 0.0, -0.25]","0.00013991886490033264"
1.1229087728234033,"Feb 01, 2016","9","['SBSP3', 'USIM5', 'VIVT4', 'BBDC3', 'HYPE3', 'CSAN3', 'CSNA3', 'CESP6', 'MRFG3']","[2.25, 0.375, -0.25, -0.25, -0.25, -0.25, -0.25, -0.25, -0.25]","0.00024717875618952264"
1.0756319675937345,"Mar 01, 2016","9","['LAME4', 'BBSE3', 'ITSA4', 'EMBR3', 'UGPA3', 'EQTL3', 'ABEV3', 'BBDC4', 'BRFS3']","[2.25, 2.0, 1.75, 1.25, 0.75, 0.375, 0.25, 0.25, 0.25]","8.49296531474071e-05"
1.0090027491334395,"Apr 01, 2016","9","['QUAL3', 'OIBR3', 'ABEV3', 'UGPA3', 'RADL3', 'CSAN3', 'MULT3', 'ITUB4', 'BBDC4']","[1.75, 0.75, 0.375, 0.375, 0.375, 0.375, 0.375, 0.25, 0.25]","0.00030368656339146765"
0.8444889670223177,"May 02, 2016","9","['WEGE3', 'CPFE3', 'BBDC4', 'PETR4', 'ITSA4', 'PETR3', 'VALE3', 'BBSE3', 'BBAS3']","[1.25, 1.25, 0.25, 0.25, 0.25, 0.25, 0.25, 0.25, 0.25]","0.0008579037537931901"
0.9859675763959884,"Nov 01, 2011","9","['HYPE3', 'BRAP4', 'CESP6', 'CSNA3', 'BBAS3', 'MMXM3', 'SBSP3', 'TIMP3', 'GOAU4']","[2.0, 1.75, 1.5, 1.5, 1.5, 1.5, 1.25, 1.25, 1.0]","0.00010988674389587415"
1.0017266937878997,"Dec 01, 2011","7","['USIM5', 'USIM3', 'CPFE3', 'MRVE3', 'TRPL4', 'HYPE3', 'BRAP4']","[1.0, 0.375, 0.25, 0.0, -0.25, -0.25, -1.5]","0.006295409921406224"
1.0706744815199254,"Jan 02, 2012","9","['RDCD3', 'EMBR3', 'CCRO3', 'SANB11', 'HYPE3', 'CPFE3', 'LAME4', 'ELET6', 'GFSA3']","[1.75, 1.75, 1.75, 1.75, 1.25, 1.0, 1.0, 0.75, 0.625]","0.00016949735470354028"
1.085873747022625,"Feb 01, 2012","9","['CESP6', 'ABEV3', 'BRKM5', 'HGTX3', 'BRML3', 'PCAR4', 'LREN3', 'CIEL3', 'DTEX3']","[2.0, 2.0, 1.875, 1.5, 0.5, 0.25, 0.25, 0.25, 0.25]","0.0001267720092936316"
1.0017694459233102,"Mar 01, 2012","9","['VIVT4', 'PCAR4', 'CPFE3', 'HGTX3', 'ABEV3', 'UGPA3', 'CESP6', 'BRAP4', 'BTOW3']","[1.0, 0.5, 0.5, 0.375, 0.375, 0.25, 0.25, 0.25, 0.25]","0.000163380550897957"
1.0044853707679213,"Apr 02, 2012","9","['BRAP4', 'SANB11', 'PETR4', 'CCRO3', 'SBSP3', 'PCAR4', 'UGPA3', 'VIVT4', 'ABEV3']","[1.75, 1.0, 0.75, 0.5, 0.25, 0.25, 0.25, 0.25, 0.25]","0.00023423746569673024"
0.8158768642562687,"May 02, 2012","9","['RSID3', 'JBSS3', 'GGBR4', 'VALE3', 'CYRE3', 'MRVE3', 'PDGR3', 'GFSA3', 'SBSP3']","[1.75, 1.75, 1.75, 1.25, 1.0, 0.75, 0.75, 0.625, 0.5]","0.00035878180623609445"
1.0355350018956262,"Jun 01, 2012","8","['GOLL4', 'RSID3', 'MRVE3', 'GFSA3', 'CSNA3', 'SBSP3', 'CCRO3', 'SANB11']","[0.75, 0.625, 0.625, 0.625, 0.25, 0.0, 0.0, 0.0]","0.0003701968631478542"
1.023287148645043,"Jul 02, 2012","9","['KLBN4', 'LIGT3', 'UGPA3', 'RDCD3', 'CCRO3', 'BBDC4', 'VIVT4', 'ABEV3', 'CSAN3']","[1.75, 0.5, 0.25, 0.25, 0.25, 0.25, 0.0, 0.0, 0.0]","0.0002883807544765072"
1.0349261979630873,"Aug 01, 2012","9","['ABEV3', 'RENT3', 'BBAS3', 'BBDC4', 'LREN3', 'GOLL4', 'UGPA3', 'GOAU4', 'BTOW3']","[2.0, 2.0, 2.0, 1.75, 1.5, 1.0, 0.25, 0.25, 0.25]","0.0001966628876226222"
1.1111195495442263,"Sep 03, 2012","9","['PCAR4', 'USIM3', 'LREN3', 'RENT3', 'BRML3', 'BRFS3', 'BTOW3', 'GOLL4', 'MRFG3']","[0.75, 0.25, 0.25, 0.25, 0.25, 0.25, 0.25, 0.25, 0.25]","0.00017846595637008493"
1.0087328291567448,"Oct 01, 2012","8","['LREN3', 'RENT3', 'CSAN3', 'GOAU4', 'DTEX3', 'BRKM5', 'LAME4', 'GOLL4']","[0.25, 0.25, 0.25, 0.25, 0.25, 0.25, 0.25, 0.25]","0.0002773745334199514"
0.9915548745750974,"Nov 01, 2012","9","['DASA3', 'CYRE3', 'CPLE6', 'MRVE3', 'CPFE3', 'BRAP4', 'EMBR3', 'BRFS3', 'DTEX3']","[1.25, 1.0, 0.75, 0.375, 0.25, 0.25, 0.25, 0.25, 0.25]","0.00015275427154315356"
1.0287701617505574,"Dec 03, 2012","9","['RENT3', 'CCRO3', 'EMBR3', 'BRML3', 'KLBN4', 'SANB11', 'VALE3', 'PCAR4', 'BRKM5']","[0.25, 0.25, 0.0, 0.0, 0.0, 0.0, 0.0, -0.25, -0.25]","0.00014627935083994894"
1.0434825783236645,"Dec 28, 2012","9","['CPLE6', 'CSNA3', 'EMBR3', 'GOLL4', 'VIVT4', 'BRFS3', 'CESP6', 'LREN3', 'ABEV3']","[1.75, 1.75, 1.5, 1.25, 0.75, 0.5, 0.25, 0.25, 0.25]","8.765568021824737e-05"
0.9953518981572966,"Feb 01, 2013","9","['MRFG3', 'UGPA3', 'PETR4', 'SBSP3', 'VIVT4', 'ABEV3', 'ELET3', 'BRFS3', 'BRKM5']","[2.0, 1.25, 1.0, 0.25, 0.25, 0.25, 0.25, 0.25, 0.25]","7.279397171618776e-05"
0.936130609912526,"Mar 01, 2013","9","['MRVE3', 'BBAS3', 'CIEL3', 'TRPL4', 'SBSP3', 'UGPA3', 'ELET6', 'CMIG4', 'BRKM5']","[2.0, 1.125, 0.375, 0.25, 0.25, 0.25, 0.0, 0.0, 0.0]","0.0020345491003729054"
0.9937177917764878,"Mar 28, 2013","9","['PETR4', 'BTOW3', 'BRFS3', 'PCAR4', 'EMBR3', 'SANB11', 'BBAS3', 'ITUB4', 'CESP6']","[2.0, 1.75, 1.0, 0.25, 0.25, 0.25, 0.25, 0.25, 0.0]","0.000115992036241972"
0.9656861396165577,"May 02, 2013","9","['RENT3', 'BRML3', 'UGPA3', 'PETR3', 'KLBN4', 'GOLL4', 'BBDC4', 'GFSA3', 'PDGR3']","[1.75, 1.75, 0.5, 0.25, 0.0, 0.0, 0.0, 0.0, -0.125]","0.00022480117090192117"
0.9175889808767681,"Jun 03, 2013","9","['USIM5', 'CSNA3', 'UGPA3', 'BBDC4', 'ITUB4', 'ELET6', 'TIMP3', 'GGBR4', 'CIEL3']","[1.75, 0.625, 0.25, 0.25, 0.25, 0.0, 0.0, -0.25, -1.5]","4.2109309132354154e-05"
1.0150482493606434,"Jul 01, 2013","9","['LREN3', 'EMBR3', 'MRFG3', 'CPLE6', 'RENT3', 'LIGT3', 'CPFE3', 'SBSP3', 'CESP6']","[0.75, 0.25, 0.0, -0.25, -0.25, -0.25, -0.25, -0.25, -0.25]","5.781287400447589e-05"
1.0437428361500873,"Aug 01, 2013","9","['BRAP4', 'CMIG4', 'VALE3', 'UGPA3', 'BRFS3', 'DASA3', 'TIMP3', 'CCRO3', 'MMXM3']","[2.0, 1.875, 1.75, 0.25, 0.25, 0.25, 0.25, 0.125, 0.125]","0.0001192924579263085"
1.017863836613433,"Apr 02, 2018","9","['TAEE11', 'ABEV3', 'RENT3', 'CMIG4', 'MGLU3', 'CPLE6', 'PETR4', 'EQTL3', 'GGBR4']","[1.75, 0.25, 0.25, 0.25, 0.25, 0.25, 0.0, 0.0, 0.0]","0.0001523936691007707"
0.9206404892676455,"May 02, 2018","9","['CMIG4', 'GOAU4', 'GGBR4', 'ECOR3', 'ITUB4', 'VALE3', 'PETR3', 'PCAR4', 'LAME4']","[1.75, 1.75, 1.25, 1.25, 0.5, 0.375, 0.25, 0.25, 0.25]","0.00020020794434513688"
1.0273254811286492,"Jun 01, 2018","9","['BBDC3', 'WEGE3', 'KLBN11', 'SUZB3', 'MGLU3', 'MRFG3', 'JBSS3', 'RAIL3', 'BRKM5']","[0.375, 0.25, 0.25, 0.25, 0.25, 0.25, 0.0, 0.0, 0.0]","0.00035615746035846604"
1.00425888410077,"Jul 02, 2018","9","['RADL3', 'FLRY3', 'EMBR3', 'BRKM5', 'MGLU3', 'SUZB3', 'VIVT4', 'BTOW3', 'ENBR3']","[1.25, 1.0, 0.25, 0.25, 0.25, 0.0, 0.0, 0.0, 0.0]","0.00015905279572443797"
0.9488195907248266,"Aug 01, 2018","9","['VALE3', 'SANB11', 'SBSP3', 'GOLL4', 'EGIE3', 'CSNA3', 'USIM5', 'GGBR4', 'BBDC4']","[2.0, 1.75, 1.75, 1.75, 1.25, 1.25, 1.25, 0.75, 0.25]","0.0003135242764551254"
1.0213850941878908,"Sep 03, 2018","9","['PCAR4', 'WEGE3', 'VALE3', 'TIMP3', 'KLBN11', 'EMBR3', 'BRKM5', 'GOAU4', 'BBDC4']","[2.0, 1.75, 1.25, 1.0, 0.75, 0.5, 0.25, 0.25, 0.0]","0.00015082676732213493"
1.1564912821515054,"Oct 01, 2018","9","['BRFS3', 'JBSS3', 'MULT3', 'GOAU4', 'CYRE3', 'ABEV3', 'BBAS3', 'LAME4', 'CPLE6']","[2.0, 1.75, 1.75, 1.75, 1.75, 1.5, 1.5, 1.5, 1.25]","0.00015145918295258464"
0.9996640372283333,"Nov 01, 2018","9","['KLBN11', 'CMIG4', 'EQTL3', 'QUAL3', 'CYRE3', 'PETR4', 'PETR3', 'B3SA3', 'RAIL3']","[1.5, 0.75, 0.5, 0.5, 0.375, 0.25, 0.25, 0.25, 0.25]","0.0001984018368274916"
0.9809673209876312,"Dec 03, 2018","9","['BRFS3', 'MGLU3', 'SANB11', 'SBSP3', 'QUAL3', 'RADL3', 'KLBN11', 'SAPR11', 'UGPA3']","[3.25, 2.25, 1.75, 1.75, 1.75, 0.75, 0.75, 0.625, 0.5]","nan"
1.139544219358599,"Dec 28, 2018","9","['BRKM5', 'MGLU3', 'BBDC4', 'LREN3', 'BRFS3', 'SANB11', 'RENT3', 'LAME4', 'SBSP3']","[0.875, 0.375, 0.25, 0.25, 0.25, 0.25, 0.25, 0.25, 0.25]","0.00015497536130694466"
0.9713669852782774,"Feb 01, 2019","9","['EGIE3', 'SBSP3', 'UGPA3', 'BRML3', 'PETR4', 'PETR3', 'B3SA3', 'ITSA4', 'LREN3']","[1.25, 1.0, 0.375, 0.375, 0.25, 0.25, 0.25, 0.25, 0.25]","0.00033224947395588865"
0.9700528047032925,"Mar 01, 2019","9","['CSAN3', 'EMBR3', 'CVCB3', 'BRAP4', 'BBAS3', 'RAIL3', 'RENT3', 'PCAR4', 'BTOW3']","[1.75, 1.0, 1.0, 1.0, 0.25, 0.25, 0.25, 0.25, 0.25]","0.00021603524327537418"
1.0053404201886766,"Apr 01, 2019","9","['QUAL3', 'SBSP3', 'BRKM5', 'SANB11', 'UGPA3', 'PETR4', 'PETR3', 'B3SA3', 'RADL3']","[2.0, 1.75, 1.0, 0.75, 0.5, 0.25, 0.25, 0.25, 0.25]","0.0001820367898309667"
1.047250506654466,"May 02, 2019","9","['EGIE3', 'BBAS3', 'HYPE3', 'BRML3', 'CVCB3', 'ENBR3', 'ABEV3', 'TAEE11', 'MRVE3']","[1.875, 1.75, 1.75, 1.75, 1.5, 1.5, 1.25, 1.25, 1.25]","0.00023077773845665164"
1.070657405503808,"Jun 03, 2019","9","['GOLL4', 'CYRE3', 'SANB11', 'CMIG4', 'BBDC3', 'BRML3', 'LREN3', 'ITUB4', 'BBDC4']","[3.5, 2.0, 1.75, 1.75, 1.5, 1.5, 1.25, 1.0, 1.0]","0.0005692334747805264"
1.0020343819781687,"Jul 01, 2019","9","['PCAR4', 'SANB11', 'TIMP3', 'GOAU4', 'BRFS3', 'CIEL3', 'QUAL3', 'ECOR3', 'ITUB4']","[2.5, 2.0, 1.25, 1.25, 1.0, 1.0, 0.75, 0.5, 0.25]","7.529534253132717e-05"
1.057215251302498,"Aug 01, 2019","9","['ABEV3', 'RADL3', 'JBSS3', 'BRFS3', 'VIVT4', 'SBSP3', 'EGIE3', 'ELET3', 'BRDT3']","[1.25, 0.75, 0.25, 0.25, 0.25, 0.25, 0.25, 0.25, 0.25]","0.0003215559611475395"
1.0170980350174168,"Sep 02, 2019","9","['HYPE3', 'B3SA3', 'JBSS3', 'RAIL3', 'RADL3', 'CCRO3', 'ELET3', 'ELET6', 'CVCB3']","[1.25, 0.25, 0.25, 0.25, 0.25, 0.25, 0.25, 0.25, 0.25]","0.000399913772900368"
1.0122269468362113,"Oct 01, 2019","9","['GOAU4', 'ITUB4', 'UGPA3', 'EMBR3', 'BRKM5', 'B3SA3', 'WEGE3', 'KLBN11', 'BBDC4']","[2.75, 2.0, 2.0, 2.0, 2.0, 1.75, 1.75, 1.75, 1.25]","6.146567757321723e-05"
1.0170809406192172,"Nov 01, 2019","9","['ELET6', 'FLRY3', 'TAEE11', 'RADL3', 'PETR3', 'B3SA3', 'UGPA3', 'BBSE3', 'SBSP3']","[1.5, 1.25, 1.0, 0.75, 0.25, 0.25, 0.25, 0.25, 0.25]","0.00019548494566782167"
1.0471899242423934,"Aug 01, 2014","9","['MMXM3', 'VIVT4', 'RSID3', 'BBDC4', 'BBDC3', 'EGIE3', 'RENT3', 'ENBR3', 'LIGT3']","[0.75, 0.5, 0.375, 0.25, 0.25, 0.25, 0.25, 0.25, 0.25]","0.0001994036416970051"
0.8931278592758243,"Sep 01, 2014","9","['TIMP3', 'SBSP3', 'ECOR3', 'GFSA3', 'BRAP4', 'CPFE3', 'RENT3', 'BRPR3', 'MRVE3']","[1.5, 1.0, 1.0, 1.0, 0.875, 0.5, 0.5, 0.5, 0.5]","0.00010570886443007893"
0.9706638900712722,"Oct 01, 2014","9","['EVEN3', 'CSNA3', 'ABEV3', 'EMBR3', 'SANB11', 'VIVT4', 'TIMP3', 'OIBR4', 'KLBN11']","[1.0, 0.625, 0.25, 0.25, 0.25, 0.25, 0.25, 0.25, 0.25]","nan"
1.0870405486812278,"Nov 03, 2014","9","['MMXM3', 'ITUB4', 'PETR4', 'BBDC4', 'PETR3', 'ITSA4', 'BBSE3', 'BBAS3', 'PCAR4']","[0.75, -0.25, -0.25, -0.25, -0.25, -0.25, -0.25, -0.25, -0.25]","0.0002549715852015858"
0.9357708563950753,"Dec 01, 2014","9","['EVEN3', 'PCAR4', 'MRVE3', 'BBDC3', 'BRML3', 'RENT3', 'ECOR3', 'GFSA3', 'HYPE3']","[2.5, 2.0, 2.0, 1.75, 1.75, 1.75, 1.75, 1.5, 1.25]","0.00016209066753286851"
0.8297397957313118,"Jan 02, 2015","9","['LAME4', 'ABEV3', 'CPLE6', 'CSNA3', 'ELET6', 'USIM5', 'DTEX3', 'CESP6', 'OIBR4']","[2.0, 1.75, 1.75, 1.75, 1.75, 1.5, 1.5, 1.25, 0.375]","0.00016226213499714092"
1.1196596986862484,"Feb 02, 2015","9","['CIEL3', 'CYRE3', 'USIM5', 'UGPA3', 'PETR4', 'ITSA4', 'PETR3', 'JBSS3', 'BRAP4']","[1.75, 1.0, 0.625, 0.5, 0.0, 0.0, 0.0, 0.0, 0.0]","0.00020305579102423174"
1.0024725607129314,"Mar 02, 2015","9","['ELET3', 'EVEN3', 'CESP6', 'LREN3', 'EGIE3', 'CPLE6', 'PETR3', 'VIVT4', 'TIMP3']","[1.75, 1.75, 1.5, 1.375, 1.0, 1.0, 0.25, 0.25, 0.25]","0.00023178464728927607"
1.1157527976793493,"Apr 01, 2015","9","['LAME4', 'GFSA3', 'BRFS3', 'PETR4', 'PETR3', 'BRPR3', 'CYRE3', 'ELET3', 'ABEV3']","[2.0, 2.0, 1.5, 1.25, 1.25, 1.0, 0.75, 0.75, 0.25]","0.0002713200540672666"
0.9222069813595227,"May 04, 2015","9","['SBSP3', 'TIMP3', 'BBAS3', 'ENBR3', 'ITUB4', 'BBDC4', 'PETR4', 'ITSA4', 'CIEL3']","[1.25, 0.625, 0.5, 0.375, 0.25, 0.25, 0.25, 0.25, 0.25]","0.0002587923338447582"
0.990770925374794,"Jun 01, 2015","9","['RLOG3', 'BRFS3', 'HYPE3', 'KLBN11', 'LIGT3', 'POMO4', 'LREN3', 'ABEV3', 'VALE3']","[1.5, 0.25, 0.25, 0.25, 0.25, 0.25, 0.125, 0.0, 0.0]","nan"
1.081090318558465,"Sep 02, 2013","9","['BRAP4', 'CIEL3', 'ELET3', 'JBSS3', 'MRVE3', 'USIM5', 'RSID3', 'GFSA3', 'CCRO3']","[0.25, 0.25, 0.25, 0.25, 0.25, 0.25, 0.25, 0.25, 0.0]","0.0002643564133355169"
1.0012933781261513,"Oct 01, 2013","9","['TRPL4', 'MRFG3', 'ENBR3', 'CMIG4', 'CPLE6', 'CSAN3', 'USIM3', 'DTEX3', 'GOLL4']","[1.75, 1.5, 1.25, 1.0, 0.25, 0.25, 0.25, 0.25, 0.25]","0.00020985436583990146"
0.9653680540553384,"Nov 01, 2013","9","['LREN3', 'CSAN3', 'UGPA3', 'RENT3', 'BBDC3', 'LIGT3', 'CPFE3', 'BTOW3', 'DTEX3']","[0.25, 0.25, 0.25, 0.25, 0.25, 0.25, 0.25, 0.25, 0.25]","0.00012280686248914634"
1.0103933783556338,"Dec 02, 2013","9","['CIEL3', 'LAME4', 'CCRO3', 'MRVE3', 'CPFE3', 'ABEV3', 'LIGT3', 'SBSP3', 'USIM3']","[2.0, 1.75, 1.75, 1.5, 1.0, 0.25, 0.25, 0.25, 0.25]","0.00016863876830142084"
0.924477710638531,"Jan 02, 2014","9","['JBSS3', 'KLBN4', 'LAME4', 'CPLE6', 'CPFE3', 'TESA3', 'USIM5', 'GGBR4', 'GFSA3']","[1.75, 1.75, 1.75, 1.75, 1.75, 1.75, 0.25, 0.25, 0.25]","0.0001480629295070214"
0.9707923484410593,"Feb 03, 2014","9","['CSNA3', 'BTOW3', 'BRML3', 'HYPE3', 'LIGT3', 'OIBR4', 'KLBN4', 'DASA3', 'MRFG3']","[1.375, 1.0, 0.625, 0.625, 0.5, 0.25, 0.25, 0.25, 0.25]","0.00025963707104482476"
1.0401461251052289,"Mar 05, 2014","9","['BTOW3', 'EMBR3', 'GGBR4', 'GOAU4', 'VALE3', 'DASA3', 'BBDC4', 'ABEV3', 'BRML3']","[2.0, 1.75, 0.75, 0.75, 0.25, 0.25, 0.0, 0.0, 0.0]","0.00011841175537336981"
0.9756009102622404,"Apr 01, 2014","9","['BRPR3', 'VIVT4', 'CPLE6', 'GGBR4', 'USIM3', 'UGPA3', 'ABEV3', 'CYRE3', 'PCAR4']","[2.25, 2.125, 2.125, 2.0, 2.0, 1.875, 1.75, 1.75, 1.75]","0.0001325717868127126"
0.9747581364379762,"May 02, 2014","9","['SBSP3', 'OIBR4', 'PETR4', 'BBDC4', 'BBAS3', 'ITSA4', 'PETR3', 'CCRO3', 'BRFS3']","[3.75, 0.625, 0.25, 0.25, 0.25, 0.25, 0.25, 0.25, 0.25]","0.0002887576212359982"
1.009655791545128,"Jun 02, 2014","9","['BBDC3', 'USIM5', 'DTEX3', 'USIM3', 'CIEL3', 'PDGR3', 'HYPE3', 'SANB11', 'SBSP3']","[1.0, 0.75, 0.75, 0.625, 0.25, 0.25, 0.25, 0.25, 0.25]","0.00020349133127669947"
1.0325790336026666,"Jul 01, 2014","9","['CYRE3', 'PCAR4', 'ITUB4', 'CIEL3', 'PETR4', 'PETR3', 'BBSE3', 'BBAS3', 'CCRO3']","[2.0, 1.25, 1.0, 0.375, 0.25, 0.25, 0.25, 0.25, 0.25]","0.0001676961535485279"