﻿"Date","Price","Open","High","Low","Vol.","Change %"
"Apr 20, 2015","16.81","16.90","17.06","16.68","9.63M","-0.24%"
"Apr 22, 2015","16.85","16.87","16.90","16.66","10.21M","0.24%"
"Apr 23, 2015","16.79","16.83","16.94","16.64","11.42M","-0.36%"
"Apr 24, 2015","16.81","16.93","16.99","16.77","9.04M","0.12%"
"Apr 27, 2015","16.72","16.89","16.94","16.64","12.54M","-0.54%"
"Apr 28, 2015","16.80","16.89","16.89","16.55","10.11M","0.48%"
"Apr 29, 2015","16.75","16.69","16.82","16.66","8.73M","-0.30%"
"Apr 30, 2015","16.85","16.68","16.90","16.68","9.19M","0.60%"
"May 04, 2015","17.21","16.93","17.33","16.90","9.76M","2.14%"
"May 05, 2015","17.44","17.08","17.55","17.01","11.32M","1.34%"
"May 06, 2015","17.52","17.57","18.05","17.38","19.20M","0.46%"
"May 07, 2015","17.43","17.54","17.59","17.31","6.53M","-0.51%"
"May 08, 2015","17.65","17.59","17.72","17.36","10.50M","1.26%"
"May 11, 2015","17.63","17.57","17.68","17.48","4.96M","-0.11%"
"May 12, 2015","17.38","17.50","17.60","17.29","10.02M","-1.42%"
"May 13, 2015","17.27","17.33","17.36","17.13","6.85M","-0.63%"
"May 14, 2015","17.29","17.39","17.49","17.18","7.16M","0.12%"
"May 15, 2015","17.41","17.20","17.48","17.20","9.20M","0.69%"
"May 18, 2015","17.22","17.41","17.57","17.12","11.17M","-1.09%"
"May 19, 2015","17.13","17.24","17.28","17.03","7.84M","-0.52%"
"May 20, 2015","16.64","16.90","16.98","16.60","10.65M","-2.86%"
"May 21, 2015","16.70","16.46","16.80","16.41","10.05M","0.36%"
"May 22, 2015","16.70","16.79","16.89","16.53","12.22M","0.00%"
"May 25, 2015","16.75","16.67","16.85","16.53","2.54M","0.30%"
"May 26, 2015","16.49","16.61","16.81","16.41","9.76M","-1.55%"
"May 27, 2015","16.43","16.41","16.52","16.25","9.09M","-0.36%"
"May 28, 2015","16.44","16.28","16.49","16.14","8.89M","0.06%"
"May 29, 2015","16.37","16.32","16.50","16.21","19.33M","-0.43%"
"Jun 01, 2015","16.48","16.45","16.61","16.44","7.81M","0.67%"
"Jun 02, 2015","16.62","16.62","16.65","16.45","11.72M","0.85%"
"Jun 03, 2015","16.45","16.61","16.61","16.18","11.66M","-1.02%"
"Jun 05, 2015","16.68","16.54","16.68","16.40","14.78M","1.40%"
"Jun 08, 2015","16.57","16.69","16.82","16.53","12.83M","-0.66%"
"Jun 09, 2015","16.51","16.50","16.60","16.45","15.66M","-0.36%"
"Jun 10, 2015","16.81","16.70","16.84","16.55","10.23M","1.82%"
"Jun 11, 2015","16.77","16.82","16.98","16.70","12.09M","-0.24%"
"Jun 12, 2015","16.70","16.66","16.82","16.64","6.76M","-0.42%"
"Jun 15, 2015","16.47","16.57","16.60","16.41","9.20M","-1.38%"
"Jun 16, 2015","16.76","16.59","16.87","16.52","12.98M","1.76%"
"Jun 17, 2015","16.71","16.68","16.76","16.54","9.26M","-0.30%"
"Jun 18, 2015","16.81","16.76","16.93","16.51","10.70M","0.60%"
"Jun 19, 2015","16.90","16.62","16.91","16.62","11.93M","0.54%"
"Jun 22, 2015","16.96","16.97","17.13","16.88","10.32M","0.36%"
"Jun 23, 2015","16.97","17.08","17.17","16.96","6.45M","0.06%"
"Jun 24, 2015","16.95","17.01","17.11","16.89","6.40M","-0.12%"
"Jun 25, 2015","16.94","16.93","16.97","16.77","8.47M","-0.06%"
"Jun 26, 2015","17.15","16.89","17.21","16.87","9.69M","1.24%"
"Jun 29, 2015","16.99","17.08","17.08","16.91","5.84M","-0.93%"
"Jun 30, 2015","17.08","16.99","17.14","16.94","19.37M","0.53%"
"Jul 01, 2015","17.08","17.04","17.23","17.04","10.34M","0.00%"
"Jul 02, 2015","17.06","17.20","17.29","17.01","9.20M","-0.12%"
"Jul 03, 2015","17.15","17.00","17.17","16.92","3.03M","0.53%"
"Jul 06, 2015","17.17","16.96","17.24","16.95","6.96M","0.12%"
"Jul 07, 2015","17.21","17.05","17.30","17.02","9.57M","0.23%"
"Jul 08, 2015","17.12","17.21","17.29","17.07","8.62M","-0.52%"
"Jul 10, 2015","17.44","17.26","17.54","17.17","15.71M","1.87%"
"Jul 13, 2015","17.50","17.50","17.66","17.46","10.12M","0.34%"
"Jul 14, 2015","17.54","17.45","17.62","17.38","8.96M","0.23%"
"Jul 15, 2015","17.61","17.46","17.62","17.46","9.50M","0.40%"
"Jul 16, 2015","17.61","17.71","17.79","17.49","9.76M","0.00%"
"Jul 17, 2015","17.63","17.61","17.79","17.55","10.82M","0.11%"
"Jul 20, 2015","17.60","17.63","17.72","17.53","9.05M","-0.17%"
"Jul 21, 2015","17.53","17.69","17.75","17.41","7.53M","-0.40%"
"Jul 22, 2015","17.44","17.42","17.69","17.29","7.77M","-0.51%"
"Jul 23, 2015","17.25","17.29","17.42","17.12","12.33M","-1.09%"
"Jul 24, 2015","17.03","17.20","17.24","16.91","12.37M","-1.28%"
"Jul 27, 2015","16.75","16.93","17.03","16.67","10.82M","-1.64%"
"Jul 28, 2015","16.80","16.81","16.90","16.45","13.94M","0.30%"
"Jul 29, 2015","16.77","16.68","16.95","16.64","13.33M","-0.18%"
"Jul 30, 2015","16.91","16.78","16.97","16.71","9.68M","0.83%"
"Jul 31, 2015","17.40","17.01","17.42","16.95","13.20M","2.90%"
"Aug 03, 2015","17.46","17.30","17.56","17.28","8.57M","0.34%"
"Aug 04, 2015","17.64","17.40","17.65","17.40","9.22M","1.03%"
"Aug 05, 2015","17.84","17.71","17.84","17.50","8.11M","1.13%"
"Aug 06, 2015","17.76","17.72","17.94","17.63","13.42M","-0.45%"
"Aug 07, 2015","17.46","17.67","17.75","17.32","10.01M","-1.69%"
"Aug 10, 2015","17.50","17.46","17.62","17.38","8.29M","0.23%"
"Aug 11, 2015","17.48","17.50","17.55","17.30","10.77M","-0.11%"
"Aug 12, 2015","16.85","17.44","17.57","16.79","26.11M","-3.60%"
"Aug 13, 2015","16.77","16.96","17.12","16.64","11.00M","-0.47%"
"Aug 14, 2015","16.64","16.70","16.81","16.60","8.44M","-0.78%"
"Aug 17, 2015","16.59","16.63","16.77","16.54","10.60M","-0.30%"
"Aug 18, 2015","16.79","16.58","17.20","16.51","18.26M","1.21%"
"Aug 19, 2015","16.28","16.60","16.81","16.23","16.32M","-3.04%"
"Aug 20, 2015","16.48","16.14","16.56","16.03","12.28M","1.23%"
"Aug 21, 2015","16.21","16.38","16.48","16.13","11.86M","-1.64%"
"Aug 24, 2015","16.06","15.52","16.18","15.17","25.83M","-0.93%"
"Aug 25, 2015","16.45","16.44","16.63","16.19","22.12M","2.43%"
"Aug 26, 2015","16.86","16.56","16.90","16.48","14.15M","2.49%"
"Aug 27, 2015","17.08","16.99","17.30","16.77","15.90M","1.30%"
"Aug 28, 2015","17.17","17.01","17.17","16.83","11.63M","0.53%"
"Aug 31, 2015","17.07","16.99","17.12","16.59","22.41M","-0.58%"
"Sep 01, 2015","16.73","16.68","16.99","16.65","14.91M","-1.99%"
"Sep 02, 2015","17.12","16.87","17.14","16.68","16.69M","2.33%"
"Sep 03, 2015","17.55","17.24","17.60","16.95","19.09M","2.51%"
"Sep 04, 2015","17.75","17.39","17.77","17.33","28.73M","1.14%"
"Sep 08, 2015","17.54","17.95","18.05","17.39","12.95M","-1.18%"
"Sep 09, 2015","17.31","17.71","17.86","17.25","12.54M","-1.31%"
"Sep 10, 2015","17.27","16.78","17.52","16.72","15.60M","-0.23%"
"Sep 11, 2015","17.00","17.19","17.24","16.90","12.00M","-1.56%"
"Sep 14, 2015","17.00","17.03","17.15","16.83","16.20M","0.00%"
"Sep 15, 2015","17.18","17.07","17.30","16.95","12.59M","1.06%"
"Sep 16, 2015","17.53","17.57","17.69","17.32","33.06M","2.04%"
"Sep 17, 2015","17.56","17.36","17.82","17.36","15.09M","0.17%"
"Sep 18, 2015","17.55","17.39","17.82","17.32","17.66M","-0.06%"
"Sep 21, 2015","17.42","17.36","17.66","17.31","8.21M","-0.74%"
"Sep 22, 2015","17.48","17.31","17.52","17.19","12.32M","0.34%"
"Sep 23, 2015","17.27","17.50","17.52","17.21","14.42M","-1.20%"
"Sep 24, 2015","17.23","16.99","17.42","16.86","12.37M","-0.23%"
"Sep 25, 2015","17.39","17.39","17.77","17.16","8.94M","0.93%"
"Sep 28, 2015","17.37","17.41","17.49","17.17","8.01M","-0.12%"
"Sep 29, 2015","17.45","17.37","17.60","17.30","9.03M","0.46%"
"Sep 30, 2015","17.50","17.66","17.80","17.44","11.80M","0.29%"
"Oct 01, 2015","17.75","17.49","17.85","17.44","11.09M","1.43%"
"Oct 02, 2015","18.08","17.65","18.13","17.63","10.16M","1.86%"
"Oct 05, 2015","18.34","18.32","18.44","18.19","7.81M","1.44%"
"Oct 06, 2015","17.92","18.38","18.42","17.77","11.67M","-2.29%"
"Oct 07, 2015","18.02","18.12","18.16","17.88","14.60M","0.56%"
"Oct 08, 2015","17.73","18.02","18.15","17.60","16.57M","-1.61%"
"Oct 09, 2015","17.83","17.98","17.98","17.46","10.73M","0.56%"
"Oct 13, 2015","16.85","17.80","17.80","16.69","26.26M","-5.50%"
"Oct 14, 2015","16.58","16.85","17.18","16.49","33.61M","-1.60%"
"Oct 15, 2015","17.22","16.71","17.31","16.45","22.54M","3.86%"
"Oct 16, 2015","17.38","17.26","17.54","16.99","12.11M","0.93%"
"Oct 19, 2015","17.55","17.39","17.55","17.22","7.61M","0.98%"
"Oct 20, 2015","17.64","17.51","17.64","17.32","8.18M","0.51%"
"Oct 21, 2015","17.75","17.71","17.92","17.61","11.83M","0.62%"
"Oct 22, 2015","17.72","17.76","17.97","17.57","15.16M","-0.17%"
"Oct 23, 2015","17.82","18.06","18.06","17.73","8.59M","0.56%"
"Oct 26, 2015","17.73","17.84","17.91","17.64","7.09M","-0.51%"
"Oct 27, 2015","17.85","17.66","17.90","17.55","13.47M","0.68%"
"Oct 28, 2015","17.51","17.71","17.73","17.36","16.01M","-1.90%"
"Oct 29, 2015","17.12","17.23","17.46","17.12","9.31M","-2.23%"
"Oct 30, 2015","17.20","17.00","17.36","16.85","11.81M","0.47%"
"Nov 03, 2015","17.66","17.21","17.66","17.07","13.35M","2.67%"
"Nov 04, 2015","17.66","17.74","17.83","17.35","10.10M","0.00%"
"Nov 05, 2015","17.54","17.56","17.72","17.34","9.07M","-0.68%"
"Nov 06, 2015","17.09","17.46","17.52","17.00","8.70M","-2.57%"
"Nov 09, 2015","16.85","17.09","17.21","16.70","7.91M","-1.40%"
"Nov 10, 2015","16.81","16.73","16.84","16.40","10.72M","-0.24%"
"Nov 11, 2015","17.18","16.86","17.19","16.85","10.48M","2.20%"
"Nov 12, 2015","17.02","17.17","17.39","16.94","9.16M","-0.93%"
"Nov 13, 2015","17.21","17.02","17.29","16.91","9.26M","1.12%"
"Nov 16, 2015","17.17","17.18","17.34","17.02","13.42M","-0.23%"
"Nov 17, 2015","17.23","17.39","17.39","17.19","6.54M","0.35%"
"Nov 18, 2015","17.27","17.23","17.50","17.18","8.34M","0.23%"
"Nov 19, 2015","17.44","17.49","17.53","17.27","11.74M","0.98%"
"Nov 23, 2015","17.18","17.45","17.57","17.15","13.87M","-1.49%"
"Nov 24, 2015","17.07","17.17","17.18","16.91","6.86M","-0.64%"
"Nov 25, 2015","16.76","16.87","17.02","16.62","18.37M","-1.82%"
"Nov 26, 2015","16.95","16.76","17.01","16.74","7.71M","1.13%"
"Nov 27, 2015","16.73","16.91","16.95","16.72","9.03M","-1.30%"
"Nov 30, 2015","16.80","16.63","17.10","16.58","39.75M","0.42%"
"Dec 01, 2015","16.88","16.83","16.92","16.67","20.95M","0.48%"
"Dec 02, 2015","16.62","16.82","16.90","16.60","14.09M","-1.54%"
"Dec 03, 2015","16.90","17.17","17.19","16.73","12.20M","1.68%"
"Dec 04, 2015","16.71","16.84","17.01","16.65","10.02M","-1.12%"
"Dec 07, 2015","16.76","16.80","16.92","16.67","8.87M","0.30%"
"Dec 08, 2015","16.35","16.76","16.87","16.31","11.31M","-2.45%"
"Dec 09, 2015","16.65","16.57","16.86","16.45","16.41M","1.83%"
"Dec 10, 2015","16.49","16.73","16.73","16.33","7.61M","-0.96%"
"Dec 11, 2015","16.47","16.41","16.74","16.37","12.96M","-0.12%"
"Dec 14, 2015","16.27","16.45","16.54","16.22","5.57M","-1.21%"
"Dec 15, 2015","16.09","16.36","16.47","16.09","7.73M","-1.11%"
"Dec 16, 2015","16.35","16.01","16.45","15.96","7.50M","1.62%"
"Dec 17, 2015","16.36","16.63","16.98","16.21","12.17M","0.06%"
"Dec 18, 2015","16.04","16.09","16.32","15.91","17.61M","-1.96%"
"Dec 21, 2015","16.22","16.04","16.49","16.04","10.02M","1.12%"
"Dec 22, 2015","16.31","16.36","16.38","16.02","8.18M","0.55%"
"Dec 23, 2015","16.54","16.40","16.58","16.27","17.34M","1.41%"
"Dec 28, 2015","16.48","16.47","16.56","16.36","6.94M","-0.36%"
"Dec 29, 2015","16.54","16.44","16.62","16.40","5.35M","0.36%"
"Dec 30, 2015","16.22","16.46","16.62","16.22","12.12M","-1.93%"
"Jan 04, 2016","15.64","16.11","16.11","15.64","13.21M","-3.58%"
"Jan 05, 2016","15.88","15.68","15.92","15.55","10.77M","1.53%"
"Jan 06, 2016","15.73","15.78","15.88","15.63","7.74M","-0.94%"
"Jan 07, 2016","15.31","15.60","15.74","15.31","15.32M","-2.67%"
"Jan 08, 2016","15.51","15.38","15.63","15.38","10.68M","1.31%"
"Jan 11, 2016","15.27","15.62","15.71","15.22","12.77M","-1.55%"
"Jan 12, 2016","15.43","15.39","15.48","15.25","9.57M","1.05%"
"Jan 13, 2016","15.29","15.56","15.68","15.19","10.71M","-0.91%"
"Jan 14, 2016","15.31","15.39","15.39","15.01","12.33M","0.13%"
"Jan 15, 2016","15.08","15.13","15.18","14.53","19.87M","-1.50%"
"Jan 18, 2016","14.76","15.02","15.05","14.76","9.27M","-2.12%"
"Jan 19, 2016","15.22","15.00","15.31","14.91","9.63M","3.12%"
"Jan 20, 2016","15.03","15.02","15.21","14.82","12.36M","-1.25%"
"Jan 21, 2016","14.83","15.02","15.13","14.72","11.05M","-1.33%"
"Jan 22, 2016","15.31","14.92","15.31","14.92","15.56M","3.24%"
"Jan 26, 2016","15.30","15.18","15.35","15.04","13.89M","-0.07%"
"Jan 27, 2016","16.19","15.28","16.32","15.27","28.37M","5.82%"
"Jan 28, 2016","16.26","16.21","16.64","15.92","17.34M","0.43%"
"Jan 29, 2016","16.96","16.45","16.96","16.32","20.67M","4.31%"
"Feb 01, 2016","16.84","16.76","16.97","16.39","12.67M","-0.71%"
"Feb 02, 2016","16.45","16.57","16.84","16.40","16.35M","-2.32%"
"Feb 03, 2016","16.56","16.58","16.61","16.11","11.41M","0.67%"
"Feb 04, 2016","16.80","16.78","17.09","16.70","18.56M","1.45%"
"Feb 05, 2016","16.60","16.84","17.07","16.54","10.97M","-1.19%"
"Feb 10, 2016","16.42","16.43","16.47","16.08","11.69M","-1.08%"
"Feb 11, 2016","16.33","16.16","16.34","16.04","11.96M","-0.55%"
"Feb 12, 2016","16.40","16.45","16.54","16.26","9.63M","0.43%"
"Feb 15, 2016","16.40","16.54","16.64","16.33","6.38M","0.00%"
"Feb 16, 2016","16.44","16.45","16.68","16.36","10.30M","0.24%"
"Feb 17, 2016","16.71","16.61","17.06","16.49","18.80M","1.64%"
"Feb 18, 2016","16.84","16.58","16.84","16.55","9.99M","0.78%"
"Feb 19, 2016","16.76","16.70","16.83","16.57","6.64M","-0.48%"
"Feb 22, 2016","17.01","17.08","17.22","16.87","14.70M","1.49%"
"Feb 23, 2016","16.71","17.07","17.07","16.56","11.39M","-1.76%"
"Feb 24, 2016","16.64","16.53","16.64","16.33","10.04M","-0.42%"
"Feb 25, 2016","16.21","16.18","16.33","15.99","15.40M","-2.58%"
"Feb 26, 2016","16.13","16.37","16.41","16.02","9.26M","-0.49%"
"Feb 29, 2016","16.14","16.38","16.46","16.02","15.34M","0.06%"
"Mar 01, 2016","16.70","16.27","16.83","16.17","17.55M","3.47%"
"Mar 02, 2016","16.60","16.75","16.82","16.43","16.03M","-0.60%"
"Mar 03, 2016","16.87","16.72","17.01","16.61","21.51M","1.63%"
"Mar 04, 2016","17.49","17.19","17.57","17.03","37.21M","3.68%"
"Mar 07, 2016","17.54","17.57","17.74","17.33","17.08M","0.29%"
"Mar 08, 2016","17.43","17.56","17.59","17.24","23.25M","-0.63%"
"Mar 09, 2016","17.07","17.61","17.62","17.00","21.46M","-2.07%"
"Mar 10, 2016","17.05","17.18","17.36","16.69","28.07M","-0.12%"
"Mar 11, 2016","16.67","16.95","17.19","16.51","22.64M","-2.23%"
"Mar 14, 2016","16.51","16.70","16.78","16.40","10.95M","-0.96%"
"Mar 15, 2016","16.75","16.38","16.75","16.29","12.35M","1.45%"
"Mar 16, 2016","16.74","16.64","16.75","16.35","12.53M","-0.06%"
"Mar 17, 2016","17.14","17.11","17.15","16.76","26.72M","2.39%"
"Mar 18, 2016","16.86","17.19","17.29","16.81","26.77M","-1.63%"
"Mar 21, 2016","17.14","16.76","17.19","16.76","14.70M","1.66%"
"Mar 22, 2016","17.15","17.11","17.15","16.92","10.43M","0.06%"
"Mar 23, 2016","17.39","17.06","17.47","17.02","19.01M","1.40%"
"Mar 24, 2016","17.39","17.29","17.57","17.24","21.00M","0.00%"
"Mar 28, 2016","17.66","17.52","17.73","17.45","12.37M","1.55%"
"Mar 29, 2016","17.70","17.68","17.91","17.62","20.84M","0.23%"
"Mar 30, 2016","17.52","17.84","17.84","17.50","11.04M","-1.02%"
"Mar 31, 2016","17.22","17.30","17.43","17.02","16.74M","-1.71%"
"Apr 01, 2016","17.26","16.96","17.38","16.96","14.93M","0.23%"
"Apr 04, 2016","17.00","17.11","17.14","16.89","8.56M","-1.51%"
"Apr 05, 2016","17.19","16.92","17.27","16.84","7.87M","1.12%"
"Apr 06, 2016","17.00","16.98","17.14","16.88","6.60M","-1.11%"
"Apr 07, 2016","16.99","17.11","17.34","16.97","8.01M","-0.06%"
"Apr 08, 2016","16.99","17.22","17.35","16.84","17.37M","0.00%"
"Apr 11, 2016","16.65","17.11","17.12","16.65","14.47M","-2.00%"
"Apr 12, 2016","16.81","16.67","16.88","16.61","10.88M","0.96%"
"Apr 13, 2016","16.83","16.98","17.12","16.81","19.83M","0.12%"
"Apr 14, 2016","17.15","16.83","17.24","16.79","16.36M","1.90%"
"Apr 15, 2016","17.38","17.19","17.43","17.10","14.98M","1.34%"
"Apr 18, 2016","17.35","17.38","17.50","17.20","13.39M","-0.17%"
"Apr 19, 2016","17.53","17.39","17.65","17.22","10.83M","1.04%"
"Apr 20, 2016","17.57","17.40","17.64","17.40","13.66M","0.23%"
"Apr 22, 2016","17.53","17.26","17.80","17.26","12.39M","-0.23%"
"Apr 25, 2016","17.51","17.57","17.60","17.43","5.57M","-0.11%"
"Apr 26, 2016","17.61","17.58","17.62","17.44","13.14M","0.57%"
"Apr 27, 2016","17.72","17.69","17.78","17.54","17.89M","0.62%"
"Apr 28, 2016","17.81","17.69","17.87","17.62","11.97M","0.51%"
"Apr 29, 2016","17.74","17.80","17.80","17.46","23.82M","-0.39%"
"May 02, 2016","17.85","17.71","17.93","17.71","10.84M","0.62%"
"May 03, 2016","17.93","17.73","18.04","17.58","14.31M","0.45%"
"May 04, 2016","17.94","17.64","17.95","17.47","18.98M","0.06%"
"May 05, 2016","17.51","17.92","17.93","17.49","11.51M","-2.40%"
"May 06, 2016","17.24","17.47","17.62","17.22","10.96M","-1.54%"
"May 09, 2016","17.29","17.19","17.44","17.02","18.47M","0.29%"
"May 10, 2016","17.47","17.48","17.49","17.21","12.17M","1.04%"
"May 11, 2016","17.26","17.57","17.58","17.21","10.65M","-1.20%"
"May 12, 2016","17.55","17.36","17.62","17.21","23.57M","1.68%"
"May 13, 2016","17.17","17.62","17.62","17.12","10.13M","-2.17%"
"May 16, 2016","17.18","17.02","17.26","17.02","6.38M","0.06%"
"May 17, 2016","16.98","17.13","17.18","16.87","11.18M","-1.16%"
"May 18, 2016","16.84","16.92","17.08","16.81","12.83M","-0.82%"
"May 19, 2016","17.02","16.76","17.09","16.75","12.23M","1.07%"
"May 20, 2016","16.97","17.02","17.12","16.94","7.36M","-0.29%"
"May 23, 2016","16.87","16.76","16.94","16.76","8.80M","-0.59%"
"May 24, 2016","17.10","16.97","17.15","16.87","7.03M","1.36%"
"May 25, 2016","17.37","17.16","17.54","17.09","21.08M","1.58%"
"May 27, 2016","17.66","17.34","17.73","17.32","15.25M","1.67%"
"May 30, 2016","17.52","17.56","17.62","17.45","3.84M","-0.79%"
"May 31, 2016","17.49","17.48","17.60","17.34","21.75M","-0.17%"
"Jun 01, 2016","17.70","17.38","17.73","17.30","12.64M","1.20%"
"Jun 02, 2016","17.64","17.66","17.67","17.45","12.17M","-0.34%"
"Jun 03, 2016","17.84","17.70","17.92","17.63","15.22M","1.13%"
"Jun 06, 2016","17.77","17.83","17.94","17.68","8.48M","-0.39%"
"Jun 07, 2016","17.47","17.73","17.76","17.36","12.64M","-1.69%"
"Jun 08, 2016","17.63","17.43","17.70","17.37","16.17M","0.92%"
"Jun 09, 2016","17.53","17.57","17.65","17.42","8.33M","-0.57%"
"Jun 10, 2016","17.13","17.52","17.52","17.13","12.84M","-2.28%"
"Jun 13, 2016","17.30","16.99","17.34","16.99","8.28M","0.99%"
"Jun 14, 2016","16.99","17.25","17.29","16.86","16.10M","-1.79%"
"Jun 15, 2016","16.91","17.02","17.17","16.75","18.86M","-0.47%"
"Jun 16, 2016","17.08","16.76","17.19","16.76","9.98M","1.01%"
"Jun 17, 2016","17.03","17.18","17.19","16.82","15.91M","-0.29%"
"Jun 20, 2016","17.01","17.14","17.24","16.93","12.83M","-0.12%"
"Jun 21, 2016","17.00","17.08","17.10","16.92","13.34M","-0.06%"
"Jun 22, 2016","16.76","17.01","17.04","16.69","15.29M","-1.41%"
"Jun 23, 2016","16.94","16.84","17.07","16.82","7.58M","1.07%"
"Jun 24, 2016","16.91","16.56","16.97","16.54","11.67M","-0.18%"
"Jun 27, 2016","17.12","16.73","17.27","16.67","10.17M","1.24%"
"Jun 28, 2016","17.16","17.30","17.33","17.08","13.43M","0.23%"
"Jun 29, 2016","17.40","17.31","17.51","17.19","14.04M","1.40%"
"Jun 30, 2016","17.43","17.39","17.49","17.20","15.32M","0.17%"
"Jul 01, 2016","17.59","17.46","17.59","17.38","22.75M","0.92%"
"Jul 04, 2016","17.44","17.59","17.65","17.37","6.69M","-0.85%"
"Jul 05, 2016","17.65","17.36","17.68","17.35","13.36M","1.20%"
"Jul 06, 2016","17.55","17.60","17.64","17.36","11.24M","-0.57%"
"Jul 07, 2016","17.48","17.55","17.66","17.40","8.91M","-0.40%"
"Jul 08, 2016","17.75","17.55","17.91","17.48","12.45M","1.54%"
"Jul 11, 2016","17.75","17.80","17.80","17.58","10.30M","0.00%"
"Jul 12, 2016","17.78","17.84","17.86","17.70","7.60M","0.17%"
"Jul 13, 2016","17.60","17.64","17.71","17.52","11.30M","-1.01%"
"Jul 14, 2016","17.60","17.69","17.69","17.51","16.51M","0.00%"
"Jul 15, 2016","17.46","17.59","17.60","17.37","8.99M","-0.80%"
"Jul 18, 2016","17.56","17.46","17.60","17.42","11.53M","0.57%"
"Jul 19, 2016","17.66","17.55","17.68","17.48","8.89M","0.57%"
"Jul 20, 2016","17.61","17.61","17.74","17.51","9.99M","-0.28%"
"Jul 21, 2016","17.69","17.61","17.73","17.46","7.73M","0.45%"
"Jul 22, 2016","17.86","17.73","17.93","17.61","8.90M","0.96%"
"Jul 25, 2016","17.86","17.80","17.89","17.68","9.49M","0.00%"
"Jul 26, 2016","17.83","17.87","17.98","17.69","7.29M","-0.17%"
"Jul 27, 2016","17.80","17.92","17.92","17.74","6.20M","-0.17%"
"Jul 28, 2016","17.91","17.78","17.93","17.71","7.43M","0.62%"
"Jul 29, 2016","17.32","17.43","17.56","17.24","32.53M","-3.29%"
"Aug 01, 2016","17.50","17.40","17.56","17.16","10.20M","1.04%"
"Aug 02, 2016","17.36","17.44","17.48","17.25","7.87M","-0.80%"
"Aug 03, 2016","17.17","17.27","17.35","17.13","11.59M","-1.09%"
"Aug 04, 2016","17.25","17.26","17.33","17.01","11.24M","0.47%"
"Aug 05, 2016","17.60","17.29","17.60","17.25","12.05M","2.03%"
"Aug 08, 2016","17.73","17.49","17.80","17.49","11.05M","0.74%"
"Aug 09, 2016","17.74","17.73","17.82","17.61","7.20M","0.06%"
"Aug 10, 2016","17.66","17.76","17.78","17.58","12.05M","-0.45%"
"Aug 11, 2016","17.96","17.74","17.96","17.51","18.44M","1.70%"
"Aug 12, 2016","18.18","17.94","18.22","17.91","15.35M","1.22%"
"Aug 15, 2016","18.37","18.12","18.46","18.08","8.74M","1.05%"
"Aug 16, 2016","18.43","18.16","18.51","18.16","11.57M","0.33%"
"Aug 17, 2016","18.47","18.37","18.50","18.25","25.34M","0.22%"
"Aug 18, 2016","18.35","18.47","18.49","18.24","9.41M","-0.65%"
"Aug 19, 2016","18.29","18.26","18.39","18.19","6.20M","-0.33%"
"Aug 22, 2016","18.05","18.29","18.32","17.99","10.91M","-1.31%"
"Aug 23, 2016","18.04","18.10","18.17","17.97","12.22M","-0.06%"
"Aug 24, 2016","18.04","17.96","18.11","17.93","8.35M","0.00%"
"Aug 25, 2016","17.79","18.05","18.19","17.74","14.00M","-1.39%"
"Aug 26, 2016","17.68","17.89","17.89","17.59","11.05M","-0.62%"
"Aug 29, 2016","17.73","17.65","17.84","17.54","13.28M","0.28%"
"Aug 30, 2016","17.73","17.74","17.80","17.62","7.78M","0.00%"
"Aug 31, 2016","17.68","17.71","17.73","17.54","17.60M","-0.28%"
"Sep 01, 2016","18.12","17.55","18.18","17.49","27.97M","2.49%"
"Sep 02, 2016","18.28","18.21","18.31","18.12","16.48M","0.88%"
"Sep 05, 2016","18.31","18.35","18.41","18.20","4.20M","0.16%"
"Sep 06, 2016","18.43","18.33","18.43","18.27","12.44M","0.66%"
"Sep 08, 2016","18.43","18.37","18.43","18.19","18.33M","0.00%"
"Sep 09, 2016","18.19","18.24","18.31","18.11","17.24M","-1.30%"
"Sep 12, 2016","18.19","18.06","18.28","18.06","14.24M","0.00%"
"Sep 13, 2016","17.89","18.06","18.18","17.80","15.06M","-1.65%"
"Sep 14, 2016","18.11","17.84","18.24","17.73","11.98M","1.23%"
"Sep 15, 2016","18.18","18.18","18.28","18.12","5.39M","0.39%"
"Sep 16, 2016","17.90","18.12","18.13","17.81","12.43M","-1.54%"
"Sep 19, 2016","17.92","18.04","18.05","17.83","6.14M","0.11%"
"Sep 20, 2016","17.96","18.01","18.03","17.86","8.19M","0.22%"
"Sep 21, 2016","17.93","17.92","18.07","17.77","9.49M","-0.17%"
"Sep 22, 2016","18.12","18.13","18.17","18.00","10.24M","1.06%"
"Sep 23, 2016","18.18","18.24","18.26","18.07","9.32M","0.33%"
"Sep 26, 2016","18.08","18.07","18.09","17.96","7.88M","-0.55%"
"Sep 27, 2016","18.15","18.12","18.20","17.93","7.24M","0.39%"
"Sep 28, 2016","18.29","18.23","18.34","18.14","8.32M","0.77%"
"Sep 29, 2016","18.17","18.30","18.34","18.07","9.46M","-0.66%"
"Sep 30, 2016","18.26","18.17","18.40","18.17","8.72M","0.50%"
"Oct 03, 2016","18.19","18.16","18.27","18.11","14.06M","-0.38%"
"Oct 04, 2016","18.00","18.22","18.22","17.96","15.79M","-1.04%"
"Oct 05, 2016","18.05","18.08","18.19","18.01","8.67M","0.28%"
"Oct 06, 2016","18.10","18.05","18.17","17.95","13.26M","0.28%"
"Oct 07, 2016","18.10","18.17","18.19","17.97","10.86M","0.00%"
"Oct 10, 2016","18.13","18.18","18.22","18.08","6.06M","0.17%"
"Oct 11, 2016","17.92","18.08","18.13","17.86","14.58M","-1.16%"
"Oct 13, 2016","17.72","17.78","17.89","17.43","21.97M","-1.12%"
"Oct 14, 2016","17.99","17.74","18.04","17.67","20.37M","1.52%"
"Oct 17, 2016","18.02","17.95","18.19","17.83","9.69M","0.17%"
"Oct 18, 2016","18.10","18.02","18.20","17.92","12.34M","0.44%"
"Oct 19, 2016","18.13","18.09","18.18","18.05","5.85M","0.17%"
"Oct 20, 2016","18.10","18.14","18.19","18.00","4.59M","-0.17%"
"Oct 21, 2016","18.19","18.12","18.30","17.96","21.29M","0.50%"
"Oct 24, 2016","18.15","18.17","18.25","18.09","10.11M","-0.22%"
"Oct 25, 2016","17.99","18.08","18.12","17.94","9.28M","-0.88%"
"Oct 26, 2016","18.00","17.96","18.08","17.84","9.04M","0.06%"
"Oct 27, 2016","17.96","17.97","18.08","17.90","7.80M","-0.22%"
"Oct 28, 2016","17.60","17.32","17.77","17.25","35.12M","-2.00%"
"Oct 31, 2016","17.35","17.61","17.67","17.35","17.59M","-1.42%"
"Nov 01, 2016","17.03","17.46","17.51","17.03","19.06M","-1.84%"
"Nov 03, 2016","16.63","17.03","17.20","16.61","22.71M","-2.35%"
"Nov 04, 2016","16.46","16.72","16.83","16.43","20.35M","-1.02%"
"Nov 07, 2016","16.72","16.67","16.82","16.51","11.22M","1.58%"
"Nov 08, 2016","16.78","16.72","16.85","16.53","8.06M","0.36%"
"Nov 09, 2016","16.66","16.52","16.81","16.27","14.83M","-0.72%"
"Nov 10, 2016","16.77","16.76","16.94","16.27","28.02M","0.66%"
"Nov 11, 2016","16.21","16.41","16.82","16.16","23.95M","-3.34%"
"Nov 14, 2016","16.07","16.16","16.34","15.97","20.27M","-0.86%"
"Nov 16, 2016","16.57","16.12","16.59","16.06","11.54M","3.11%"
"Nov 17, 2016","16.37","16.66","16.66","16.35","7.93M","-1.21%"
"Nov 18, 2016","16.09","16.37","16.40","15.84","14.80M","-1.71%"
"Nov 21, 2016","16.21","16.10","16.28","16.07","10.98M","0.75%"
"Nov 22, 2016","15.95","16.39","16.47","15.91","12.79M","-1.60%"
"Nov 23, 2016","16.39","15.94","16.39","15.82","11.65M","2.76%"
"Nov 24, 2016","16.12","16.38","16.40","16.10","5.98M","-1.65%"
"Nov 25, 2016","16.01","16.03","16.12","15.84","6.45M","-0.68%"
"Nov 28, 2016","16.31","16.03","16.31","15.94","8.69M","1.87%"
"Nov 29, 2016","15.85","16.23","16.24","15.85","13.47M","-2.82%"
"Nov 30, 2016","15.93","16.07","16.51","15.88","20.40M","0.50%"
"Dec 01, 2016","15.45","15.80","15.85","15.33","28.77M","-3.01%"
"Dec 02, 2016","15.53","15.42","15.53","15.11","22.66M","0.52%"
"Dec 05, 2016","15.29","15.59","15.67","15.24","9.09M","-1.55%"
"Dec 06, 2016","15.56","15.22","15.56","15.15","11.01M","1.77%"
"Dec 07, 2016","15.46","15.64","15.69","15.44","10.91M","-0.64%"
"Dec 08, 2016","15.29","15.57","15.66","15.26","10.19M","-1.10%"
"Dec 09, 2016","15.46","15.37","15.61","15.26","14.66M","1.11%"
"Dec 12, 2016","14.97","15.25","15.38","14.89","12.48M","-3.17%"
"Dec 13, 2016","15.14","15.01","15.19","14.89","19.70M","1.14%"
"Dec 14, 2016","15.02","15.13","15.30","14.88","20.37M","-0.79%"
"Dec 15, 2016","15.16","14.96","15.36","14.89","15.84M","0.93%"
"Dec 16, 2016","15.50","15.23","15.53","15.18","23.24M","2.24%"
"Dec 19, 2016","15.15","15.42","15.56","15.13","13.28M","-2.26%"
"Dec 20, 2016","15.24","15.19","15.36","14.95","13.46M","0.59%"
"Dec 21, 2016","15.18","15.20","15.34","15.10","10.47M","-0.39%"
"Dec 22, 2016","14.90","15.28","15.30","14.87","13.06M","-1.84%"
"Dec 23, 2016","15.07","14.97","15.13","14.94","6.73M","1.14%"
"Dec 26, 2016","15.24","15.09","15.37","15.09","2.62M","1.13%"
"Dec 27, 2016","15.17","15.26","15.34","15.14","5.66M","-0.46%"
"Dec 28, 2016","15.29","15.19","15.35","15.18","5.00M","0.79%"
"Dec 29, 2016","15.45","15.33","15.45","15.22","8.69M","1.05%"
"Jan 02, 2017","15.36","15.39","15.69","15.31","4.27M","-0.58%"
"Jan 03, 2017","15.67","15.54","15.70","15.48","9.54M","2.02%"
"Jan 04, 2017","15.55","15.69","15.69","15.47","9.43M","-0.77%"
"Jan 05, 2017","15.63","15.56","15.78","15.52","11.56M","0.51%"
"Jan 06, 2017","15.50","15.63","15.67","15.41","7.86M","-0.83%"
"Jan 09, 2017","15.57","15.50","15.77","15.42","8.75M","0.45%"
"Jan 10, 2017","15.39","15.65","15.70","15.36","7.89M","-1.16%"
"Jan 11, 2017","15.46","15.48","15.53","15.23","9.69M","0.45%"
"Jan 12, 2017","15.95","15.64","16.03","15.59","18.34M","3.17%"
"Jan 13, 2017","16.11","16.10","16.13","15.79","10.10M","1.00%"
"Jan 16, 2017","16.06","16.14","16.20","15.92","8.20M","-0.31%"
"Jan 17, 2017","16.20","15.99","16.20","15.82","18.26M","0.87%"
"Jan 18, 2017","16.26","16.22","16.52","16.06","18.81M","0.37%"
"Jan 19, 2017","16.29","16.27","16.48","16.15","10.83M","0.18%"
"Jan 20, 2017","16.34","16.48","16.48","16.17","9.86M","0.31%"
"Jan 23, 2017","16.33","16.30","16.39","16.17","6.56M","-0.06%"
"Jan 24, 2017","16.36","16.34","16.50","16.20","11.14M","0.18%"
"Jan 26, 2017","16.37","16.42","16.52","16.36","7.79M","0.06%"
"Jan 27, 2017","16.38","16.36","16.44","16.09","13.21M","0.06%"
"Jan 30, 2017","16.05","16.30","16.38","15.97","6.12M","-2.01%"
"Jan 31, 2017","16.27","16.01","16.31","15.99","7.06M","1.37%"
"Feb 01, 2017","16.38","16.33","16.48","16.29","10.99M","0.68%"
"Feb 02, 2017","16.23","16.30","16.40","16.18","6.40M","-0.92%"
"Feb 03, 2017","16.41","16.14","16.45","16.02","13.56M","1.11%"
"Feb 06, 2017","16.14","16.44","16.44","16.10","6.60M","-1.65%"
"Feb 07, 2017","16.09","16.17","16.32","16.09","9.30M","-0.31%"
"Feb 08, 2017","16.04","16.10","16.17","15.90","13.10M","-0.31%"
"Feb 09, 2017","15.97","16.07","16.15","15.92","11.00M","-0.44%"
"Feb 10, 2017","16.21","15.97","16.29","15.88","12.69M","1.50%"
"Feb 13, 2017","16.31","16.27","16.43","16.13","9.01M","0.62%"
"Feb 14, 2017","16.44","16.34","16.58","16.29","10.67M","0.80%"
"Feb 15, 2017","17.04","16.55","17.10","16.51","18.16M","3.65%"
"Feb 16, 2017","16.99","16.92","17.08","16.88","12.17M","-0.29%"
"Feb 17, 2017","16.93","16.97","17.03","16.83","7.03M","-0.35%"
"Feb 20, 2017","16.87","17.00","17.03","16.81","3.51M","-0.35%"
"Feb 21, 2017","17.09","16.96","17.12","16.88","8.32M","1.30%"
"Feb 22, 2017","17.29","17.14","17.40","17.13","11.23M","1.17%"
"Feb 23, 2017","17.14","17.31","17.58","17.13","10.93M","-0.87%"
"Feb 24, 2017","16.87","17.02","17.11","16.82","12.95M","-1.58%"
"Mar 01, 2017","16.94","17.01","17.17","16.85","8.76M","0.41%"
"Mar 02, 2017","16.27","16.36","16.52","16.22","19.52M","-3.96%"
"Mar 03, 2017","16.44","16.33","16.49","16.15","12.02M","1.04%"
"Mar 06, 2017","16.31","16.40","16.44","16.09","11.99M","-0.79%"
"Mar 07, 2017","15.91","16.27","16.28","15.91","17.65M","-2.45%"
"Mar 08, 2017","16.19","15.92","16.29","15.84","21.30M","1.76%"
"Mar 09, 2017","16.36","16.17","16.44","16.13","13.08M","1.05%"
"Mar 10, 2017","16.36","16.41","16.52","16.31","12.39M","0.00%"
"Mar 13, 2017","16.42","16.41","16.54","16.36","6.25M","0.37%"
"Mar 14, 2017","16.17","16.37","16.46","16.17","7.29M","-1.52%"
"Mar 15, 2017","16.36","16.09","16.40","16.09","12.78M","1.18%"
"Mar 16, 2017","16.34","16.37","16.44","16.20","5.85M","-0.12%"
"Mar 17, 2017","16.27","16.40","16.51","16.17","17.10M","-0.43%"
"Mar 20, 2017","16.68","16.41","16.81","16.19","14.22M","2.52%"
"Mar 21, 2017","16.47","16.74","16.74","16.44","10.14M","-1.26%"
"Mar 22, 2017","16.37","16.43","16.52","16.22","8.52M","-0.61%"
"Mar 23, 2017","16.49","16.26","16.63","16.20","9.14M","0.73%"
"Mar 24, 2017","16.67","16.48","16.67","16.47","7.80M","1.09%"
"Mar 27, 2017","16.82","16.58","16.86","16.55","8.72M","0.90%"
"Mar 28, 2017","16.96","16.79","16.96","16.73","9.86M","0.83%"
"Mar 29, 2017","17.19","16.96","17.19","16.91","9.50M","1.36%"
"Mar 30, 2017","17.28","17.18","17.33","17.09","9.16M","0.52%"
"Mar 31, 2017","17.25","17.23","17.37","17.18","12.28M","-0.17%"
"Apr 03, 2017","17.02","17.21","17.25","17.02","13.48M","-1.33%"
"Apr 04, 2017","17.13","17.03","17.13","16.91","5.53M","0.65%"
"Apr 05, 2017","16.91","17.10","17.19","16.84","8.66M","-1.28%"
"Apr 06, 2017","17.00","16.91","17.07","16.80","9.73M","0.53%"
"Apr 07, 2017","17.07","17.02","17.14","16.95","8.06M","0.41%"
"Apr 10, 2017","17.02","17.12","17.15","16.94","15.47M","-0.29%"
"Apr 11, 2017","16.66","17.02","17.08","16.45","24.85M","-2.12%"
"Apr 12, 2017","16.71","16.69","16.85","16.61","19.69M","0.30%"
"Apr 13, 2017","16.79","16.62","16.94","16.55","14.98M","0.48%"
"Apr 17, 2017","17.08","16.83","17.15","16.76","11.64M","1.73%"
"Apr 18, 2017","17.17","17.03","17.25","17.03","11.85M","0.53%"
"Apr 19, 2017","17.12","17.18","17.20","17.01","24.67M","-0.29%"
"Apr 20, 2017","17.00","17.01","17.20","16.95","11.18M","-0.70%"
"Apr 24, 2017","17.05","17.16","17.19","16.98","9.17M","0.29%"
"Apr 25, 2017","17.32","17.05","17.40","16.99","12.05M","1.58%"
"Apr 26, 2017","17.22","17.31","17.31","17.12","7.98M","-0.58%"
"Apr 27, 2017","17.21","17.23","17.25","17.03","12.84M","-0.06%"
"Apr 28, 2017","17.27","17.21","17.40","17.14","10.39M","0.35%"
"May 02, 2017","17.56","17.37","17.62","17.28","11.28M","1.68%"
"May 03, 2017","17.55","17.56","17.62","17.34","9.62M","-0.06%"
"May 04, 2017","18.00","17.59","18.18","17.47","35.52M","2.56%"
"May 05, 2017","17.87","17.91","18.00","17.83","8.52M","-0.72%"
"May 08, 2017","17.86","17.82","17.90","17.75","9.41M","-0.06%"
"May 09, 2017","17.92","17.91","18.02","17.78","11.32M","0.34%"
"May 10, 2017","18.15","17.97","18.20","17.91","11.33M","1.28%"
"May 11, 2017","18.47","18.11","18.52","18.08","22.82M","1.76%"
"May 12, 2017","18.62","18.51","18.71","18.42","10.65M","0.81%"
"May 15, 2017","18.67","18.63","18.77","18.42","10.81M","0.27%"
"May 16, 2017","18.74","18.61","18.78","18.54","13.41M","0.37%"
"May 17, 2017","18.57","18.60","18.84","18.45","12.20M","-0.91%"
"May 18, 2017","17.78","17.26","18.17","17.07","47.04M","-4.25%"
"May 19, 2017","17.61","17.66","17.96","17.40","27.39M","-0.96%"
"May 22, 2017","17.56","17.44","17.81","17.44","25.82M","-0.28%"
"May 23, 2017","17.86","17.56","17.95","17.56","16.46M","1.71%"
"May 24, 2017","17.83","18.04","18.10","17.82","10.18M","-0.17%"
"May 25, 2017","17.89","17.93","18.01","17.75","8.84M","0.34%"
"May 26, 2017","18.00","17.97","18.04","17.81","11.82M","0.61%"
"May 29, 2017","17.85","17.96","17.96","17.78","4.54M","-0.83%"
"May 30, 2017","17.77","17.88","17.91","17.77","9.43M","-0.45%"
"May 31, 2017","17.69","17.79","17.85","17.61","14.47M","-0.45%"
"Jun 01, 2017","17.54","17.70","17.81","17.52","17.82M","-0.85%"
"Jun 02, 2017","17.56","17.60","17.74","17.31","27.92M","0.11%"
"Jun 05, 2017","17.88","17.51","17.95","17.49","16.49M","1.82%"
"Jun 06, 2017","18.03","17.84","18.14","17.83","15.89M","0.84%"
"Jun 07, 2017","17.82","18.11","18.17","17.72","12.36M","-1.16%"
"Jun 08, 2017","17.52","17.71","17.77","17.52","13.75M","-1.68%"
"Jun 09, 2017","17.13","17.61","17.66","17.00","19.88M","-2.23%"
"Jun 12, 2017","17.10","17.08","17.21","16.96","14.44M","-0.18%"
"Jun 13, 2017","17.39","17.13","17.42","17.13","13.08M","1.70%"
"Jun 14, 2017","17.19","17.36","17.49","17.02","25.73M","-1.15%"
"Jun 16, 2017","16.81","17.23","17.23","16.78","45.42M","-2.21%"
"Jun 19, 2017","16.90","16.87","17.01","16.70","18.89M","0.54%"
"Jun 20, 2017","17.09","16.92","17.28","16.84","22.67M","1.12%"
"Jun 21, 2017","17.14","17.10","17.28","17.01","11.81M","0.29%"
"Jun 22, 2017","17.21","17.17","17.32","17.12","7.72M","0.41%"
"Jun 23, 2017","17.25","17.31","17.31","17.13","4.62M","0.23%"
"Jun 26, 2017","17.43","17.39","17.54","17.33","7.48M","1.04%"
"Jun 27, 2017","17.45","17.43","17.52","17.23","23.28M","0.11%"
"Jun 28, 2017","17.46","17.53","17.56","17.31","8.75M","0.06%"
"Jun 29, 2017","17.41","17.46","17.52","17.27","6.24M","-0.29%"
"Jun 30, 2017","17.47","17.43","17.57","17.41","6.95M","0.34%"
"Jul 03, 2017","17.44","17.52","17.59","17.36","5.34M","-0.17%"
"Jul 04, 2017","17.40","17.35","17.47","17.35","2.68M","-0.23%"
"Jul 05, 2017","17.38","17.38","17.53","17.30","9.16M","-0.11%"
"Jul 06, 2017","16.96","17.38","17.40","16.91","19.26M","-2.42%"
"Jul 07, 2017","17.19","17.05","17.32","17.01","14.32M","1.36%"
"Jul 10, 2017","17.47","17.22","17.53","17.17","10.14M","1.63%"
"Jul 11, 2017","17.67","17.47","17.77","17.38","10.15M","1.14%"
"Jul 12, 2017","17.79","17.74","17.91","17.63","13.15M","0.68%"
"Jul 13, 2017","17.82","17.88","17.90","17.70","6.50M","0.17%"
"Jul 14, 2017","17.89","17.83","17.96","17.80","5.51M","0.39%"
"Jul 17, 2017","17.97","17.94","18.05","17.85","10.14M","0.45%"
"Jul 18, 2017","17.89","18.01","18.01","17.79","6.02M","-0.45%"
"Jul 19, 2017","17.95","18.01","18.01","17.80","10.71M","0.34%"
"Jul 20, 2017","17.92","17.90","18.02","17.85","7.84M","-0.17%"
"Jul 21, 2017","17.95","17.87","17.98","17.80","3.77M","0.17%"
"Jul 24, 2017","17.95","17.95","18.05","17.90","4.27M","0.00%"
"Jul 25, 2017","18.01","18.01","18.12","17.97","13.66M","0.33%"
"Jul 26, 2017","17.96","17.98","18.08","17.89","6.31M","-0.28%"
"Jul 27, 2017","18.23","18.01","18.52","18.01","19.34M","1.50%"
"Jul 28, 2017","18.22","18.09","18.34","18.05","10.98M","-0.05%"
"Jul 31, 2017","18.27","18.21","18.48","18.19","15.20M","0.27%"
"Aug 01, 2017","18.36","18.28","18.41","18.21","8.84M","0.49%"
"Aug 02, 2017","18.51","18.29","18.54","18.26","14.95M","0.82%"
"Aug 03, 2017","18.37","18.48","18.51","18.35","9.88M","-0.76%"
"Aug 04, 2017","18.37","18.39","18.42","18.22","8.04M","0.00%"
"Aug 07, 2017","18.46","18.36","18.54","18.28","11.32M","0.49%"
"Aug 08, 2017","18.50","18.42","18.66","18.40","9.74M","0.22%"
"Aug 09, 2017","18.53","18.40","18.56","18.34","4.73M","0.16%"
"Aug 10, 2017","18.51","18.48","18.56","18.34","10.29M","-0.11%"
"Aug 11, 2017","18.62","18.64","18.68","18.52","11.27M","0.59%"
"Aug 14, 2017","18.80","18.60","18.92","18.57","14.95M","0.97%"
"Aug 15, 2017","18.87","18.85","18.98","18.78","11.56M","0.37%"
"Aug 16, 2017","18.90","18.95","18.99","18.79","14.76M","0.16%"
"Aug 17, 2017","18.88","18.84","18.94","18.78","5.66M","-0.11%"
"Aug 18, 2017","18.85","18.91","18.92","18.75","13.21M","-0.16%"
"Aug 21, 2017","18.83","18.85","18.90","18.78","13.16M","-0.11%"
"Aug 22, 2017","18.84","18.94","19.05","18.73","17.54M","0.05%"
"Aug 23, 2017","18.93","18.78","18.98","18.72","8.85M","0.48%"
"Aug 24, 2017","18.89","18.96","18.99","18.83","13.72M","-0.21%"
"Aug 25, 2017","18.94","18.86","18.98","18.86","6.39M","0.26%"
"Aug 28, 2017","18.94","18.94","18.98","18.84","4.16M","0.00%"
"Aug 29, 2017","18.98","18.90","19.00","18.89","4.55M","0.21%"
"Aug 30, 2017","18.97","19.04","19.08","18.83","8.51M","-0.05%"
"Aug 31, 2017","18.95","18.86","18.99","18.86","11.17M","-0.11%"
"Sep 01, 2017","18.85","19.01","19.04","18.85","17.63M","-0.53%"
"Sep 04, 2017","18.82","18.85","18.90","18.70","12.12M","-0.16%"
"Sep 05, 2017","18.91","18.98","19.02","18.80","18.17M","0.48%"
"Sep 06, 2017","19.20","19.01","19.34","18.98","20.04M","1.53%"
"Sep 08, 2017","19.18","19.41","19.43","18.98","14.54M","-0.10%"
"Sep 11, 2017","19.33","19.23","19.46","19.20","11.09M","0.78%"
"Sep 12, 2017","20.04","19.45","20.23","19.40","28.35M","3.67%"
"Sep 13, 2017","20.21","20.03","20.34","19.97","11.03M","0.85%"
"Sep 14, 2017","20.22","20.21","20.38","20.07","8.04M","0.05%"
"Sep 15, 2017","20.47","20.35","20.47","20.12","26.11M","1.24%"
"Sep 18, 2017","20.23","20.44","20.48","20.15","13.90M","-1.17%"
"Sep 19, 2017","20.42","20.23","20.49","20.20","9.97M","0.94%"
"Sep 20, 2017","20.49","20.38","20.49","20.23","17.03M","0.34%"
"Sep 21, 2017","20.38","20.51","20.70","20.29","8.96M","-0.54%"
"Sep 22, 2017","20.53","20.40","20.63","20.38","12.36M","0.74%"
"Sep 25, 2017","20.51","20.53","20.59","20.38","8.26M","-0.10%"
"Sep 26, 2017","20.21","20.61","20.61","20.14","24.36M","-1.46%"
"Sep 27, 2017","20.13","20.29","20.30","19.87","13.29M","-0.40%"
"Sep 28, 2017","20.09","20.21","20.23","20.06","10.41M","-0.20%"
"Sep 29, 2017","20.07","20.15","20.22","19.87","12.74M","-0.10%"
"Oct 02, 2017","19.75","19.96","19.96","19.54","17.60M","-1.59%"
"Oct 03, 2017","20.44","19.73","20.52","19.64","19.71M","3.49%"
"Oct 04, 2017","20.23","20.39","20.51","20.11","13.24M","-1.03%"
"Oct 05, 2017","20.25","20.37","20.56","20.22","17.15M","0.10%"
"Oct 06, 2017","20.10","20.14","20.16","19.93","7.56M","-0.74%"
"Oct 09, 2017","20.10","20.00","20.23","19.91","5.23M","0.00%"
"Oct 10, 2017","20.57","20.33","20.83","20.23","32.79M","2.34%"
"Oct 11, 2017","20.64","20.62","20.74","20.44","25.59M","0.34%"
"Oct 13, 2017","21.11","20.85","21.66","20.81","26.21M","2.28%"
"Oct 16, 2017","20.91","21.23","21.23","20.76","13.27M","-0.95%"
"Oct 17, 2017","20.75","20.91","20.98","20.64","7.05M","-0.77%"
"Oct 18, 2017","20.78","20.80","20.93","20.68","14.52M","0.14%"
"Oct 19, 2017","20.83","20.70","20.85","20.47","7.70M","0.24%"
"Oct 20, 2017","20.54","20.83","20.90","20.47","11.90M","-1.39%"
"Oct 23, 2017","20.32","20.65","20.65","20.21","8.08M","-1.07%"
"Oct 24, 2017","20.34","20.45","20.45","20.26","11.17M","0.10%"
"Oct 25, 2017","20.22","20.42","20.46","19.86","15.88M","-0.59%"
"Oct 26, 2017","20.07","20.30","20.32","19.89","11.56M","-0.74%"
"Oct 27, 2017","19.95","20.19","20.35","19.93","14.50M","-0.60%"
"Oct 30, 2017","20.00","19.91","20.02","19.70","17.55M","0.25%"
"Oct 31, 2017","19.94","20.08","20.20","19.79","14.38M","-0.30%"
"Nov 01, 2017","19.79","20.03","20.24","19.79","16.74M","-0.75%"
"Nov 03, 2017","19.65","19.79","19.82","19.49","20.77M","-0.71%"
"Nov 06, 2017","19.60","19.70","19.79","19.45","12.87M","-0.25%"
"Nov 07, 2017","19.27","19.49","19.59","19.18","17.64M","-1.68%"
"Nov 08, 2017","19.34","19.22","19.47","18.95","19.15M","0.36%"
"Nov 09, 2017","19.29","19.40","19.43","19.15","12.87M","-0.26%"
"Nov 10, 2017","19.28","19.39","19.43","19.03","15.20M","-0.05%"
"Nov 13, 2017","19.29","19.27","19.40","19.07","9.16M","0.05%"
"Nov 14, 2017","19.27","19.34","19.45","19.27","14.93M","-0.10%"
"Nov 16, 2017","19.48","19.29","19.64","19.26","15.85M","1.09%"
"Nov 17, 2017","19.60","19.45","19.73","19.37","9.25M","0.62%"
"Nov 21, 2017","19.85","19.73","19.99","19.57","13.29M","1.28%"
"Nov 22, 2017","19.87","19.76","20.06","19.75","16.88M","0.10%"
"Nov 23, 2017","19.76","19.80","19.89","19.57","5.66M","-0.55%"
"Nov 24, 2017","19.67","19.71","19.79","19.58","4.75M","-0.46%"
"Nov 27, 2017","19.79","19.65","19.82","19.42","8.69M","0.61%"
"Nov 28, 2017","19.82","19.82","20.02","19.69","15.99M","0.15%"
"Nov 29, 2017","19.61","20.00","20.00","19.57","15.06M","-1.06%"
"Nov 30, 2017","19.61","19.56","19.76","19.41","24.64M","0.00%"
"Dec 01, 2017","19.51","19.51","19.58","19.37","7.93M","-0.51%"
"Dec 04, 2017","19.63","19.55","19.79","19.46","11.06M","0.62%"
"Dec 05, 2017","19.61","19.57","19.94","19.54","15.59M","-0.10%"
"Dec 06, 2017","19.76","19.47","19.84","19.47","8.27M","0.76%"
"Dec 07, 2017","19.77","19.60","19.84","19.42","12.97M","0.05%"
"Dec 08, 2017","20.05","19.83","20.13","19.79","18.89M","1.42%"
"Dec 11, 2017","20.18","20.08","20.21","19.97","13.07M","0.65%"
"Dec 12, 2017","20.51","20.13","20.51","19.98","23.50M","1.64%"
"Dec 13, 2017","20.08","20.65","20.72","20.04","27.14M","-2.10%"
"Dec 14, 2017","20.01","20.13","20.13","19.80","18.03M","-0.35%"
"Dec 15, 2017","19.94","19.94","20.12","19.83","18.69M","-0.35%"
"Dec 18, 2017","19.95","20.01","20.09","19.83","18.40M","0.05%"
"Dec 19, 2017","19.94","19.99","20.00","19.81","8.26M","-0.05%"
"Dec 20, 2017","20.05","19.95","20.06","19.91","8.92M","0.55%"
"Dec 21, 2017","20.31","20.05","20.38","19.95","18.29M","1.30%"
"Dec 22, 2017","20.36","20.29","20.47","20.12","9.50M","0.25%"
"Dec 26, 2017","20.58","20.36","20.67","20.25","8.19M","1.08%"
"Dec 27, 2017","20.72","20.60","20.79","20.60","5.44M","0.68%"
"Dec 28, 2017","20.61","20.72","20.77","20.56","9.90M","-0.53%"
"Jan 02, 2018","21.00","20.66","21.06","20.50","12.72M","1.89%"
"Jan 03, 2018","21.05","20.88","21.28","20.88","9.39M","0.24%"
"Jan 04, 2018","20.94","21.05","21.13","20.81","9.15M","-0.52%"
"Jan 05, 2018","21.01","20.94","21.06","20.86","11.51M","0.33%"
"Jan 08, 2018","20.98","21.01","21.01","20.81","7.07M","-0.14%"
"Jan 09, 2018","20.92","20.97","21.00","20.84","5.85M","-0.29%"
"Jan 10, 2018","20.92","20.77","21.03","20.76","5.43M","0.00%"
"Jan 11, 2018","21.16","21.01","21.18","20.84","8.66M","1.15%"
"Jan 12, 2018","20.92","21.00","21.25","20.78","15.53M","-1.13%"
"Jan 15, 2018","21.13","20.92","21.16","20.92","4.85M","1.00%"
"Jan 16, 2018","21.21","21.13","21.37","21.11","9.20M","0.38%"
"Jan 17, 2018","21.33","21.26","21.36","21.11","11.32M","0.57%"
"Jan 18, 2018","21.23","21.23","21.38","21.15","7.70M","-0.47%"
"Jan 19, 2018","21.30","21.29","21.36","21.14","10.71M","0.33%"
"Jan 22, 2018","21.21","21.20","21.29","21.15","9.90M","-0.42%"
"Jan 23, 2018","21.21","21.20","21.30","20.98","11.75M","0.00%"
"Jan 24, 2018","21.20","21.27","21.33","20.94","21.17M","-0.05%"
"Jan 26, 2018","21.19","21.22","21.24","21.02","14.87M","-0.05%"
"Jan 29, 2018","21.15","21.11","21.16","20.99","8.32M","-0.19%"
"Jan 30, 2018","21.18","21.04","21.30","21.04","12.08M","0.14%"
"Jan 31, 2018","21.26","21.27","21.56","21.23","12.25M","0.38%"
"Feb 01, 2018","21.60","21.40","21.88","21.40","23.42M","1.60%"
"Feb 02, 2018","21.38","21.29","21.48","21.07","12.32M","-1.02%"
"Feb 05, 2018","21.06","21.22","21.37","21.06","12.56M","-1.50%"
"Feb 06, 2018","21.00","20.91","21.22","20.50","18.96M","-0.28%"
"Feb 07, 2018","21.00","21.06","21.40","20.87","12.92M","0.00%"
"Feb 08, 2018","21.04","21.09","21.29","20.90","20.08M","0.19%"
"Feb 09, 2018","20.88","20.96","21.17","20.64","17.14M","-0.76%"
"Feb 14, 2018","21.61","21.09","21.76","21.04","17.86M","3.50%"
"Feb 15, 2018","21.11","21.05","21.25","21.03","10.31M","-2.32%"
"Feb 16, 2018","21.23","21.08","21.32","20.87","13.08M","0.58%"
"Feb 19, 2018","21.15","21.27","21.31","21.01","2.50M","-0.40%"
"Feb 20, 2018","21.50","21.04","21.50","20.97","15.59M","1.66%"
"Feb 21, 2018","21.20","21.56","21.60","21.18","22.58M","-1.37%"
"Feb 22, 2018","21.22","21.25","21.30","21.06","16.27M","0.09%"
"Feb 23, 2018","20.80","21.28","21.44","20.66","32.69M","-2.01%"
"Feb 26, 2018","20.97","21.03","21.05","20.64","19.13M","0.82%"
"Feb 27, 2018","21.03","21.06","21.16","20.87","9.22M","0.32%"
"Feb 28, 2018","20.83","21.11","21.19","20.83","62.73M","-0.99%"
"Mar 01, 2018","21.15","21.47","21.53","20.92","20.94M","1.55%"
"Mar 02, 2018","21.37","21.03","21.37","20.84","13.81M","1.07%"
"Mar 05, 2018","21.32","21.20","21.60","21.19","13.44M","-0.27%"
"Mar 06, 2018","21.55","21.37","21.70","21.24","16.96M","1.11%"
"Mar 07, 2018","21.84","21.53","21.92","21.43","13.62M","1.32%"
"Mar 08, 2018","22.06","21.73","22.23","21.72","16.68M","1.00%"
"Mar 09, 2018","22.19","22.10","22.29","22.00","10.93M","0.60%"
"Mar 12, 2018","22.70","22.19","22.85","22.07","18.55M","2.30%"
"Mar 13, 2018","22.68","22.74","22.86","22.46","8.86M","-0.08%"
"Mar 14, 2018","22.97","22.55","23.04","22.55","8.57M","1.29%"
"Mar 15, 2018","22.61","22.78","23.00","22.53","20.29M","-1.61%"
"Mar 16, 2018","22.35","22.53","22.70","22.28","20.63M","-1.13%"
"Mar 19, 2018","22.52","22.23","22.53","22.07","9.39M","0.76%"
"Mar 20, 2018","22.43","22.67","22.67","22.31","8.40M","-0.42%"
"Mar 21, 2018","22.61","22.36","22.78","22.30","9.43M","0.84%"
"Mar 22, 2018","22.73","22.71","22.79","22.46","10.40M","0.50%"
"Mar 23, 2018","22.64","22.51","22.86","22.51","8.83M","-0.37%"
"Mar 26, 2018","22.72","22.86","22.86","22.41","9.33M","0.33%"
"Mar 27, 2018","22.57","22.68","22.78","22.42","10.63M","-0.67%"
"Mar 28, 2018","22.55","22.42","22.69","22.34","8.93M","-0.08%"
"Mar 29, 2018","22.78","22.55","22.92","22.51","12.41M","1.05%"
"Apr 02, 2018","22.58","22.78","22.84","22.48","5.55M","-0.91%"
"Apr 03, 2018","22.91","22.62","22.91","22.60","9.67M","1.47%"
"Apr 04, 2018","22.90","22.61","22.98","22.59","12.73M","-0.04%"
"Apr 05, 2018","22.75","23.09","23.25","22.75","11.97M","-0.66%"
"Apr 06, 2018","22.01","22.26","22.26","21.70","24.17M","-3.25%"
"Apr 09, 2018","22.05","21.83","22.22","21.83","16.49M","0.17%"
"Apr 10, 2018","22.53","22.17","22.58","22.03","15.41M","2.19%"
"Apr 11, 2018","22.58","22.35","22.77","22.35","11.46M","0.21%"
"Apr 12, 2018","22.05","22.68","22.72","21.97","12.54M","-2.35%"
"Apr 13, 2018","22.02","22.04","22.18","21.80","13.19M","-0.13%"
"Apr 16, 2018","21.75","22.02","22.13","21.63","21.43M","-1.20%"
"Apr 17, 2018","21.88","21.79","22.02","21.55","11.65M","0.57%"
"Apr 18, 2018","22.10","21.99","22.27","21.82","21.06M","1.04%"
"Apr 19, 2018","22.25","21.98","22.25","21.90","15.81M","0.64%"
"Apr 20, 2018","22.18","22.20","22.25","21.97","8.46M","-0.30%"
"Apr 23, 2018","22.20","22.07","22.29","21.99","8.09M","0.09%"
"Apr 24, 2018","22.07","22.26","22.39","22.04","11.90M","-0.60%"
"Apr 25, 2018","21.93","21.98","22.10","21.87","9.27M","-0.60%"
"Apr 26, 2018","22.07","21.92","22.33","21.92","11.96M","0.60%"
"Apr 27, 2018","21.94","22.25","22.26","21.94","8.59M","-0.56%"
"Apr 30, 2018","22.08","21.99","22.23","21.98","6.07M","0.65%"
"May 02, 2018","21.46","21.93","22.10","21.34","19.41M","-2.83%"
"May 03, 2018","21.39","21.34","21.64","21.33","11.54M","-0.31%"
"May 04, 2018","21.30","21.27","21.56","21.22","23.29M","-0.44%"
"May 07, 2018","21.15","21.42","21.47","21.04","12.90M","-0.71%"
"May 08, 2018","21.24","21.06","21.51","21.04","23.14M","0.45%"
"May 09, 2018","20.74","21.16","21.16","20.67","32.00M","-2.36%"
"May 10, 2018","20.64","20.86","20.89","20.53","27.30M","-0.50%"
"May 11, 2018","20.68","20.64","20.75","20.48","9.18M","0.23%"
"May 14, 2018","20.55","20.69","20.83","20.53","13.08M","-0.64%"
"May 15, 2018","20.31","20.36","20.43","20.21","13.70M","-1.15%"
"May 16, 2018","20.36","20.25","20.58","20.20","15.27M","0.23%"
"May 17, 2018","19.96","20.30","20.34","19.88","23.55M","-1.95%"
"May 18, 2018","19.53","19.70","19.77","19.15","64.30M","-2.18%"
"May 21, 2018","19.22","19.49","19.67","19.14","27.23M","-1.60%"
"May 22, 2018","19.07","19.36","19.36","18.97","26.54M","-0.74%"
"May 23, 2018","18.98","18.99","19.22","18.96","19.85M","-0.50%"
"May 24, 2018","19.24","18.86","19.30","18.81","21.32M","1.40%"
"May 25, 2018","19.08","19.20","19.27","18.90","23.57M","-0.84%"
"May 28, 2018","18.71","18.81","19.01","18.51","12.07M","-1.98%"
"May 29, 2018","18.54","18.74","18.89","18.35","21.25M","-0.86%"
"May 30, 2018","18.64","18.52","18.87","18.40","32.46M","0.51%"
"Jun 01, 2018","18.88","18.55","19.02","18.55","14.56M","1.27%"
"Jun 04, 2018","18.97","19.07","19.24","18.93","11.90M","0.50%"
"Jun 05, 2018","18.71","18.95","19.10","18.68","19.03M","-1.40%"
"Jun 06, 2018","18.49","18.67","18.78","18.35","17.07M","-1.16%"
"Jun 07, 2018","18.06","18.17","18.57","17.91","32.31M","-2.30%"
"Jun 08, 2018","17.95","18.09","18.17","17.82","18.95M","-0.63%"
"Jun 11, 2018","17.98","17.91","18.16","17.84","14.64M","0.16%"
"Jun 12, 2018","17.87","17.93","18.06","17.76","15.19M","-0.58%"
"Jun 13, 2018","17.71","17.89","17.95","17.51","15.99M","-0.90%"
"Jun 14, 2018","17.92","17.77","18.16","17.72","20.87M","1.18%"
"Jun 15, 2018","17.72","17.89","17.96","17.42","33.22M","-1.11%"
"Jun 18, 2018","17.70","17.47","17.88","17.33","19.83M","-0.11%"
"Jun 19, 2018","17.95","17.69","18.13","17.57","18.67M","1.40%"
"Jun 20, 2018","17.70","17.68","18.07","17.59","19.53M","-1.38%"
"Jun 21, 2018","17.31","17.66","17.83","17.31","12.62M","-2.21%"
"Jun 22, 2018","17.34","17.42","17.66","17.24","10.66M","0.17%"
"Jun 25, 2018","17.40","17.38","17.62","17.32","10.62M","0.33%"
"Jun 26, 2018","17.27","17.44","17.49","16.99","19.89M","-0.71%"
"Jun 27, 2018","17.14","17.13","17.40","17.06","11.53M","-0.77%"
"Jun 28, 2018","17.20","17.12","17.36","17.03","10.40M","0.33%"
"Jun 29, 2018","17.17","17.27","17.48","17.12","13.24M","-0.17%"
"Jul 02, 2018","17.32","17.12","17.42","16.99","7.27M","0.89%"
"Jul 03, 2018","17.27","17.32","17.58","17.27","10.90M","-0.28%"
"Jul 04, 2018","17.28","17.29","17.42","17.17","7.83M","0.06%"
"Jul 05, 2018","17.57","17.33","17.60","17.20","11.53M","1.66%"
"Jul 06, 2018","17.27","17.57","17.57","17.17","19.22M","-1.68%"
"Jul 10, 2018","17.37","17.32","17.39","17.20","12.54M","0.55%"
"Jul 11, 2018","17.10","17.38","17.43","16.99","13.42M","-1.54%"
"Jul 12, 2018","17.42","17.10","17.47","17.10","18.91M","1.84%"
"Jul 13, 2018","17.61","17.42","17.64","17.35","11.82M","1.10%"
"Jul 16, 2018","18.09","17.69","18.17","17.69","18.15M","2.77%"
"Jul 17, 2018","18.30","18.10","18.49","18.05","14.11M","1.16%"
"Jul 18, 2018","17.91","18.25","18.36","17.82","11.82M","-2.14%"
"Jul 19, 2018","18.03","17.77","18.03","17.62","10.21M","0.64%"
"Jul 20, 2018","17.94","18.33","18.41","17.85","14.22M","-0.48%"
"Jul 23, 2018","17.81","17.94","18.05","17.68","6.06M","-0.75%"
"Jul 24, 2018","18.11","17.90","18.18","17.83","13.43M","1.72%"
"Jul 25, 2018","18.05","18.11","18.14","17.84","14.86M","-0.37%"
"Jul 26, 2018","18.99","18.76","19.04","18.63","33.02M","5.24%"
"Jul 27, 2018","18.91","19.05","19.38","18.82","16.96M","-0.40%"
"Jul 30, 2018","18.81","18.77","18.89","18.68","12.74M","-0.56%"
"Jul 31, 2018","18.53","18.81","18.89","18.37","13.10M","-1.47%"
"Aug 01, 2018","18.57","18.57","18.82","18.48","9.24M","0.21%"
"Aug 02, 2018","18.42","18.36","18.56","18.34","8.62M","-0.82%"
"Aug 03, 2018","18.43","18.50","18.69","18.34","13.68M","0.05%"
"Aug 06, 2018","18.43","18.47","18.53","18.30","6.29M","0.00%"
"Aug 07, 2018","18.30","18.43","18.47","18.20","13.94M","-0.67%"
"Aug 08, 2018","18.29","18.26","18.46","18.16","21.10M","-0.05%"
"Aug 09, 2018","18.40","18.26","18.56","18.24","14.28M","0.57%"
"Aug 10, 2018","18.05","18.29","18.35","18.04","18.86M","-1.87%"
"Aug 13, 2018","18.27","17.98","18.34","17.85","10.30M","1.22%"
"Aug 14, 2018","18.53","18.40","18.58","18.24","19.98M","1.41%"
"Aug 15, 2018","18.54","18.33","18.70","18.33","17.94M","0.05%"
"Aug 16, 2018","18.15","18.47","18.55","18.11","10.57M","-2.11%"
"Aug 17, 2018","18.31","18.09","18.43","17.73","20.30M","0.89%"
"Aug 20, 2018","18.28","18.19","18.39","18.06","13.21M","-0.16%"
"Aug 21, 2018","18.12","18.17","18.41","18.00","11.03M","-0.89%"
"Aug 22, 2018","18.05","18.12","18.18","17.91","11.04M","-0.42%"
"Aug 23, 2018","18.08","18.07","18.29","17.90","14.94M","0.21%"
"Aug 24, 2018","18.21","18.10","18.29","18.08","13.88M","0.69%"
"Aug 27, 2018","18.26","18.24","18.39","18.17","14.93M","0.31%"
"Aug 28, 2018","18.24","18.26","18.28","18.14","11.74M","-0.16%"
"Aug 29, 2018","18.38","18.26","18.59","18.22","12.80M","0.79%"
"Aug 30, 2018","18.14","18.28","18.36","17.88","17.97M","-1.30%"
"Aug 31, 2018","18.00","18.10","18.18","17.84","26.60M","-0.79%"
"Sep 03, 2018","17.79","18.05","18.06","17.70","4.96M","-1.17%"
"Sep 04, 2018","17.20","17.80","17.81","17.20","19.33M","-3.33%"
"Sep 05, 2018","17.32","17.20","17.52","17.19","15.75M","0.72%"
"Sep 06, 2018","17.49","17.42","17.63","17.17","16.01M","0.99%"
"Sep 10, 2018","17.46","17.49","17.62","17.37","11.81M","-0.16%"
"Sep 11, 2018","17.37","17.33","17.42","17.08","14.21M","-0.55%"
"Sep 12, 2018","17.62","17.39","17.73","17.31","14.05M","1.43%"
"Sep 13, 2018","17.50","17.55","17.67","17.39","10.91M","-0.65%"
"Sep 14, 2018","17.41","17.43","17.62","17.25","10.24M","-0.55%"
"Sep 17, 2018","17.53","17.33","17.58","17.32","15.68M","0.71%"
"Sep 18, 2018","17.94","17.45","18.10","17.45","14.82M","2.34%"
"Sep 19, 2018","17.94","17.80","18.07","17.71","12.99M","0.00%"
"Sep 20, 2018","17.90","18.12","18.12","17.84","7.12M","-0.21%"
"Sep 21, 2018","18.00","18.00","18.31","17.95","19.84M","0.53%"
"Sep 24, 2018","17.56","17.94","17.97","17.51","12.87M","-2.44%"
"Sep 25, 2018","17.57","17.42","17.67","17.34","11.45M","0.05%"
"Sep 26, 2018","17.85","17.57","18.05","17.47","10.95M","1.63%"
"Sep 27, 2018","17.64","17.94","18.09","17.61","25.68M","-1.18%"
"Sep 28, 2018","17.51","17.54","17.66","17.42","9.02M","-0.76%"
"Oct 01, 2018","17.60","17.52","17.71","17.52","6.22M","0.49%"
"Oct 02, 2018","17.42","17.94","17.95","17.17","26.63M","-0.98%"
"Oct 03, 2018","17.31","17.89","17.89","17.21","21.33M","-0.66%"
"Oct 04, 2018","17.06","17.33","17.38","16.86","12.25M","-1.43%"
"Oct 05, 2018","16.85","17.22","17.26","16.73","16.14M","-1.23%"
"Oct 08, 2018","17.19","17.19","17.52","17.03","26.58M","1.98%"
"Oct 09, 2018","16.69","17.30","17.32","16.63","19.43M","-2.89%"
"Oct 10, 2018","16.42","16.63","16.70","16.42","11.18M","-1.60%"
"Oct 11, 2018","16.22","16.52","16.52","16.15","14.49M","-1.22%"
"Oct 15, 2018","16.16","16.37","16.40","16.10","15.52M","-0.35%"
"Oct 16, 2018","16.62","16.23","16.67","16.22","13.73M","2.84%"
"Oct 17, 2018","16.28","16.52","16.57","16.27","14.45M","-2.07%"
"Oct 18, 2018","15.90","16.28","16.36","15.90","13.99M","-2.35%"
"Oct 19, 2018","16.10","16.04","16.19","15.81","8.72M","1.26%"
"Oct 22, 2018","16.06","16.17","16.27","15.82","20.21M","-0.24%"
"Oct 23, 2018","15.88","15.91","16.02","15.74","23.04M","-1.13%"
"Oct 24, 2018","15.17","15.94","15.94","15.16","32.16M","-4.45%"
"Oct 25, 2018","14.32","14.13","14.41","13.88","80.59M","-5.60%"
"Oct 26, 2018","14.50","14.46","14.79","14.12","39.33M","1.27%"
"Oct 29, 2018","14.73","14.84","15.04","14.60","31.66M","1.58%"
"Oct 30, 2018","15.32","14.86","15.40","14.78","34.81M","4.02%"
"Oct 31, 2018","15.60","15.46","15.63","15.23","27.16M","1.81%"
"Nov 01, 2018","15.63","15.63","15.71","15.41","22.30M","0.18%"
"Nov 05, 2018","15.72","15.75","15.80","15.49","19.58M","0.55%"
"Nov 06, 2018","15.89","15.58","16.04","15.43","18.08M","1.09%"
"Nov 07, 2018","15.61","15.96","16.12","15.58","16.52M","-1.74%"
"Nov 08, 2018","15.00","15.66","15.89","14.97","20.67M","-3.91%"
"Nov 09, 2018","15.35","15.08","15.40","15.00","20.74M","2.36%"
"Nov 12, 2018","15.23","15.31","15.48","15.08","11.21M","-0.81%"
"Nov 13, 2018","15.05","15.32","15.43","14.88","17.45M","-1.19%"
"Nov 14, 2018","15.31","14.99","15.37","14.97","18.77M","1.71%"
"Nov 16, 2018","15.75","15.37","15.75","15.33","19.75M","2.93%"
"Nov 19, 2018","15.72","15.73","15.73","15.34","14.54M","-0.24%"
"Nov 21, 2018","15.64","15.52","15.66","15.21","14.32M","-0.49%"
"Nov 22, 2018","15.75","15.78","15.87","15.70","7.57M","0.73%"
"Nov 23, 2018","15.47","15.75","15.82","15.37","15.01M","-1.82%"
"Nov 26, 2018","15.42","15.60","15.63","15.22","15.38M","-0.31%"
"Nov 27, 2018","15.79","15.42","15.91","15.09","21.28M","2.41%"
"Nov 28, 2018","15.94","15.77","15.97","15.57","18.70M","0.91%"
"Nov 29, 2018","15.89","15.81","16.09","15.61","22.01M","-0.30%"
"Nov 30, 2018","16.15","15.85","16.15","15.73","35.08M","1.68%"
"Dec 03, 2018","15.98","16.23","16.24","15.82","27.57M","-1.06%"
"Dec 04, 2018","15.90","16.04","16.23","15.83","33.32M","-0.54%"
"Dec 05, 2018","15.79","15.99","16.00","15.69","9.20M","-0.66%"
"Dec 06, 2018","15.65","15.67","15.76","15.49","17.97M","-0.91%"
"Dec 07, 2018","15.38","15.64","15.65","15.33","16.99M","-1.71%"
"Dec 10, 2018","15.17","15.38","15.49","15.03","20.79M","-1.37%"
"Dec 11, 2018","15.23","15.26","15.46","15.16","18.07M","0.38%"
"Dec 12, 2018","15.23","15.37","15.47","15.15","20.92M","0.00%"
"Dec 13, 2018","15.58","15.31","15.61","15.31","13.56M","2.32%"
"Dec 14, 2018","15.33","15.46","15.70","15.31","11.49M","-1.59%"
"Dec 17, 2018","15.37","15.39","15.46","15.28","15.40M","0.25%"
"Dec 18, 2018","15.16","15.44","15.44","15.16","13.91M","-1.37%"
"Dec 19, 2018","15.01","15.40","15.48","15.01","13.07M","-1.03%"
"Dec 20, 2018","14.82","15.23","15.26","14.70","14.68M","-1.23%"
"Dec 21, 2018","14.78","14.87","14.94","14.53","46.93M","-0.26%"
"Dec 26, 2018","14.75","14.71","15.05","14.64","11.46M","-0.20%"
"Dec 27, 2018","14.71","14.75","15.01","14.66","12.54M","-0.26%"
"Dec 28, 2018","14.99","14.84","15.27","14.81","15.50M","1.85%"
"Jan 02, 2019","15.74","15.01","15.88","15.01","18.69M","5.01%"
"Jan 03, 2019","15.91","15.52","15.91","15.48","22.74M","1.11%"
"Jan 04, 2019","16.13","15.88","16.26","15.62","27.48M","1.35%"
"Jan 07, 2019","16.06","16.15","16.20","15.92","17.08M","-0.42%"
"Jan 08, 2019","15.74","16.12","16.27","15.68","22.11M","-2.00%"
"Jan 09, 2019","15.96","15.79","16.12","15.70","16.48M","1.42%"
"Jan 10, 2019","16.42","16.25","16.56","15.86","23.35M","2.87%"
"Jan 11, 2019","16.85","16.58","16.85","16.45","73.63M","2.61%"
"Jan 14, 2019","17.09","16.80","17.21","16.66","31.71M","1.45%"
"Jan 15, 2019","17.25","17.12","17.33","16.86","35.54M","0.91%"
"Jan 16, 2019","17.34","17.25","17.38","17.11","19.99M","0.56%"
"Jan 17, 2019","17.39","17.23","17.45","17.03","22.42M","0.28%"
"Jan 18, 2019","17.54","17.44","17.54","17.17","21.26M","0.84%"
"Jan 21, 2019","17.54","17.47","17.54","17.19","9.10M","0.00%"
"Jan 22, 2019","17.09","17.43","17.62","16.96","22.63M","-2.56%"
"Jan 23, 2019","16.74","17.15","17.17","16.64","26.86M","-2.05%"
"Jan 24, 2019","16.72","16.76","16.86","16.52","24.20M","-0.12%"
"Jan 28, 2019","17.49","16.66","17.54","16.65","32.75M","4.60%"
"Jan 29, 2019","17.41","17.56","17.73","17.23","30.18M","-0.45%"
"Jan 30, 2019","17.51","17.51","17.73","17.18","19.24M","0.56%"
"Jan 31, 2019","17.06","17.54","17.64","17.06","22.63M","-2.56%"
"Feb 01, 2019","17.65","17.09","17.65","17.08","19.95M","3.43%"
"Feb 04, 2019","17.98","17.61","18.01","17.44","23.33M","1.88%"
"Feb 05, 2019","18.16","17.91","18.43","17.86","23.16M","1.03%"
"Feb 06, 2019","17.63","17.97","18.18","17.63","22.89M","-2.95%"
"Feb 07, 2019","18.27","17.72","18.39","17.72","41.43M","3.65%"
"Feb 08, 2019","17.75","18.17","18.49","17.67","38.09M","-2.83%"
"Feb 11, 2019","18.23","17.78","18.26","17.65","29.15M","2.69%"
"Feb 12, 2019","18.19","18.30","18.56","18.12","23.99M","-0.21%"
"Feb 13, 2019","17.92","18.38","18.38","17.83","32.54M","-1.50%"
"Feb 14, 2019","18.11","17.89","18.19","17.65","20.34M","1.09%"
"Feb 15, 2019","18.02","18.10","18.26","17.93","14.84M","-0.54%"
"Feb 18, 2019","17.72","18.03","18.04","17.63","14.49M","-1.62%"
"Feb 19, 2019","17.85","17.72","18.09","17.70","16.28M","0.71%"
"Feb 20, 2019","17.69","17.84","18.07","17.68","22.08M","-0.93%"
"Feb 21, 2019","17.85","17.77","17.94","17.69","15.04M","0.94%"
"Feb 22, 2019","17.85","17.77","17.85","17.55","22.17M","0.00%"
"Feb 25, 2019","17.92","17.83","17.98","17.78","9.84M","0.38%"
"Feb 26, 2019","18.02","17.95","18.10","17.83","12.69M","0.54%"
"Feb 27, 2019","17.89","17.96","18.05","17.80","16.92M","-0.70%"
"Feb 28, 2019","16.79","17.01","17.69","16.73","49.93M","-6.15%"
"Mar 01, 2019","16.40","16.70","16.79","16.18","37.23M","-2.32%"
"Mar 06, 2019","15.95","16.29","16.34","15.94","18.26M","-2.73%"
"Mar 07, 2019","16.26","15.95","16.42","15.89","20.14M","1.95%"
"Mar 08, 2019","16.17","16.17","16.27","15.98","20.49M","-0.60%"
"Mar 11, 2019","16.67","16.26","16.82","16.19","23.99M","3.13%"
"Mar 12, 2019","16.56","16.76","16.89","16.45","19.82M","-0.64%"
"Mar 13, 2019","16.47","16.55","16.60","16.31","20.23M","-0.59%"
"Mar 14, 2019","16.23","16.49","16.49","16.15","20.50M","-1.42%"
"Mar 15, 2019","16.33","16.23","16.36","16.07","31.80M","0.60%"
"Mar 18, 2019","16.87","16.37","17.07","16.35","31.49M","3.28%"
"Mar 19, 2019","16.75","16.83","16.97","16.73","16.61M","-0.69%"
"Mar 20, 2019","16.56","16.72","16.86","16.56","18.73M","-1.11%"
"Mar 21, 2019","16.55","16.46","16.83","16.25","35.93M","-0.12%"
"Mar 22, 2019","16.29","16.27","16.47","16.10","33.72M","-1.53%"
"Mar 25, 2019","16.10","16.22","16.35","16.01","17.54M","-1.20%"
"Mar 26, 2019","16.56","16.21","16.72","15.88","30.76M","2.85%"
"Mar 27, 2019","16.12","16.37","16.53","16.03","32.18M","-2.65%"
"Mar 28, 2019","16.32","16.12","16.51","16.06","21.07M","1.27%"
"Mar 29, 2019","16.40","16.44","16.54","16.27","15.80M","0.48%"
"Apr 01, 2019","16.39","16.44","16.56","16.31","12.31M","-0.06%"
"Apr 02, 2019","16.34","16.56","16.69","16.29","15.42M","-0.30%"
"Apr 03, 2019","16.41","16.44","16.68","16.36","14.71M","0.42%"
"Apr 04, 2019","16.88","16.52","16.95","16.46","15.13M","2.85%"
"Apr 05, 2019","16.99","16.93","17.20","16.91","16.15M","0.69%"
"Apr 08, 2019","16.91","16.99","17.03","16.72","10.71M","-0.52%"
"Apr 09, 2019","17.24","16.77","17.24","16.77","25.73M","1.96%"
"Apr 10, 2019","17.10","17.25","17.31","16.94","20.15M","-0.79%"
"Apr 11, 2019","16.81","17.06","17.19","16.77","15.21M","-1.71%"
"Apr 12, 2019","16.62","16.62","17.05","16.56","29.69M","-1.10%"
"Apr 15, 2019","16.97","16.76","16.97","16.65","18.83M","2.11%"
"Apr 16, 2019","17.08","16.94","17.22","16.90","13.43M","0.63%"
"Apr 17, 2019","16.61","17.24","17.24","16.53","31.40M","-2.74%"
"Apr 18, 2019","16.64","16.76","16.76","16.43","21.50M","0.18%"
"Apr 22, 2019","17.05","16.64","17.11","16.51","19.55M","2.46%"
"Apr 23, 2019","17.22","17.11","17.47","17.10","13.91M","0.97%"
"Apr 24, 2019","17.27","17.25","17.32","16.89","21.89M","0.28%"
"Apr 25, 2019","17.84","17.18","17.86","17.15","29.41M","3.33%"
"Apr 26, 2019","17.82","17.73","17.90","17.59","14.12M","-0.11%"
"Apr 29, 2019","17.88","17.83","18.02","17.75","15.02M","0.33%"
"Apr 30, 2019","18.00","17.91","18.07","17.74","25.04M","0.65%"
"May 02, 2019","17.49","17.79","18.06","17.49","23.14M","-2.82%"
"May 03, 2019","17.46","17.57","17.64","17.28","21.89M","-0.17%"
"May 06, 2019","17.60","17.25","17.72","17.12","16.10M","0.78%"
"May 07, 2019","17.20","17.73","17.76","16.80","43.33M","-2.27%"
"May 08, 2019","17.46","17.34","17.53","17.19","35.37M","1.53%"
"May 09, 2019","17.04","17.30","17.37","16.98","20.63M","-2.40%"
"May 10, 2019","16.86","17.05","17.08","16.73","15.43M","-1.09%"
"May 13, 2019","16.57","16.56","16.75","16.49","24.51M","-1.68%"
"May 14, 2019","16.51","16.62","16.71","16.33","18.47M","-0.41%"
"May 15, 2019","16.18","16.29","16.39","16.14","26.26M","-1.95%"
"May 16, 2019","16.21","16.08","16.34","15.93","27.83M","0.18%"
"May 17, 2019","16.07","16.12","16.54","16.03","25.68M","-0.90%"
"May 20, 2019","16.07","16.17","16.28","15.98","43.23M","0.00%"
"May 21, 2019","16.65","16.27","16.79","16.18","31.07M","3.64%"
"May 22, 2019","16.77","16.73","16.90","16.54","16.21M","0.70%"
"May 23, 2019","16.77","16.74","16.94","16.63","12.55M","0.00%"
"May 24, 2019","16.62","16.82","16.90","16.43","15.52M","-0.87%"
"May 27, 2019","16.78","16.66","16.90","16.61","6.91M","0.94%"
"May 28, 2019","16.87","16.85","17.10","16.74","40.25M","0.52%"
"May 29, 2019","16.82","16.88","17.03","16.73","17.71M","-0.29%"
"May 30, 2019","16.98","16.78","17.08","16.78","13.99M","0.98%"
"May 31, 2019","17.10","16.94","17.15","16.84","23.01M","0.69%"
"Jun 03, 2019","16.97","17.15","17.18","16.87","18.55M","-0.74%"
"Jun 04, 2019","16.91","17.04","17.09","16.78","16.32M","-0.40%"
"Jun 05, 2019","16.96","16.94","17.10","16.92","13.32M","0.35%"
"Jun 06, 2019","17.19","17.15","17.30","17.04","10.18M","1.32%"
"Jun 07, 2019","17.16","17.25","17.32","17.13","11.40M","-0.17%"
"Jun 10, 2019","17.20","17.16","17.44","17.15","14.04M","0.23%"
"Jun 11, 2019","17.27","17.23","17.49","17.14","24.68M","0.40%"
"Jun 12, 2019","17.23","17.27","17.33","16.98","21.00M","-0.23%"
"Jun 13, 2019","17.39","17.25","17.50","17.24","17.57M","0.96%"
"Jun 14, 2019","17.19","17.40","17.58","17.15","15.92M","-1.18%"
"Jun 17, 2019","17.34","17.16","17.45","17.05","18.23M","0.91%"
"Jun 18, 2019","17.59","17.39","17.61","17.36","13.18M","1.40%"
"Jun 19, 2019","17.73","17.59","17.89","17.52","23.40M","0.83%"
"Jun 21, 2019","17.98","17.81","18.10","17.81","28.28M","1.37%"
"Jun 24, 2019","17.83","17.97","18.03","17.83","14.10M","-0.81%"
"Jun 25, 2019","17.70","17.86","17.95","17.62","19.14M","-0.71%"
"Jun 26, 2019","17.64","17.72","17.80","17.52","15.41M","-0.39%"
"Jun 27, 2019","17.59","17.51","17.59","17.35","12.52M","-0.28%"
"Jun 28, 2019","17.43","17.70","17.73","17.32","16.92M","-0.89%"
"Jul 01, 2019","17.35","17.64","17.65","17.24","16.13M","-0.45%"
"Jul 02, 2019","17.67","17.34","17.78","17.32","15.71M","1.80%"
"Jul 03, 2019","18.39","17.56","18.50","17.55","42.31M","4.08%"
"Jul 04, 2019","18.51","18.47","18.68","18.41","14.99M","0.69%"
"Jul 05, 2019","18.51","18.48","18.58","18.20","22.08M","0.00%"
"Jul 08, 2019","18.46","18.55","18.69","18.28","18.74M","-0.32%"
"Jul 10, 2019","18.53","18.47","18.75","18.34","33.40M","0.42%"
"Jul 11, 2019","18.21","18.58","18.69","18.12","18.25M","-1.74%"
"Jul 12, 2019","17.73","18.22","18.22","17.64","31.02M","-2.62%"
"Jul 15, 2019","17.78","17.93","17.94","17.64","16.14M","0.27%"
"Jul 16, 2019","17.64","17.78","17.90","17.57","9.94M","-0.82%"
"Jul 17, 2019","17.53","17.68","17.73","17.47","10.37M","-0.61%"
"Jul 18, 2019","17.78","17.57","17.83","17.46","11.52M","1.45%"
"Jul 19, 2019","17.63","17.76","18.05","17.59","15.88M","-0.88%"
"Jul 22, 2019","17.53","17.61","17.78","17.39","12.52M","-0.55%"
"Jul 23, 2019","17.57","17.54","17.80","17.50","15.11M","0.22%"
"Jul 24, 2019","17.50","17.72","17.75","17.48","11.92M","-0.39%"
"Jul 25, 2019","18.99","18.51","19.22","18.28","75.07M","8.52%"
"Jul 26, 2019","19.29","18.99","19.46","18.95","35.41M","1.59%"
"Jul 29, 2019","19.98","19.29","20.15","19.18","36.52M","3.54%"
"Jul 30, 2019","19.82","19.80","20.24","19.73","24.20M","-0.78%"
"Jul 31, 2019","19.61","19.79","19.89","19.33","27.00M","-1.03%"
"Aug 01, 2019","19.90","19.64","20.17","19.64","26.83M","1.44%"
"Aug 02, 2019","19.97","19.89","20.09","19.81","15.52M","0.34%"
"Aug 05, 2019","19.64","19.63","19.89","19.57","20.68M","-1.61%"
"Aug 06, 2019","19.96","19.65","20.05","19.57","21.73M","1.59%"
"Aug 07, 2019","20.10","19.67","20.19","19.61","18.77M","0.73%"
"Aug 08, 2019","19.65","19.54","19.90","19.43","47.66M","-2.23%"
"Aug 09, 2019","19.56","19.65","19.68","19.42","18.89M","-0.50%"
"Aug 12, 2019","18.98","19.26","19.26","18.78","26.86M","-2.94%"
"Aug 13, 2019","18.88","18.83","19.10","18.79","21.13M","-0.51%"
"Aug 14, 2019","18.52","18.81","18.87","18.36","27.67M","-1.91%"
"Aug 15, 2019","18.30","18.57","18.66","18.10","21.71M","-1.21%"
"Aug 16, 2019","18.42","18.44","18.47","18.18","17.27M","0.64%"
"Aug 19, 2019","18.62","18.51","18.75","18.43","16.20M","1.11%"
"Aug 20, 2019","18.46","18.56","18.58","18.36","15.58M","-0.89%"
"Aug 21, 2019","18.32","18.66","18.70","18.27","17.55M","-0.74%"
"Aug 22, 2019","18.00","18.44","18.44","17.81","26.21M","-1.76%"
"Aug 23, 2019","17.86","17.82","18.23","17.57","28.23M","-0.76%"
"Aug 26, 2019","17.63","17.99","18.06","17.50","16.49M","-1.31%"
"Aug 27, 2019","17.70","17.70","17.90","17.45","31.84M","0.44%"
"Aug 28, 2019","17.69","17.55","17.73","17.51","15.43M","-0.11%"
"Aug 29, 2019","18.08","17.61","18.10","17.56","16.80M","2.20%"
"Aug 30, 2019","18.24","18.14","18.41","18.09","22.78M","0.92%"
"Sep 02, 2019","17.91","18.24","18.44","17.91","8.03M","-1.82%"
"Sep 03, 2019","18.05","17.87","18.37","17.79","20.55M","0.76%"
"Sep 04, 2019","18.32","18.26","18.38","18.09","15.13M","1.51%"
"Sep 05, 2019","18.21","18.42","18.51","18.21","14.99M","-0.59%"
"Sep 06, 2019","18.24","18.35","18.40","18.10","13.04M","0.16%"
"Sep 09, 2019","18.39","18.31","18.43","18.18","11.44M","0.80%"
"Sep 10, 2019","18.34","18.39","18.63","18.25","23.40M","-0.26%"
"Sep 11, 2019","18.43","18.42","18.79","18.24","28.65M","0.48%"
"Sep 12, 2019","18.87","18.61","18.99","18.52","21.97M","2.43%"
"Sep 13, 2019","18.61","18.85","18.98","18.47","16.03M","-1.39%"
"Sep 16, 2019","18.66","18.57","18.74","18.45","14.85M","0.26%"
"Sep 17, 2019","18.93","18.54","19.00","18.54","16.91M","1.46%"
"Sep 18, 2019","18.77","18.86","18.95","18.66","18.06M","-0.87%"
"Sep 19, 2019","18.85","18.98","19.10","18.71","31.68M","0.47%"
"Sep 20, 2019","18.89","18.93","18.97","18.61","32.26M","0.21%"
"Sep 23, 2019","18.91","18.75","19.04","18.74","13.28M","0.10%"
"Sep 24, 2019","18.85","18.97","19.01","18.64","16.06M","-0.31%"
"Sep 25, 2019","19.10","18.76","19.13","18.76","15.24M","1.29%"
"Sep 26, 2019","19.03","19.07","19.25","18.88","33.34M","-0.36%"
"Sep 27, 2019","18.95","19.06","19.17","18.82","12.41M","-0.41%"
"Sep 30, 2019","18.76","19.03","19.06","18.68","21.54M","-1.03%"
"Oct 01, 2019","18.82","18.81","18.96","18.62","24.45M","0.31%"
"Oct 02, 2019","18.38","18.72","18.80","18.27","17.85M","-2.33%"
"Oct 03, 2019","18.10","18.32","18.37","18.00","19.27M","-1.48%"
"Oct 04, 2019","18.72","18.11","18.87","18.03","35.72M","3.39%"
"Oct 07, 2019","18.39","18.72","18.79","18.30","17.60M","-1.77%"
"Oct 08, 2019","18.12","18.36","18.38","18.02","19.14M","-1.43%"
"Oct 09, 2019","18.19","18.22","18.36","18.07","13.27M","0.38%"
"Oct 10, 2019","17.95","18.14","18.26","17.82","23.19M","-1.34%"
"Oct 11, 2019","18.10","18.07","18.37","17.99","18.94M","0.87%"
"Oct 14, 2019","18.24","18.21","18.29","18.06","7.70M","0.75%"
"Oct 15, 2019","18.41","18.24","18.55","18.20","12.31M","0.91%"
"Oct 16, 2019","18.41","18.56","18.56","18.21","22.00M","0.00%"
"Oct 17, 2019","18.29","18.46","18.48","18.25","11.98M","-0.64%"
"Oct 18, 2019","18.19","18.35","18.40","18.07","10.72M","-0.53%"
"Oct 21, 2019","18.50","18.12","18.51","18.12","21.69M","1.71%"
"Oct 22, 2019","18.29","18.39","18.68","18.23","22.93M","-1.16%"
"Oct 23, 2019","18.20","18.27","18.37","18.10","23.23M","-0.48%"
"Oct 24, 2019","18.70","18.24","18.85","18.13","42.70M","2.73%"
"Oct 25, 2019","17.15","17.44","17.77","17.13","81.62M","-8.29%"
"Oct 28, 2019","17.09","17.33","17.46","16.87","28.82M","-0.34%"
"Oct 29, 2019","17.13","17.08","17.30","16.93","28.55M","0.23%"
"Oct 30, 2019","17.11","17.16","17.20","16.89","15.57M","-0.11%"
"Oct 31, 2019","16.94","17.02","17.20","16.91","20.34M","-1.03%"
"Nov 01, 2019","16.89","17.00","17.06","16.82","14.59M","-0.29%"
"Nov 04, 2019","17.12","16.91","17.22","16.86","12.27M","1.38%"
"Nov 05, 2019","17.26","17.14","17.32","17.02","16.76M","0.80%"
"Nov 06, 2019","17.07","17.15","17.33","16.91","10.57M","-1.07%"
"Nov 07, 2019","17.11","17.14","17.22","16.99","13.19M","0.23%"
"Nov 08, 2019","16.86","17.00","17.11","16.74","15.25M","-1.48%"
"Nov 11, 2019","17.09","16.84","17.19","16.78","11.84M","1.39%"
"Nov 12, 2019","16.93","16.95","17.08","16.81","14.10M","-0.97%"
"Nov 13, 2019","16.93","16.93","17.00","16.81","11.33M","0.00%"
"Nov 14, 2019","17.00","16.93","17.16","16.87","18.22M","0.46%"
"Nov 18, 2019","17.11","17.14","17.23","16.97","9.45M","0.63%"
"Nov 19, 2019","17.22","17.16","17.28","16.96","9.75M","0.63%"
"Nov 21, 2019","17.61","17.37","17.61","17.22","19.54M","2.26%"
"Nov 22, 2019","17.72","17.56","17.82","17.48","17.01M","0.66%"
"Nov 25, 2019","17.73","17.72","17.83","17.56","7.86M","0.05%"
"Nov 26, 2019","17.57","17.65","17.71","17.27","32.54M","-0.93%"
"Nov 27, 2019","17.50","17.49","17.69","17.31","8.77M","-0.39%"
"Nov 28, 2019","17.55","17.50","17.67","17.42","5.11M","0.28%"
"Nov 29, 2019","17.59","17.64","17.69","17.39","8.33M","0.22%"
"Dec 02, 2019","17.51","17.59","17.70","17.43","10.26M","-0.44%"
"Dec 03, 2019","17.41","17.64","17.64","17.30","97.51M","-0.56%"
"Dec 04, 2019","17.83","17.54","18.06","17.49","21.78M","2.41%"
"Dec 05, 2019","17.69","17.81","17.88","17.64","34.12M","-0.82%"
"Dec 06, 2019","17.98","17.74","18.06","17.69","19.54M","1.65%"
"Dec 09, 2019","17.97","17.98","18.03","17.77","13.48M","-0.05%"
"Dec 10, 2019","17.90","17.92","18.09","17.82","14.72M","-0.38%"
"Dec 11, 2019","17.98","17.99","18.03","17.79","29.65M","0.44%"
"Dec 12, 2019","18.22","18.00","18.30","17.96","17.46M","1.36%"
"Dec 13, 2019","18.52","18.32","18.54","18.31","15.66M","1.66%"
"Dec 16, 2019","18.59","18.53","18.78","18.52","17.12M","0.37%"
"Dec 17, 2019","18.43","18.66","18.81","18.41","14.09M","-0.89%"
"Dec 18, 2019","18.60","18.47","18.70","18.36","31.76M","0.95%"
"Dec 19, 2019","18.68","18.60","18.68","18.47","27.27M","0.42%"
"Dec 20, 2019","18.91","18.62","19.01","18.52","25.82M","1.23%"
"Dec 23, 2019","18.96","19.01","19.08","18.78","16.33M","0.26%"
"Dec 26, 2019","19.22","18.96","19.25","18.83","20.73M","1.37%"
"Dec 27, 2019","19.16","19.25","19.36","19.09","13.21M","-0.31%"
"Dec 30, 2019","18.67","19.20","19.35","18.67","17.43M","-2.56%"
"Jan 02, 2020","19.20","18.86","19.25","18.78","16.01M","2.84%"
"Jan 03, 2020","18.93","18.95","19.16","18.89","20.06M","-1.41%"
"Jan 06, 2020","19.02","18.86","19.17","18.69","14.64M","0.48%"
"Jan 07, 2020","19.06","19.05","19.23","18.86","18.04M","0.21%"
"Jan 08, 2020","18.97","19.09","19.16","18.86","14.05M","-0.47%"
"Jan 09, 2020","18.82","19.00","19.08","18.51","21.20M","-0.79%"
"Jan 10, 2020","18.89","18.82","19.04","18.77","11.70M","0.37%"
"Jan 13, 2020","19.21","18.93","19.35","18.91","19.31M","1.69%"
"Jan 14, 2020","19.10","19.20","19.58","18.98","21.32M","-0.57%"
"Jan 15, 2020","18.76","19.00","19.00","18.76","17.41M","-1.78%"
"Jan 16, 2020","18.70","18.90","18.93","18.68","10.78M","-0.32%"
"Jan 17, 2020","18.70","18.76","18.86","18.57","16.56M","0.00%"
"Jan 20, 2020","18.80","18.70","18.88","18.58","8.04M","0.53%"
"Jan 21, 2020","18.74","18.68","18.92","18.66","11.25M","-0.32%"
"Jan 22, 2020","19.05","18.85","19.08","18.77","13.93M","1.65%"
"Jan 23, 2020","18.65","18.90","19.03","18.59","20.16M","-2.10%"
"Jan 24, 2020","18.99","18.82","19.01","18.72","12.74M","1.82%"
"Jan 27, 2020","18.55","18.68","18.79","18.46","12.92M","-2.32%"
"Jan 28, 2020","18.80","18.62","18.95","18.50","13.37M","1.35%"
"Jan 29, 2020","18.30","18.86","18.91","18.22","12.93M","-2.66%"
"Jan 30, 2020","18.34","18.20","18.34","17.88","15.93M","0.22%"
"Jan 31, 2020","17.85","18.00","18.19","17.78","20.96M","-2.67%"
"Feb 03, 2020","17.59","17.92","18.12","17.59","18.73M","-1.46%"
"Feb 04, 2020","17.65","17.78","17.94","17.58","16.49M","0.34%"
"Feb 05, 2020","17.25","17.90","18.00","17.21","36.94M","-2.27%"
"Feb 06, 2020","16.87","17.48","17.48","16.75","19.62M","-2.20%"
"Feb 07, 2020","16.92","16.74","17.17","16.73","77.24M","0.30%"
"Feb 10, 2020","16.73","16.98","17.10","16.58","17.03M","-1.12%"
"Feb 11, 2020","16.80","16.85","16.93","16.62","21.28M","0.42%"
"Feb 12, 2020","16.65","16.72","16.87","16.48","36.41M","-0.89%"
"Feb 13, 2020","16.27","16.54","16.67","16.27","15.70M","-2.28%"
"Feb 14, 2020","16.41","16.27","16.55","16.10","23.40M","0.86%"
"Feb 17, 2020","16.60","16.55","16.82","16.45","19.61M","1.16%"
"Feb 18, 2020","16.18","16.50","16.56","16.08","18.03M","-2.53%"
"Feb 19, 2020","16.13","16.15","16.25","16.00","18.16M","-0.31%"
"Feb 20, 2020","16.17","16.11","16.37","16.08","23.16M","0.25%"
"Feb 21, 2020","16.25","16.10","16.25","15.87","27.99M","0.49%"
"Feb 26, 2020","15.82","15.95","16.06","15.74","42.59M","-2.65%"
"Feb 27, 2020","14.50","14.90","14.97","14.28","91.11M","-8.34%"
"Feb 28, 2020","14.54","14.50","14.54","14.01","45.81M","0.28%"
"Mar 02, 2020","14.72","14.59","14.98","14.40","31.31M","1.24%"
"Mar 03, 2020","14.74","14.75","15.12","14.66","26.70M","0.14%"
"Mar 04, 2020","15.31","15.07","15.55","14.77","35.80M","3.87%"
"Mar 05, 2020","15.23","15.04","15.53","14.94","45.95M","-0.52%"
"Mar 06, 2020","15.32","14.86","15.50","14.70","43.53M","0.59%"
"Mar 09, 2020","14.67","14.65","14.98","14.47","46.09M","-4.24%"
"Mar 10, 2020","14.42","14.60","14.96","13.74","52.56M","-1.70%"
"Mar 11, 2020","13.75","14.14","14.33","12.90","39.69M","-4.65%"
"Mar 12, 2020","11.58","12.48","12.68","11.39","36.04M","-15.78%"
"Mar 13, 2020","12.70","12.60","13.09","11.64","51.21M","9.67%"
"Mar 16, 2020","11.03","11.39","11.77","10.43","51.83M","-13.15%"
"Mar 17, 2020","11.69","11.05","11.96","11.05","69.83M","5.98%"
"Mar 18, 2020","11.19","10.73","11.21","10.55","62.68M","-4.28%"
"Mar 19, 2020","11.70","10.82","12.16","10.36","53.13M","4.56%"
"Mar 20, 2020","12.05","11.90","12.49","11.76","49.84M","2.99%"
"Mar 23, 2020","11.51","12.28","12.28","11.18","50.12M","-4.48%"
"Mar 24, 2020","11.29","12.12","12.59","11.29","33.59M","-1.91%"
"Mar 25, 2020","11.65","11.30","12.07","11.06","33.56M","3.19%"
"Mar 26, 2020","12.80","11.90","13.28","11.89","45.84M","9.87%"
"Mar 27, 2020","12.49","12.51","13.22","11.98","38.11M","-2.42%"
"Mar 30, 2020","12.55","12.60","13.02","12.37","29.74M","0.48%"
"Mar 31, 2020","11.92","12.40","12.40","11.85","27.20M","-5.02%"
"Apr 01, 2020","11.69","11.60","11.92","11.44","25.16M","-1.93%"
"Apr 02, 2020","11.99","11.68","12.24","11.47","17.94M","2.57%"
"Apr 03, 2020","11.39","11.94","11.94","11.16","22.80M","-5.00%"
"Apr 06, 2020","11.86","12.00","12.57","11.68","19.05M","4.13%"
"Apr 07, 2020","12.41","12.65","12.97","12.30","37.50M","4.64%"
"Apr 08, 2020","12.31","12.50","12.68","12.02","22.76M","-0.81%"
"Apr 09, 2020","12.10","12.51","12.72","12.10","23.70M","-1.71%"
"Apr 13, 2020","12.10","12.11","12.24","11.90","16.97M","0.00%"
"Apr 14, 2020","12.09","12.29","12.59","12.09","21.19M","-0.08%"
"Apr 15, 2020","11.91","11.92","12.06","11.72","35.75M","-1.49%"
"Apr 16, 2020","11.45","11.96","12.02","11.40","25.83M","-3.86%"
"Apr 17, 2020","11.60","11.70","11.80","11.49","16.69M","1.31%"