Date,Price,Open,High,Low,Vol.,Change %
"Apr 20, 2015",2091.00,2081.00,2097.50,2078.50,1.12M,"0,75%"
"Apr 21, 2015",2091.00,2089.50,2105.25,2087.25,1.05M,"0,00%"
"Apr 22, 2015",2100.25,2092.00,2103.75,2080.25,1.19M,"0,44%"
"Apr 23, 2015",2107.00,2099.25,2114.50,2087.50,1.36M,"0,32%"
"Apr 24, 2015",2111.75,2107.50,2114.75,2103.00,958.31K,"0,23%"
"Apr 27, 2015",2104.75,2113.25,2119.75,2100.25,1.21M,"-0,33%"
"Apr 28, 2015",2112.00,2103.75,2112.50,2088.25,1.48M,"0,34%"
"Apr 29, 2015",2099.00,2110.75,2112.50,2090.50,1.74M,"-0,62%"
"Apr 30, 2015",2079.00,2098.25,2102.00,2070.25,2.03M,"-0,95%"
"May 01, 2015",2101.50,2082.75,2102.50,2080.50,1.02M,"1,08%"
"May 04, 2015",2109.25,2101.75,2115.00,2098.00,1.00M,"0,37%"
"May 05, 2015",2084.00,2109.50,2111.75,2081.50,1.59M,"-1,20%"
"May 06, 2015",2074.25,2085.50,2093.75,2061.25,1.76M,"-0,47%"
"May 07, 2015",2084.25,2074.75,2088.25,2057.00,1.44M,"0,48%"
"May 08, 2015",2108.50,2085.25,2113.50,2084.00,1.38M,"1,16%"
"May 11, 2015",2097.75,2110.00,2113.50,2095.75,1.15M,"-0,51%"
"May 12, 2015",2095.00,2097.75,2101.00,2079.25,1.48M,"-0,13%"
"May 13, 2015",2094.50,2096.25,2106.50,2091.50,1.34M,"-0,02%"
"May 14, 2015",2117.50,2096.00,2118.25,2092.00,1.10M,"1,10%"
"May 15, 2015",2119.00,2117.25,2122.75,2113.25,1.02M,"0,07%"
"May 18, 2015",2126.00,2119.25,2128.75,2112.25,917.10K,"0,33%"
"May 19, 2015",2124.50,2126.75,2134.00,2121.25,1.00M,"-0,07%"
"May 20, 2015",2122.50,2124.25,2132.25,2119.25,1.01M,"-0,09%"
"May 21, 2015",2128.00,2120.75,2132.00,2115.00,794.48K,"0,26%"
"May 22, 2015",2124.50,2129.25,2131.00,2122.75,765.94K,"-0,16%"
"May 24, 2015",2124.95,2124.45,2126.15,2123.65,-,"0,02%"
"May 25, 2015",2122.45,2125.15,2126.95,2118.65,-,"-0,12%"
"May 26, 2015",2105.00,2124.50,2127.00,2096.00,1.59M,"-0,82%"
"May 27, 2015",2121.00,2105.75,2124.25,2101.25,1.29M,"0,76%"
"May 28, 2015",2121.75,2120.00,2122.75,2110.50,1.08M,"0,04%"
"May 29, 2015",2106.00,2121.75,2122.75,2102.25,1.69M,"-0,74%"
"Jun 01, 2015",2109.25,2107.00,2117.75,2100.25,1.34M,"0,15%"
"Jun 02, 2015",2106.75,2111.00,2116.00,2094.00,1.44M,"-0,12%"
"Jun 03, 2015",2116.00,2107.00,2120.75,2106.75,1.31M,"0,44%"
"Jun 04, 2015",2099.00,2116.25,2116.50,2091.25,1.72M,"-0,80%"
"Jun 05, 2015",2092.25,2098.75,2102.75,2083.50,1.46M,"-0,32%"
"Jun 08, 2015",2078.25,2092.00,2093.25,2076.25,1.29M,"-0,67%"
"Jun 09, 2015",2080.00,2080.00,2084.75,2068.75,1.45M,"0,08%"
"Jun 10, 2015",2107.00,2080.75,2108.00,2080.00,1.67M,"1,30%"
"Jun 11, 2015",2109.25,2106.00,2114.75,2103.25,1.48M,"0,11%"
"Jun 12, 2015",2093.00,2109.00,2109.25,2090.25,1.13M,"-0,77%"
"Jun 15, 2015",2084.00,2087.00,2089.75,2071.25,1.08M,"-0,43%"
"Jun 16, 2015",2097.50,2083.50,2098.25,2070.50,795.76K,"0,65%"
"Jun 17, 2015",2097.50,2097.75,2107.00,2087.00,550.65K,"0,00%"
"Jun 18, 2015",2123.00,2097.25,2127.50,2090.50,430.53K,"1,22%"
"Jun 19, 2015",2117.11,2123.25,2126.50,2118.25,-,"-0,28%"
"Jun 22, 2015",2112.75,2105.75,2122.00,2103.50,1.10M,"-0,21%"
"Jun 23, 2015",2116.50,2114.75,2120.50,2111.25,837.13K,"0,18%"
"Jun 24, 2015",2099.50,2117.50,2118.50,2099.00,1.16M,"-0,80%"
"Jun 25, 2015",2094.00,2101.25,2112.75,2092.00,1.22M,"-0,26%"
"Jun 26, 2015",2095.75,2094.75,2100.75,2086.25,1.32M,"0,08%"
"Jun 29, 2015",2050.50,2064.00,2083.25,2047.25,2.29M,"-2,16%"
"Jun 30, 2015",2054.50,2054.50,2069.00,2046.75,2.38M,"0,20%"
"Jul 01, 2015",2071.00,2054.50,2077.50,2054.50,1.50M,"0,80%"
"Jul 02, 2015",2068.75,2071.50,2079.00,2062.25,1.25M,"-0,11%"
"Jul 03, 2015",2066.05,2068.05,2071.95,2063.45,-,"-0,13%"
"Jul 06, 2015",2064.50,2037.25,2071.75,2034.25,1.97M,"-0,08%"
"Jul 07, 2015",2073.75,2067.75,2078.00,2035.00,2.53M,"0,45%"
"Jul 08, 2015",2039.25,2073.00,2073.25,2036.25,2.39M,"-1,66%"
"Jul 09, 2015",2041.25,2039.75,2068.00,2038.25,1.98M,"0,10%"
"Jul 10, 2015",2069.00,2044.75,2074.75,2044.75,1.57M,"1,36%"
"Jul 13, 2015",2094.50,2054.75,2094.75,2052.00,1.33M,"1,23%"
"Jul 14, 2015",2102.00,2094.00,2105.50,2090.50,955.52K,"0,36%"
"Jul 15, 2015",2104.25,2102.50,2107.75,2095.00,1.15M,"0,11%"
"Jul 16, 2015",2117.00,2104.00,2118.50,2102.75,1.11M,"0,61%"
"Jul 17, 2015",2118.75,2117.00,2120.00,2112.75,903.69K,"0,08%"
"Jul 20, 2015",2122.00,2118.00,2126.25,2116.50,937.63K,"0,15%"
"Jul 21, 2015",2114.50,2121.25,2125.00,2106.75,1.21M,"-0,35%"
"Jul 22, 2015",2108.00,2107.75,2112.00,2102.25,1.22M,"-0,31%"
"Jul 23, 2015",2098.50,2109.25,2113.75,2091.50,1.44M,"-0,45%"
"Jul 24, 2015",2077.50,2101.00,2104.00,2069.75,1.67M,"-1,00%"
"Jul 27, 2015",2064.50,2078.25,2080.75,2056.50,1.78M,"-0,63%"
"Jul 28, 2015",2087.25,2065.50,2089.00,2061.50,1.73M,"1,10%"
"Jul 29, 2015",2101.50,2088.00,2104.25,2084.50,1.40M,"0,68%"
"Jul 30, 2015",2103.75,2099.50,2104.25,2087.75,1.29M,"0,11%"
"Jul 31, 2015",2098.50,2101.75,2109.25,2095.25,1.60M,"-0,25%"
"Aug 03, 2015",2091.00,2098.75,2102.50,2080.00,1.51M,"-0,36%"
"Aug 04, 2015",2083.00,2090.50,2096.25,2081.50,1.33M,"-0,38%"
"Aug 05, 2015",2093.75,2082.50,2107.00,2082.25,1.38M,"0,52%"
"Aug 06, 2015",2079.50,2094.00,2099.25,2070.00,1.61M,"-0,68%"
"Aug 07, 2015",2073.50,2080.00,2082.75,2062.00,1.60M,"-0,29%"
"Aug 10, 2015",2099.75,2072.00,2101.25,2071.75,1.20M,"1,27%"
"Aug 11, 2015",2079.75,2100.75,2101.75,2070.75,1.78M,"-0,95%"
"Aug 12, 2015",2084.25,2080.75,2085.25,2046.50,2.36M,"0,22%"
"Aug 13, 2015",2080.50,2082.75,2093.00,2073.25,1.50M,"-0,18%"
"Aug 14, 2015",2089.50,2079.25,2090.50,2073.75,1.07M,"0,43%"
"Aug 17, 2015",2099.25,2089.50,2100.50,2074.75,1.29M,"0,47%"
"Aug 18, 2015",2094.00,2098.25,2103.75,2090.25,1.14M,"-0,25%"
"Aug 19, 2015",2072.75,2093.25,2098.00,2066.50,2.29M,"-1,01%"
"Aug 20, 2015",2025.50,2073.50,2077.75,2024.50,2.58M,"-2,28%"
"Aug 21, 2015",1971.50,2026.25,2029.00,1967.25,4.17M,"-2,67%"
"Aug 24, 2015",1871.25,1964.50,1964.75,1831.00,5.26M,"-5,08%"
"Aug 25, 2015",1872.75,1872.75,1948.50,1860.00,3.66M,"0,08%"
"Aug 26, 2015",1938.00,1876.00,1943.00,1850.50,3.53M,"3,48%"
"Aug 27, 2015",1989.25,1941.25,1990.25,1934.50,2.94M,"2,64%"
"Aug 28, 2015",1989.75,1988.25,1992.75,1967.25,1.97M,"0,03%"
"Aug 31, 2015",1969.25,1986.25,1987.75,1959.25,1.88M,"-1,03%"
"Sep 01, 2015",1916.00,1965.50,1966.25,1898.75,2.82M,"-2,70%"
"Sep 02, 2015",1947.00,1913.50,1949.00,1907.25,2.18M,"1,62%"
"Sep 03, 2015",1946.00,1947.50,1973.50,1942.00,2.05M,"-0,05%"
"Sep 04, 2015",1921.75,1947.25,1949.25,1907.75,2.14M,"-1,25%"
"Sep 06, 2015",1925.75,1917.38,1928.88,1916.95,-,"0,21%"
"Sep 07, 2015",1938.95,1925.50,1944.15,1919.65,-,"0,69%"
"Sep 08, 2015",1965.75,1916.75,1968.75,1915.75,1.88M,"1,38%"
"Sep 09, 2015",1942.75,1966.50,1992.00,1935.50,2.14M,"-1,17%"
"Sep 10, 2015",1949.50,1943.75,1967.25,1928.50,2.27M,"0,35%"
"Sep 11, 2015",1960.25,1949.50,1962.50,1937.25,1.05M,"0,55%"
"Sep 14, 2015",1954.00,1963.75,1974.25,1946.50,893.37K,"-0,32%"
"Sep 15, 2015",1979.75,1953.25,1983.00,1945.00,1.03M,"1,32%"
"Sep 16, 2015",1998.25,1979.75,1999.00,1972.75,595.80K,"0,93%"
"Sep 17, 2015",1987.75,1997.00,2021.50,1982.50,522.53K,"-0,53%"
"Sep 18, 2015",1970.10,1988.00,1993.75,1954.75,85.62K,"-0,89%"
"Sep 21, 2015",1963.00,1949.25,1969.00,1938.50,1.51M,"-0,36%"
"Sep 22, 2015",1932.00,1964.25,1965.00,1917.75,1.99M,"-1,58%"
"Sep 23, 2015",1928.50,1930.50,1941.75,1910.50,1.42M,"-0,18%"
"Sep 24, 2015",1918.75,1931.75,1936.25,1897.25,2.22M,"-0,51%"
"Sep 25, 2015",1919.25,1913.25,1951.00,1910.25,2.08M,"0,03%"
"Sep 28, 2015",1872.00,1915.50,1929.75,1868.75,2.35M,"-2,46%"
"Sep 29, 2015",1874.50,1876.25,1889.75,1861.00,2.37M,"0,13%"
"Sep 30, 2015",1908.75,1875.00,1910.50,1871.25,2.22M,"1,83%"
"Oct 01, 2015",1916.75,1902.50,1929.50,1890.25,2.05M,"0,42%"
"Oct 02, 2015",1943.00,1917.00,1943.75,1883.00,2.47M,"1,37%"
"Oct 05, 2015",1974.75,1941.00,1980.00,1937.25,1.68M,"1,63%"
"Oct 06, 2015",1968.50,1973.00,1982.25,1962.50,1.61M,"-0,32%"
"Oct 07, 2015",1987.25,1961.00,1991.25,1960.50,1.94M,"0,95%"
"Oct 08, 2015",2006.50,1987.75,2008.75,1971.00,1.80M,"0,97%"
"Oct 09, 2015",2007.50,2004.00,2014.00,1998.75,1.38M,"0,05%"
"Oct 12, 2015",2011.00,2005.25,2014.00,2001.75,804.58K,"0,17%"
"Oct 13, 2015",1994.00,2012.00,2014.75,1991.25,1.52M,"-0,85%"
"Oct 14, 2015",1984.00,1991.50,2001.75,1982.50,1.78M,"-0,50%"
"Oct 15, 2015",2019.00,1985.75,2019.50,1985.00,1.73M,"1,76%"
"Oct 16, 2015",2025.50,2018.25,2026.50,2012.25,1.36M,"0,32%"
"Oct 19, 2015",2027.50,2024.50,2028.00,2014.25,1.31M,"0,10%"
"Oct 20, 2015",2020.50,2026.50,2031.50,2018.50,1.28M,"-0,35%"
"Oct 21, 2015",2008.50,2019.75,2034.25,2007.50,1.79M,"-0,59%"
"Oct 22, 2015",2053.00,2010.50,2056.00,2008.50,2.10M,"2,22%"
"Oct 23, 2015",2066.00,2054.25,2074.50,2053.25,2.07M,"0,63%"
"Oct 26, 2015",2062.25,2066.00,2068.00,2057.50,1.18M,"-0,18%"
"Oct 27, 2015",2060.50,2063.75,2064.75,2051.25,1.24M,"-0,08%"
"Oct 28, 2015",2084.50,2062.00,2085.25,2055.50,1.89M,"1,16%"
"Oct 29, 2015",2083.00,2081.00,2086.50,2073.25,1.41M,"-0,07%"
"Oct 30, 2015",2073.75,2084.75,2094.75,2069.75,1.75M,"-0,44%"
"Nov 02, 2015",2095.50,2073.00,2100.00,2064.25,1.28M,"1,05%"
"Nov 03, 2015",2103.00,2093.25,2110.25,2089.00,1.35M,"0,36%"
"Nov 04, 2015",2094.75,2102.50,2109.75,2090.50,1.55M,"-0,39%"
"Nov 05, 2015",2094.00,2095.50,2104.75,2084.00,1.54M,"-0,04%"
"Nov 06, 2015",2093.75,2094.75,2099.00,2077.50,1.85M,"-0,01%"
"Nov 09, 2015",2073.00,2092.00,2097.75,2062.00,1.86M,"-0,99%"
"Nov 10, 2015",2078.00,2072.25,2079.00,2064.50,1.29M,"0,24%"
"Nov 11, 2015",2069.00,2076.50,2087.25,2067.75,1.17M,"-0,43%"
"Nov 12, 2015",2040.50,2068.50,2077.50,2039.50,1.81M,"-1,38%"
"Nov 13, 2015",2018.50,2040.50,2046.00,2011.50,2.13M,"-1,08%"
"Nov 16, 2015",2048.00,2006.50,2051.00,1998.50,1.71M,"1,46%"
"Nov 17, 2015",2049.00,2047.75,2063.50,2041.50,1.62M,"0,05%"
"Nov 18, 2015",2079.75,2049.75,2082.50,2043.00,1.54M,"1,50%"
"Nov 19, 2015",2079.25,2078.25,2089.25,2075.25,1.28M,"-0,02%"
"Nov 20, 2015",2088.75,2078.25,2094.50,2076.00,1.27M,"0,46%"
"Nov 23, 2015",2084.25,2089.75,2093.00,2078.25,976.10K,"-0,22%"
"Nov 24, 2015",2084.75,2083.00,2091.50,2065.50,1.52M,"0,02%"
"Nov 25, 2015",2088.00,2084.00,2092.50,2082.25,746.32K,"0,16%"
"Nov 26, 2015",2095.75,2089.50,2098.25,2088.50,-,"0,37%"
"Nov 27, 2015",2090.00,2089.50,2098.25,2081.50,653.39K,"-0,27%"
"Nov 30, 2015",2079.75,2089.50,2095.00,2078.50,1.39M,"-0,49%"
"Dec 01, 2015",2100.00,2085.50,2101.50,2083.50,1.48M,"0,97%"
"Dec 02, 2015",2081.50,2099.50,2105.00,2075.00,1.73M,"-0,88%"
"Dec 03, 2015",2051.25,2083.25,2095.25,2040.00,2.66M,"-1,45%"
"Dec 04, 2015",2088.50,2053.25,2093.00,2046.75,2.27M,"1,82%"
"Dec 07, 2015",2081.00,2092.25,2095.50,2064.50,1.70M,"-0,36%"
"Dec 08, 2015",2058.75,2080.00,2081.50,2050.25,2.01M,"-1,07%"
"Dec 09, 2015",2042.00,2059.50,2079.75,2034.25,2.69M,"-0,81%"
"Dec 10, 2015",2049.25,2045.75,2067.00,2043.75,1.81M,"0,36%"
"Dec 11, 2015",2009.75,2050.75,2056.25,2005.00,1.58M,"-1,93%"
"Dec 14, 2015",2018.50,2008.00,2028.25,1992.25,1.27M,"0,44%"
"Dec 15, 2015",2045.50,2021.75,2054.00,2019.00,1.04M,"1,34%"
"Dec 16, 2015",2072.00,2046.00,2077.00,2040.00,575.72K,"1,30%"
"Dec 17, 2015",2034.25,2069.75,2082.25,2032.50,408.50K,"-1,82%"
"Dec 18, 2015",2029.72,2033.25,2040.25,2022.00,63.21K,"-0,22%"
"Dec 21, 2015",2015.00,1997.25,2019.50,1995.25,1.28M,"-0,73%"
"Dec 22, 2015",2036.00,2017.00,2036.50,2007.25,1.14M,"1,04%"
"Dec 23, 2015",2053.00,2034.00,2057.75,2030.75,1.00M,"0,83%"
"Dec 24, 2015",2051.25,2052.75,2059.75,2049.00,325.21K,"-0,09%"
"Dec 28, 2015",2048.75,2051.25,2054.50,2035.25,696.45K,"-0,12%"
"Dec 29, 2015",2072.75,2049.75,2074.50,2047.50,832.69K,"1,17%"
"Dec 30, 2015",2054.50,2072.00,2075.00,2053.50,720.60K,"-0,88%"
"Dec 31, 2015",2035.50,2055.25,2057.75,2030.25,1.03M,"-0,92%"
"Jan 04, 2016",2009.00,2037.75,2043.50,1980.25,2.22M,"-1,30%"
"Jan 05, 2016",2011.75,2009.00,2017.00,1992.25,1.69M,"0,14%"
"Jan 06, 2016",1986.00,2010.75,2013.25,1970.50,2.24M,"-1,28%"
"Jan 07, 2016",1933.00,1987.75,1991.00,1928.50,2.97M,"-2,67%"
"Jan 08, 2016",1911.50,1936.50,1964.75,1910.00,2.69M,"-1,11%"
"Jan 11, 2016",1914.25,1909.25,1929.00,1892.50,2.49M,"0,14%"
"Jan 12, 2016",1925.00,1913.50,1940.25,1899.00,2.43M,"0,56%"
"Jan 13, 2016",1881.50,1922.50,1946.50,1878.00,2.90M,"-2,26%"
"Jan 14, 2016",1914.50,1883.75,1927.50,1871.00,3.05M,"1,75%"
"Jan 15, 2016",1875.00,1913.50,1921.00,1849.25,3.44M,"-2,06%"
"Jan 17, 2016",1868.88,1869.75,1873.00,1860.00,-,"-0,33%"
"Jan 18, 2016",1874.25,1869.00,1890.00,1865.75,-,"0,29%"
"Jan 19, 2016",1873.00,1869.75,1907.50,1856.25,2.80M,"-0,07%"
"Jan 20, 2016",1855.00,1871.75,1878.50,1804.25,3.93M,"-0,96%"
"Jan 21, 2016",1861.00,1854.75,1883.25,1836.25,2.73M,"0,32%"
"Jan 22, 2016",1899.25,1858.50,1902.25,1855.75,2.11M,"2,06%"
"Jan 25, 2016",1870.25,1899.50,1904.25,1855.75,1.64M,"-1,53%"
"Jan 26, 2016",1896.00,1871.75,1899.75,1851.25,1.78M,"1,38%"
"Jan 27, 2016",1875.00,1885.25,1910.00,1864.50,2.11M,"-1,11%"
"Jan 28, 2016",1880.75,1880.00,1902.50,1865.75,2.25M,"0,31%"
"Jan 29, 2016",1930.00,1878.75,1933.00,1876.50,2.41M,"2,62%"
"Feb 01, 2016",1931.25,1929.75,1940.00,1912.50,1.75M,"0,06%"
"Feb 02, 2016",1897.50,1928.50,1929.25,1889.00,2.10M,"-1,75%"
"Feb 03, 2016",1908.50,1895.00,1912.25,1865.00,2.85M,"0,58%"
"Feb 04, 2016",1907.75,1907.75,1922.25,1890.25,2.26M,"-0,04%"
"Feb 05, 2016",1875.25,1905.25,1914.50,1865.75,2.32M,"-1,70%"
"Feb 08, 2016",1852.00,1876.25,1884.50,1821.75,2.67M,"-1,24%"
"Feb 09, 2016",1848.25,1849.75,1863.75,1825.75,2.79M,"-0,20%"
"Feb 10, 2016",1846.75,1850.00,1877.75,1838.50,2.36M,"-0,08%"
"Feb 11, 2016",1824.50,1842.25,1847.25,1802.50,3.20M,"-1,20%"
"Feb 12, 2016",1858.25,1827.25,1860.75,1822.50,2.02M,"1,85%"
"Feb 14, 2016",1869.50,1865.75,1871.00,1865.25,-,"0,61%"
"Feb 15, 2016",1883.25,1869.38,1890.00,1868.00,-,"0,74%"
"Feb 16, 2016",1888.75,1865.25,1892.75,1865.00,2.03M,"0,29%"
"Feb 17, 2016",1922.75,1888.25,1928.00,1881.50,1.85M,"1,80%"
"Feb 18, 2016",1916.50,1926.75,1933.50,1911.25,1.62M,"-0,33%"
"Feb 19, 2016",1914.50,1917.50,1922.75,1898.50,1.62M,"-0,10%"
"Feb 22, 2016",1936.25,1911.00,1943.75,1908.25,1.43M,"1,14%"
"Feb 23, 2016",1916.00,1934.00,1938.00,1913.75,1.60M,"-1,05%"
"Feb 24, 2016",1930.25,1914.00,1933.75,1886.75,2.32M,"0,74%"
"Feb 25, 2016",1950.50,1933.00,1951.50,1920.25,1.84M,"1,05%"
"Feb 26, 2016",1942.75,1949.00,1968.75,1941.25,1.88M,"-0,40%"
"Feb 29, 2016",1929.50,1943.00,1956.25,1926.50,1.83M,"-0,68%"
"Mar 01, 2016",1978.00,1928.00,1978.50,1920.75,2.04M,"2,51%"
"Mar 02, 2016",1983.50,1976.25,1984.75,1966.25,1.82M,"0,28%"
"Mar 03, 2016",1990.50,1981.75,1992.50,1974.75,1.56M,"0,35%"
"Mar 04, 2016",1995.00,1991.00,2007.50,1984.00,2.25M,"0,23%"
"Mar 07, 2016",1999.00,1994.50,2004.50,1984.50,1.63M,"0,20%"
"Mar 08, 2016",1981.00,1999.00,2000.25,1976.00,1.93M,"-0,90%"
"Mar 09, 2016",1989.00,1981.75,1994.00,1978.00,1.74M,"0,40%"
"Mar 10, 2016",1988.75,1990.00,2010.25,1967.25,2.74M,"-0,01%"
"Mar 11, 2016",2020.00,1988.50,2022.25,1987.50,1.22M,"1,57%"
"Mar 14, 2016",2018.75,2019.25,2024.50,2012.00,880.36K,"-0,06%"
"Mar 15, 2016",2015.75,2019.00,2019.50,2004.50,923.45K,"-0,15%"
"Mar 16, 2016",2027.00,2016.25,2032.25,2006.50,580.25K,"0,56%"
"Mar 17, 2016",2039.75,2026.75,2046.75,2015.75,479.14K,"0,63%"
"Mar 18, 2016",2050.07,2041.50,2048.75,2037.00,52.56K,"0,51%"
"Mar 21, 2016",2042.75,2036.50,2044.50,2031.00,1.28M,"-0,36%"
"Mar 22, 2016",2042.50,2043.25,2047.50,2028.75,1.50M,"-0,01%"
"Mar 23, 2016",2028.75,2043.00,2045.25,2025.25,1.56M,"-0,67%"
"Mar 24, 2016",2028.50,2028.00,2030.25,2012.25,1.52M,"-0,01%"
"Mar 28, 2016",2028.00,2030.25,2039.75,2022.00,907.83K,"-0,02%"
"Mar 29, 2016",2047.50,2027.75,2049.25,2019.25,1.55M,"0,96%"
"Mar 30, 2016",2055.25,2048.50,2064.50,2046.75,1.63M,"0,38%"
"Mar 31, 2016",2051.50,2055.50,2059.75,2047.25,1.74M,"-0,18%"
"Apr 01, 2016",2065.00,2052.75,2067.00,2035.25,2.05M,"0,66%"
"Apr 04, 2016",2057.50,2064.00,2071.50,2054.25,1.38M,"-0,36%"
"Apr 05, 2016",2038.75,2055.50,2055.50,2034.25,1.83M,"-0,91%"
"Apr 06, 2016",2060.25,2042.00,2060.50,2035.00,1.89M,"1,05%"
"Apr 07, 2016",2035.00,2059.75,2062.00,2026.00,2.05M,"-1,23%"
"Apr 08, 2016",2040.75,2034.50,2054.25,2030.25,1.77M,"0,28%"
"Apr 11, 2016",2034.50,2041.00,2056.50,2032.50,1.68M,"-0,31%"
"Apr 12, 2016",2055.75,2032.50,2058.50,2029.25,1.83M,"1,04%"
"Apr 13, 2016",2076.00,2055.25,2077.00,2054.00,1.64M,"0,99%"
"Apr 14, 2016",2076.50,2076.25,2081.75,2068.50,1.36M,"0,02%"
"Apr 15, 2016",2075.00,2077.75,2080.00,2069.50,1.23M,"-0,07%"
"Apr 18, 2016",2086.75,2064.25,2088.75,2058.50,1.40M,"0,57%"
"Apr 19, 2016",2093.75,2085.25,2098.50,2084.75,1.57M,"0,34%"
"Apr 20, 2016",2098.00,2094.25,2105.25,2085.75,1.46M,"0,20%"
"Apr 21, 2016",2082.75,2097.75,2104.00,2078.75,1.64M,"-0,73%"
"Apr 22, 2016",2086.00,2079.75,2089.00,2075.00,1.50M,"0,16%"
"Apr 25, 2016",2083.25,2091.50,2091.50,2071.00,1.28M,"-0,13%"
"Apr 26, 2016",2088.50,2084.25,2091.25,2079.50,1.23M,"0,25%"
"Apr 27, 2016",2090.75,2082.25,2094.00,2076.25,1.42M,"0,11%"
"Apr 28, 2016",2072.50,2092.50,2094.25,2065.25,1.94M,"-0,87%"
"Apr 29, 2016",2059.00,2073.75,2076.00,2045.75,2.42M,"-0,65%"
"May 02, 2016",2074.25,2060.75,2077.50,2055.50,1.31M,"0,74%"
"May 03, 2016",2057.00,2075.50,2076.25,2048.00,1.83M,"-0,83%"
"May 04, 2016",2047.00,2057.50,2060.25,2039.00,1.56M,"-0,49%"
"May 05, 2016",2044.00,2046.50,2060.00,2039.50,1.43M,"-0,15%"
"May 06, 2016",2052.75,2043.50,2054.50,2030.50,1.81M,"0,43%"
"May 09, 2016",2054.25,2053.00,2059.75,2048.25,1.37M,"0,07%"
"May 10, 2016",2077.50,2054.00,2079.75,2048.00,1.42M,"1,13%"
"May 11, 2016",2058.00,2077.25,2078.75,2057.50,1.47M,"-0,94%"
"May 12, 2016",2058.75,2059.00,2072.75,2048.50,1.80M,"0,04%"
"May 13, 2016",2043.50,2059.25,2063.50,2038.50,1.88M,"-0,74%"
"May 16, 2016",2062.75,2041.25,2068.50,2035.00,1.42M,"0,94%"
"May 17, 2016",2043.50,2062.00,2069.50,2036.75,1.99M,"-0,93%"
"May 18, 2016",2041.50,2043.75,2057.75,2030.75,2.09M,"-0,10%"
"May 19, 2016",2038.75,2043.50,2044.75,2022.00,2.06M,"-0,13%"
"May 20, 2016",2050.00,2038.75,2055.50,2037.25,1.58M,"0,55%"
"May 23, 2016",2045.25,2053.25,2056.00,2043.50,1.18M,"-0,23%"
"May 24, 2016",2075.00,2045.00,2077.25,2041.25,1.60M,"1,45%"
"May 25, 2016",2087.25,2075.00,2092.50,2073.50,1.44M,"0,59%"
"May 26, 2016",2089.75,2088.75,2091.75,2082.50,968.44K,"0,12%"
"May 27, 2016",2097.25,2090.50,2098.75,2088.00,1.04M,"0,36%"
"May 29, 2016",2101.50,2099.62,2103.25,2099.50,-,"0,20%"
"May 30, 2016",2101.25,2101.25,2103.75,2099.75,-,"-0,01%"
"May 31, 2016",2095.00,2100.00,2103.75,2086.00,1.63M,"-0,30%"
"Jun 01, 2016",2098.00,2094.00,2099.25,2083.25,1.32M,"0,14%"
"Jun 02, 2016",2103.75,2096.75,2104.75,2086.75,1.30M,"0,27%"
"Jun 03, 2016",2097.75,2103.50,2106.00,2082.75,1.75M,"-0,29%"
"Jun 06, 2016",2108.25,2097.50,2112.25,2094.00,1.27M,"0,50%"
"Jun 07, 2016",2110.25,2108.25,2118.00,2106.50,1.13M,"0,09%"
"Jun 08, 2016",2118.00,2110.25,2119.75,2106.50,1.31M,"0,37%"
"Jun 09, 2016",2114.25,2117.75,2118.50,2106.25,1.64M,"-0,18%"
"Jun 10, 2016",2096.25,2113.75,2114.00,2088.50,1.24M,"-0,85%"
"Jun 13, 2016",2078.75,2089.25,2098.25,2075.75,1.22M,"-0,83%"
"Jun 14, 2016",2074.50,2077.00,2081.75,2063.25,1.16M,"-0,20%"
"Jun 15, 2016",2071.75,2072.75,2086.25,2068.75,609.85K,"-0,13%"
"Jun 16, 2016",2079.25,2070.50,2080.00,2050.00,426.22K,"0,36%"
"Jun 17, 2016",2079.12,2077.75,2083.00,2073.75,52.55K,"-0,01%"
"Jun 20, 2016",2074.25,2071.00,2092.50,2070.25,1.59M,"-0,23%"
"Jun 21, 2016",2080.50,2079.00,2086.00,2074.00,1.39M,"0,30%"
"Jun 22, 2016",2076.75,2079.25,2091.25,2075.25,1.40M,"-0,18%"
"Jun 23, 2016",2105.75,2083.00,2113.25,2083.00,1.31M,"1,40%"
"Jun 24, 2016",2018.50,2115.75,2119.50,1999.00,4.14M,"-4,14%"
"Jun 27, 2016",1985.00,2013.75,2022.50,1981.50,2.97M,"-1,66%"
"Jun 28, 2016",2028.50,1982.50,2029.75,1982.25,2.27M,"2,19%"
"Jun 29, 2016",2066.75,2028.25,2074.75,2022.75,2.05M,"1,89%"
"Jun 30, 2016",2090.25,2072.25,2091.25,2056.50,2.30M,"1,14%"
"Jul 01, 2016",2096.25,2086.50,2100.75,2081.50,1.65M,"0,29%"
"Jul 03, 2016",2094.25,2099.25,2099.75,2094.25,-,"-0,10%"
"Jul 04, 2016",2096.88,2094.50,2104.75,2094.25,-,"0,13%"
"Jul 05, 2016",2082.75,2099.75,2104.75,2072.50,1.86M,"-0,67%"
"Jul 06, 2016",2094.00,2084.00,2094.50,2065.75,2.05M,"0,54%"
"Jul 07, 2016",2092.00,2092.00,2102.00,2081.75,1.67M,"-0,10%"
"Jul 08, 2016",2120.50,2092.00,2125.50,2087.50,1.94M,"1,36%"
"Jul 11, 2016",2130.25,2120.25,2136.75,2120.00,1.46M,"0,46%"
"Jul 12, 2016",2145.75,2130.75,2149.25,2128.50,1.69M,"0,73%"
"Jul 13, 2016",2146.00,2145.75,2152.25,2139.50,1.61M,"0,01%"
"Jul 14, 2016",2157.25,2145.25,2168.00,2142.75,1.78M,"0,52%"
"Jul 15, 2016",2152.75,2156.50,2164.75,2143.25,1.49M,"-0,21%"
"Jul 18, 2016",2160.00,2154.50,2163.25,2152.75,1.19M,"0,34%"
"Jul 19, 2016",2158.75,2160.00,2160.75,2151.25,1.15M,"-0,06%"
"Jul 20, 2016",2167.50,2159.00,2169.75,2155.25,1.13M,"0,41%"
"Jul 21, 2016",2158.00,2168.25,2170.25,2153.50,1.30M,"-0,44%"
"Jul 22, 2016",2167.50,2159.00,2169.25,2156.00,1.12M,"0,44%"
"Jul 25, 2016",2162.25,2167.75,2172.50,2155.75,1.26M,"-0,24%"
"Jul 26, 2016",2163.25,2162.75,2168.00,2153.75,1.60M,"0,05%"
"Jul 27, 2016",2160.50,2166.00,2169.25,2152.00,1.63M,"-0,13%"
"Jul 28, 2016",2164.75,2162.75,2168.50,2153.50,1.62M,"0,20%"
"Jul 29, 2016",2168.25,2165.50,2171.75,2157.50,1.69M,"0,16%"
"Aug 01, 2016",2164.50,2174.00,2177.75,2159.75,1.65M,"-0,17%"
"Aug 02, 2016",2152.75,2166.00,2171.00,2141.50,1.96M,"-0,54%"
"Aug 03, 2016",2157.00,2152.25,2158.25,2145.25,1.36M,"0,20%"
"Aug 04, 2016",2159.25,2156.75,2164.25,2154.00,1.24M,"0,10%"
"Aug 05, 2016",2176.75,2159.50,2178.50,2159.25,1.36M,"0,81%"
"Aug 08, 2016",2175.50,2176.00,2183.00,2173.25,938.62K,"-0,06%"
"Aug 09, 2016",2177.50,2176.00,2183.50,2173.75,1.19M,"0,09%"
"Aug 10, 2016",2172.75,2178.00,2181.50,2167.75,1.37M,"-0,22%"
"Aug 11, 2016",2181.75,2172.50,2185.25,2170.00,1.33M,"0,41%"
"Aug 12, 2016",2180.25,2181.75,2184.00,2175.50,1.27M,"-0,07%"
"Aug 15, 2016",2186.00,2180.75,2190.75,2180.50,1.09M,"0,26%"
"Aug 16, 2016",2176.75,2186.00,2186.25,2175.25,1.39M,"-0,42%"
"Aug 17, 2016",2179.75,2177.50,2182.00,2165.50,1.70M,"0,14%"
"Aug 18, 2016",2183.50,2180.75,2184.50,2176.25,1.20M,"0,17%"
"Aug 19, 2016",2181.75,2183.50,2184.25,2172.50,1.43M,"-0,08%"
"Aug 22, 2016",2181.50,2181.75,2184.50,2173.50,1.54M,"-0,01%"
"Aug 23, 2016",2185.25,2180.75,2191.50,2179.25,1.13M,"0,17%"
"Aug 24, 2016",2175.00,2185.75,2187.75,2168.75,1.51M,"-0,47%"
"Aug 25, 2016",2173.50,2175.00,2177.25,2167.50,1.50M,"-0,07%"
"Aug 26, 2016",2168.50,2174.00,2186.75,2157.50,2.54M,"-0,23%"
"Aug 29, 2016",2179.25,2167.75,2182.25,2164.50,1.25M,"0,50%"
"Aug 30, 2016",2175.25,2180.00,2181.50,2168.50,1.37M,"-0,18%"
"Aug 31, 2016",2169.50,2175.75,2176.25,2159.50,1.86M,"-0,26%"
"Sep 01, 2016",2167.25,2169.00,2177.25,2154.75,1.94M,"-0,10%"
"Sep 02, 2016",2178.00,2166.25,2183.75,2164.25,1.70M,"0,50%"
"Sep 04, 2016",2180.75,2178.75,2181.75,2178.25,-,"0,13%"
"Sep 05, 2016",2178.00,2180.75,2182.25,2175.00,-,"-0,13%"
"Sep 06, 2016",2184.50,2179.25,2186.25,2173.00,1.63M,"0,30%"
"Sep 07, 2016",2184.50,2185.25,2186.75,2177.50,1.46M,"0,00%"
"Sep 08, 2016",2177.50,2184.50,2189.25,2175.75,2.11M,"-0,32%"
"Sep 09, 2016",2122.75,2177.25,2178.25,2119.75,2.07M,"-2,51%"
"Sep 12, 2016",2158.50,2121.75,2162.75,2107.00,1.45M,"1,68%"
"Sep 13, 2016",2128.75,2156.25,2157.50,2119.00,1.20M,"-1,38%"
"Sep 14, 2016",2120.25,2131.75,2141.25,2118.75,661.16K,"-0,40%"
"Sep 15, 2016",2145.00,2121.75,2151.50,2114.75,398.40K,"1,17%"
"Sep 16, 2016",2139.96,2143.75,2144.25,2135.50,57.78K,"-0,23%"
"Sep 19, 2016",2133.00,2132.25,2146.75,2127.75,1.53M,"-0,33%"
"Sep 20, 2016",2131.00,2133.75,2143.50,2129.00,1.39M,"-0,09%"
"Sep 21, 2016",2156.25,2130.00,2157.50,2126.25,1.83M,"1,18%"
"Sep 22, 2016",2168.25,2156.25,2172.75,2152.75,1.52M,"0,56%"
"Sep 23, 2016",2158.00,2168.25,2169.50,2156.00,1.45M,"-0,47%"
"Sep 26, 2016",2139.75,2156.25,2159.50,2136.75,1.60M,"-0,85%"
"Sep 27, 2016",2152.75,2139.25,2154.00,2132.75,1.66M,"0,61%"
"Sep 28, 2016",2163.25,2152.00,2165.25,2144.00,1.73M,"0,49%"
"Sep 29, 2016",2148.50,2162.25,2167.00,2137.25,2.31M,"-0,68%"
"Sep 30, 2016",2160.50,2145.75,2168.25,2135.75,1.99M,"0,56%"
"Oct 03, 2016",2153.25,2158.75,2164.00,2146.75,1.41M,"-0,34%"
"Oct 04, 2016",2144.75,2153.75,2159.75,2136.00,2.14M,"-0,39%"
"Oct 05, 2016",2153.25,2144.25,2158.00,2141.00,1.37M,"0,40%"
"Oct 06, 2016",2156.50,2153.25,2157.25,2143.25,1.21M,"0,15%"
"Oct 07, 2016",2146.50,2155.25,2161.50,2138.00,1.96M,"-0,46%"
"Oct 10, 2016",2159.00,2152.00,2163.50,2148.50,952.87K,"0,58%"
"Oct 11, 2016",2134.50,2159.50,2160.75,2121.75,2.24M,"-1,13%"
"Oct 12, 2016",2131.50,2133.00,2140.75,2126.25,1.48M,"-0,14%"
"Oct 13, 2016",2126.25,2127.75,2132.25,2107.75,2.20M,"-0,25%"
"Oct 14, 2016",2127.00,2126.25,2143.25,2122.25,1.84M,"0,04%"
"Oct 17, 2016",2123.00,2126.25,2130.00,2116.75,1.25M,"-0,19%"
"Oct 18, 2016",2132.00,2122.50,2139.75,2120.25,1.14M,"0,42%"
"Oct 19, 2016",2138.00,2131.50,2142.50,2126.50,948.48K,"0,28%"
"Oct 20, 2016",2137.00,2137.50,2144.50,2126.75,1.61M,"-0,05%"
"Oct 21, 2016",2134.75,2136.00,2138.50,2123.25,1.41M,"-0,11%"
"Oct 24, 2016",2144.25,2137.00,2149.00,2134.75,1.01M,"0,45%"
"Oct 25, 2016",2138.00,2144.75,2149.75,2135.25,1.20M,"-0,29%"
"Oct 26, 2016",2134.00,2135.25,2140.00,2124.75,1.55M,"-0,19%"
"Oct 27, 2016",2123.50,2133.75,2143.75,2122.50,1.80M,"-0,49%"
"Oct 28, 2016",2123.75,2127.25,2135.25,2112.50,2.39M,"0,01%"
"Oct 31, 2016",2120.00,2120.00,2130.50,2114.75,1.37M,"-0,18%"
"Nov 01, 2016",2103.75,2123.50,2129.50,2091.00,2.26M,"-0,77%"
"Nov 02, 2016",2092.25,2102.25,2106.50,2087.25,2.01M,"-0,55%"
"Nov 03, 2016",2083.50,2088.25,2098.75,2079.75,1.80M,"-0,42%"
"Nov 04, 2016",2080.00,2084.00,2094.25,2078.75,2.08M,"-0,17%"
"Nov 07, 2016",2129.00,2106.00,2130.75,2102.75,1.76M,"2,36%"
"Nov 08, 2016",2135.50,2129.00,2143.25,2119.00,1.75M,"0,31%"
"Nov 09, 2016",2160.25,2138.00,2166.75,2028.50,5.28M,"1,16%"
"Nov 10, 2016",2167.25,2159.50,2180.50,2147.75,3.13M,"0,32%"
"Nov 11, 2016",2161.50,2165.00,2170.50,2148.50,1.88M,"-0,27%"
"Nov 14, 2016",2160.50,2164.50,2174.50,2152.25,1.82M,"-0,05%"
"Nov 15, 2016",2179.25,2161.00,2179.75,2158.50,1.44M,"0,87%"
"Nov 16, 2016",2172.75,2179.00,2185.00,2168.75,1.33M,"-0,30%"
"Nov 17, 2016",2184.25,2172.50,2185.50,2171.75,1.35M,"0,53%"
"Nov 18, 2016",2180.75,2184.00,2187.50,2176.50,1.28M,"-0,16%"
"Nov 21, 2016",2193.00,2179.50,2196.50,2178.50,1.23M,"0,56%"
"Nov 22, 2016",2200.25,2193.25,2203.00,2191.75,1.26M,"0,33%"
"Nov 23, 2016",2200.75,2201.25,2203.50,2192.00,1.10M,"0,02%"
"Nov 24, 2016",2205.50,2199.25,2207.00,2197.75,-,"0,22%"
"Nov 25, 2016",2211.25,2201.00,2211.75,2197.50,561.56K,"0,26%"
"Nov 28, 2016",2200.75,2208.00,2209.50,2198.25,1.37M,"-0,47%"
"Nov 29, 2016",2203.75,2200.25,2209.50,2196.25,1.41M,"0,14%"
"Nov 30, 2016",2198.75,2203.25,2213.75,2197.25,1.96M,"-0,23%"
"Dec 01, 2016",2192.00,2199.50,2203.00,2186.00,2.15M,"-0,31%"
"Dec 02, 2016",2192.00,2190.50,2197.25,2184.25,1.68M,"0,00%"
"Dec 05, 2016",2204.25,2184.00,2208.75,2179.00,1.66M,"0,56%"
"Dec 06, 2016",2210.00,2205.00,2212.00,2200.25,1.48M,"0,26%"
"Dec 07, 2016",2236.75,2211.25,2241.25,2206.75,2.33M,"1,21%"
"Dec 08, 2016",2247.75,2236.50,2251.50,2232.50,2.11M,"0,49%"
"Dec 09, 2016",2260.00,2246.75,2261.25,2245.00,1.09M,"0,54%"
"Dec 12, 2016",2256.00,2260.75,2270.25,2252.25,1.02M,"-0,18%"
"Dec 13, 2016",2273.25,2256.00,2278.25,2253.25,1.05M,"0,76%"
"Dec 14, 2016",2257.00,2273.25,2277.00,2248.00,767.13K,"-0,71%"
"Dec 15, 2016",2263.50,2256.00,2272.75,2252.25,477.53K,"0,29%"
"Dec 16, 2016",2268.63,2264.25,2269.50,2261.75,49.85K,"0,23%"
"Dec 19, 2016",2260.00,2256.00,2263.75,2254.00,928.69K,"-0,38%"
"Dec 20, 2016",2266.50,2260.25,2269.50,2260.00,814.01K,"0,29%"
"Dec 21, 2016",2260.50,2267.25,2268.00,2258.00,667.71K,"-0,26%"
"Dec 22, 2016",2258.75,2258.25,2261.00,2251.50,847.63K,"-0,08%"
"Dec 23, 2016",2260.00,2257.50,2261.00,2254.25,396.54K,"0,06%"
"Dec 26, 2016",2259.00,2259.25,2260.25,2258.50,-,"-0,04%"
"Dec 27, 2016",2261.00,2258.75,2269.50,2257.75,498.74K,"0,09%"
"Dec 28, 2016",2245.25,2261.25,2267.50,2243.50,1.00M,"-0,70%"
"Dec 29, 2016",2245.00,2245.50,2250.00,2239.50,913.22K,"-0,01%"
"Dec 30, 2016",2236.25,2246.25,2252.75,2228.00,1.28M,"-0,39%"
"Jan 02, 2017",2243.25,2241.38,2244.88,2241.38,-,"0,31%"
"Jan 03, 2017",2252.50,2240.75,2259.50,2239.50,1.81M,"0,41%"
"Jan 04, 2017",2264.25,2252.75,2267.25,2251.00,1.40M,"0,52%"
"Jan 05, 2017",2264.25,2264.50,2266.00,2254.00,1.32M,"0,00%"
"Jan 06, 2017",2271.50,2264.25,2277.00,2258.25,1.55M,"0,32%"
"Jan 09, 2017",2265.00,2271.25,2275.25,2263.50,1.03M,"-0,29%"
"Jan 10, 2017",2263.75,2264.50,2274.00,2259.50,1.30M,"-0,06%"
"Jan 11, 2017",2270.50,2263.75,2271.75,2255.00,1.73M,"0,30%"
"Jan 12, 2017",2263.50,2270.50,2270.50,2248.50,1.75M,"-0,31%"
"Jan 13, 2017",2272.50,2264.50,2273.50,2262.75,1.19M,"0,40%"
"Jan 15, 2017",2268.50,2270.25,2270.25,2268.00,-,"-0,18%"
"Jan 16, 2017",2266.25,2268.50,2269.50,2265.00,-,"-0,10%"
"Jan 17, 2017",2262.75,2270.25,2270.50,2257.25,1.54M,"-0,15%"
"Jan 18, 2017",2266.50,2262.00,2268.50,2258.25,1.11M,"0,17%"
"Jan 19, 2017",2261.50,2265.50,2269.50,2253.00,1.39M,"-0,22%"
"Jan 20, 2017",2266.00,2261.00,2272.75,2259.75,1.74M,"0,20%"
"Jan 23, 2017",2262.00,2266.00,2267.50,2251.75,1.47M,"-0,18%"
"Jan 24, 2017",2274.50,2260.75,2280.50,2259.50,1.27M,"0,55%"
"Jan 25, 2017",2294.00,2275.75,2295.25,2274.75,1.39M,"0,86%"
"Jan 26, 2017",2294.00,2293.75,2299.50,2289.50,1.17M,"0,00%"
"Jan 27, 2017",2289.00,2294.00,2296.75,2287.00,942.08K,"-0,22%"
"Jan 30, 2017",2276.00,2282.00,2285.75,2263.25,1.85M,"-0,57%"
"Jan 31, 2017",2274.50,2275.75,2278.25,2262.25,1.63M,"-0,07%"
"Feb 01, 2017",2274.50,2277.00,2285.00,2268.25,1.57M,"0,00%"
"Feb 02, 2017",2275.50,2275.00,2279.75,2264.50,1.41M,"0,04%"
"Feb 03, 2017",2291.00,2274.00,2294.00,2270.50,1.42M,"0,68%"
"Feb 06, 2017",2286.50,2293.00,2294.25,2283.50,1.16M,"-0,20%"
"Feb 07, 2017",2288.50,2286.25,2295.00,2284.00,1.20M,"0,09%"
"Feb 08, 2017",2290.25,2285.75,2292.00,2281.00,1.28M,"0,08%"
"Feb 09, 2017",2304.25,2290.50,2307.75,2287.75,1.35M,"0,61%"
"Feb 10, 2017",2312.75,2304.25,2315.75,2303.00,1.18M,"0,37%"
"Feb 13, 2017",2326.25,2314.25,2329.00,2313.25,1.21M,"0,58%"
"Feb 14, 2017",2337.00,2326.50,2337.75,2319.75,1.39M,"0,46%"
"Feb 15, 2017",2350.50,2335.50,2351.50,2331.25,1.53M,"0,58%"
"Feb 16, 2017",2345.50,2350.25,2350.75,2336.75,1.74M,"-0,21%"
"Feb 17, 2017",2348.00,2345.00,2348.75,2336.50,1.40M,"0,11%"
"Feb 19, 2017",2347.50,2346.75,2348.00,2346.25,-,"-0,02%"
"Feb 20, 2017",2353.25,2347.25,2356.75,2346.00,-,"0,24%"
"Feb 21, 2017",2360.00,2346.50,2365.00,2346.00,1.65M,"0,29%"
"Feb 22, 2017",2361.00,2360.00,2363.75,2355.25,1.30M,"0,04%"
"Feb 23, 2017",2362.75,2362.00,2367.50,2353.00,1.56M,"0,07%"
"Feb 24, 2017",2365.00,2361.50,2365.75,2349.50,1.55M,"0,10%"
"Feb 27, 2017",2368.25,2362.75,2370.75,2361.00,1.16M,"0,14%"
"Feb 28, 2017",2362.75,2365.75,2368.75,2357.50,1.61M,"-0,23%"
"Mar 01, 2017",2393.50,2364.50,2401.00,2363.25,2.17M,"1,30%"
"Mar 02, 2017",2382.00,2392.25,2394.25,2378.00,1.74M,"-0,48%"
"Mar 03, 2017",2381.25,2379.75,2383.25,2373.75,1.36M,"-0,03%"
"Mar 06, 2017",2375.50,2380.25,2380.75,2367.00,1.38M,"-0,24%"
"Mar 07, 2017",2366.50,2371.25,2375.50,2364.50,1.30M,"-0,38%"
"Mar 08, 2017",2364.00,2365.75,2373.00,2359.50,1.65M,"-0,11%"
"Mar 09, 2017",2366.25,2363.75,2369.25,2354.00,1.79M,"0,10%"
"Mar 10, 2017",2371.75,2367.50,2379.75,2362.25,1.36M,"0,23%"
"Mar 13, 2017",2375.00,2370.75,2375.25,2368.00,1.04M,"0,14%"
"Mar 14, 2017",2366.50,2374.00,2374.75,2358.00,952.37K,"-0,36%"
"Mar 15, 2017",2383.75,2367.00,2390.50,2366.50,621.38K,"0,73%"
"Mar 16, 2017",2382.75,2382.50,2392.00,2376.75,377.98K,"-0,04%"
"Mar 17, 2017",2385.80,2382.25,2385.75,2379.00,42.54K,"0,13%"
"Mar 20, 2017",2370.25,2373.75,2376.00,2365.50,1.08M,"-0,65%"
"Mar 21, 2017",2342.25,2369.00,2378.75,2338.00,2.57M,"-1,18%"
"Mar 22, 2017",2342.50,2340.50,2348.75,2332.25,1.88M,"0,01%"
"Mar 23, 2017",2340.00,2342.25,2356.00,2338.25,1.63M,"-0,11%"
"Mar 24, 2017",2344.75,2341.00,2352.75,2331.75,1.60M,"0,20%"
"Mar 27, 2017",2338.50,2337.00,2341.50,2317.75,1.61M,"-0,27%"
"Mar 28, 2017",2351.50,2340.50,2360.50,2333.50,1.62M,"0,56%"
"Mar 29, 2017",2357.00,2353.00,2359.75,2348.75,1.15M,"0,23%"
"Mar 30, 2017",2364.50,2357.00,2366.75,2353.25,1.16M,"0,32%"
"Mar 31, 2017",2359.25,2365.50,2366.75,2356.75,1.57M,"-0,22%"
"Apr 03, 2017",2356.00,2357.50,2363.25,2340.00,1.72M,"-0,14%"
"Apr 04, 2017",2356.50,2354.25,2358.75,2344.75,1.21M,"0,02%"
"Apr 05, 2017",2346.50,2358.75,2375.00,2343.75,1.94M,"-0,42%"
"Apr 06, 2017",2353.75,2345.50,2361.25,2338.00,1.60M,"0,31%"
"Apr 07, 2017",2352.25,2355.25,2360.75,2336.75,1.47M,"-0,06%"
"Apr 10, 2017",2352.50,2351.75,2363.25,2347.50,1.35M,"0,01%"
"Apr 11, 2017",2351.00,2354.25,2355.75,2333.25,1.86M,"-0,06%"
"Apr 12, 2017",2340.75,2351.75,2356.50,2337.50,1.53M,"-0,44%"
"Apr 13, 2017",2327.50,2338.75,2345.00,2324.00,1.59M,"-0,57%"
"Apr 17, 2017",2345.00,2324.00,2346.00,2322.75,981.68K,"0,75%"
"Apr 18, 2017",2337.25,2345.00,2347.00,2330.25,1.43M,"-0,33%"
"Apr 19, 2017",2333.75,2337.75,2349.25,2331.25,1.25M,"-0,15%"
"Apr 20, 2017",2352.00,2333.25,2358.25,2332.50,1.47M,"0,78%"
"Apr 21, 2017",2347.50,2352.75,2356.00,2340.50,1.28M,"-0,19%"
"Apr 24, 2017",2370.00,2365.75,2376.75,2365.25,1.55M,"0,96%"
"Apr 25, 2017",2385.00,2370.00,2389.25,2368.25,1.32M,"0,63%"
"Apr 26, 2017",2382.25,2383.00,2394.75,2381.50,1.49M,"-0,12%"
"Apr 27, 2017",2386.00,2381.50,2388.75,2378.75,1.12M,"0,16%"
"Apr 28, 2017",2380.50,2386.25,2388.75,2378.25,1.17M,"-0,23%"
"May 01, 2017",2387.00,2381.50,2390.75,2377.00,906.28K,"0,27%"
"May 02, 2017",2385.75,2386.25,2388.75,2381.75,958.98K,"-0,05%"
"May 03, 2017",2383.25,2384.00,2386.00,2375.50,1.08M,"-0,10%"
"May 04, 2017",2385.50,2382.00,2390.75,2376.00,1.23M,"0,09%"
"May 05, 2017",2397.75,2386.00,2399.25,2379.00,1.13M,"0,51%"
"May 08, 2017",2395.00,2402.50,2403.75,2389.75,957.16K,"-0,11%"
"May 09, 2017",2393.25,2394.50,2400.00,2388.75,1.11M,"-0,07%"
"May 10, 2017",2395.25,2391.75,2397.00,2387.50,998.86K,"0,08%"
"May 11, 2017",2391.00,2395.00,2395.25,2379.00,1.36M,"-0,18%"
"May 12, 2017",2388.75,2390.25,2391.50,2384.25,1.09M,"-0,09%"
"May 15, 2017",2398.50,2388.75,2402.25,2388.00,1.04M,"0,41%"
"May 16, 2017",2397.00,2399.75,2404.50,2393.75,1.07M,"-0,06%"
"May 17, 2017",2357.50,2396.50,2396.75,2354.75,2.81M,"-1,65%"
"May 18, 2017",2363.50,2355.00,2375.00,2344.50,2.46M,"0,25%"
"May 19, 2017",2381.50,2364.00,2388.00,2361.00,1.67M,"0,76%"
"May 22, 2017",2392.75,2381.75,2394.25,2378.25,1.11M,"0,47%"
"May 23, 2017",2398.00,2393.50,2399.50,2386.75,1.02M,"0,22%"
"May 24, 2017",2402.00,2397.00,2404.00,2394.75,984.36K,"0,17%"
"May 25, 2017",2413.50,2403.00,2417.75,2402.50,1.32M,"0,48%"
"May 26, 2017",2413.75,2413.00,2415.75,2408.00,879.56K,"0,01%"
"May 28, 2017",2415.50,2414.62,2417.00,2414.00,-,"0,07%"
"May 29, 2017",2414.25,2415.50,2417.00,2413.75,-,"-0,05%"
"May 30, 2017",2410.75,2414.00,2417.00,2407.75,1.04M,"-0,14%"
"May 31, 2017",2411.00,2410.50,2416.75,2402.75,1.73M,"0,01%"
"Jun 01, 2017",2429.50,2413.75,2430.50,2410.50,1.43M,"0,77%"
"Jun 02, 2017",2437.75,2429.25,2439.75,2427.00,1.74M,"0,34%"
"Jun 05, 2017",2434.50,2435.25,2439.00,2433.00,891.94K,"-0,13%"
"Jun 06, 2017",2430.75,2434.25,2435.75,2426.25,1.35M,"-0,15%"
"Jun 07, 2017",2432.00,2429.50,2435.00,2424.00,1.43M,"0,05%"
"Jun 08, 2017",2432.50,2431.50,2439.00,2427.25,1.45M,"0,02%"
"Jun 09, 2017",2430.50,2427.25,2445.75,2414.75,1.59M,"-0,08%"
"Jun 12, 2017",2428.50,2430.00,2431.00,2419.00,1.25M,"-0,08%"
"Jun 13, 2017",2440.00,2428.75,2441.50,2427.25,1.03M,"0,47%"
"Jun 14, 2017",2437.25,2440.25,2445.50,2427.75,684.54K,"-0,11%"
"Jun 15, 2017",2434.25,2436.00,2436.00,2418.25,470.70K,"-0,12%"
"Jun 16, 2017",2434.89,2433.75,2439.00,2432.50,47.30K,"0,03%"
"Jun 19, 2017",2447.50,2433.50,2451.50,2432.75,1.22M,"0,52%"
"Jun 20, 2017",2437.50,2447.75,2451.00,2434.00,1.33M,"-0,41%"
"Jun 21, 2017",2433.50,2435.75,2440.00,2428.00,1.37M,"-0,16%"
"Jun 22, 2017",2431.75,2431.75,2439.00,2428.00,1.06M,"-0,07%"
"Jun 23, 2017",2435.00,2431.25,2438.75,2428.25,1.20M,"0,13%"
"Jun 26, 2017",2436.00,2432.00,2447.50,2430.00,1.27M,"0,04%"
"Jun 27, 2017",2420.50,2435.75,2437.25,2416.50,1.64M,"-0,64%"
"Jun 28, 2017",2438.50,2417.00,2442.50,2413.75,1.56M,"0,74%"
"Jun 29, 2017",2420.00,2442.00,2445.00,2402.25,2.34M,"-0,76%"
"Jun 30, 2017",2421.00,2420.75,2429.75,2415.00,1.64M,"0,04%"
"Jul 03, 2017",2425.00,2422.00,2436.50,2421.50,766.23K,"0,17%"
"Jul 04, 2017",2423.75,2427.38,2431.38,2421.25,-,"-0,05%"
"Jul 05, 2017",2428.00,2423.75,2432.25,2419.25,1.29M,"0,18%"
"Jul 06, 2017",2408.50,2428.00,2430.50,2405.25,1.60M,"-0,80%"
"Jul 07, 2017",2422.50,2409.25,2425.00,2407.50,1.27M,"0,58%"
"Jul 10, 2017",2424.50,2423.00,2430.00,2419.25,861.22K,"0,08%"
"Jul 11, 2017",2424.50,2423.75,2427.75,2410.25,1.13M,"0,00%"
"Jul 12, 2017",2440.00,2425.00,2443.75,2422.50,1.16M,"0,64%"
"Jul 13, 2017",2445.50,2441.25,2447.00,2439.00,941.06K,"0,23%"
"Jul 14, 2017",2456.00,2446.50,2461.25,2442.00,1.09M,"0,43%"
"Jul 17, 2017",2458.50,2457.00,2460.50,2454.00,862.47K,"0,10%"
"Jul 18, 2017",2457.75,2459.25,2461.00,2448.00,1.09M,"-0,03%"
"Jul 19, 2017",2471.50,2459.75,2472.00,2457.75,958.46K,"0,56%"
"Jul 20, 2017",2471.25,2471.00,2476.25,2465.50,1.11M,"-0,01%"
"Jul 21, 2017",2469.50,2472.50,2475.25,2462.75,1.10M,"-0,07%"
"Jul 24, 2017",2468.50,2469.75,2470.50,2463.50,857.75K,"-0,04%"
"Jul 25, 2017",2474.00,2467.00,2478.75,2466.25,1.07M,"0,22%"
"Jul 26, 2017",2473.25,2475.25,2479.75,2471.50,972.44K,"-0,03%"
"Jul 27, 2017",2472.00,2474.50,2480.50,2457.00,1.65M,"-0,05%"
"Jul 28, 2017",2470.25,2472.00,2472.00,2461.50,1.16M,"-0,07%"
"Jul 31, 2017",2468.00,2470.50,2475.00,2465.25,1.23M,"-0,09%"
"Aug 01, 2017",2472.25,2468.00,2477.25,2466.25,1.04M,"0,17%"
"Aug 02, 2017",2473.50,2474.00,2476.00,2463.25,1.30M,"0,05%"
"Aug 03, 2017",2471.75,2473.25,2474.50,2466.00,1.09M,"-0,07%"
"Aug 04, 2017",2472.00,2470.75,2477.75,2467.75,1.07M,"0,01%"
"Aug 07, 2017",2477.50,2472.25,2478.25,2472.00,599.70K,"0,22%"
"Aug 08, 2017",2472.75,2477.50,2488.50,2467.50,1.37M,"-0,19%"
"Aug 09, 2017",2473.00,2470.00,2474.50,2459.00,1.56M,"0,01%"
"Aug 10, 2017",2437.50,2474.00,2474.25,2432.75,2.32M,"-1,44%"
"Aug 11, 2017",2440.00,2434.50,2446.50,2430.25,1.67M,"0,10%"
"Aug 14, 2017",2463.50,2441.50,2466.50,2441.50,1.47M,"0,96%"
"Aug 15, 2017",2463.75,2464.50,2473.25,2460.00,1.06M,"0,01%"
"Aug 16, 2017",2467.50,2464.50,2474.00,2461.50,1.14M,"0,15%"
"Aug 17, 2017",2429.50,2466.75,2468.50,2423.75,2.24M,"-1,54%"
"Aug 18, 2017",2426.75,2426.75,2439.50,2419.50,2.20M,"-0,11%"
"Aug 21, 2017",2428.00,2428.75,2431.50,2415.75,1.34M,"0,05%"
"Aug 22, 2017",2452.75,2428.00,2454.25,2427.50,1.37M,"1,02%"
"Aug 23, 2017",2441.50,2453.00,2454.75,2438.75,1.24M,"-0,46%"
"Aug 24, 2017",2440.75,2440.25,2449.00,2434.50,1.41M,"-0,03%"
"Aug 25, 2017",2442.50,2442.50,2453.50,2437.50,1.21M,"0,07%"
"Aug 28, 2017",2443.75,2442.00,2449.25,2436.25,953.05K,"0,05%"
"Aug 29, 2017",2447.00,2434.00,2448.50,2421.00,1.62M,"0,13%"
"Aug 30, 2017",2455.75,2446.50,2459.75,2442.75,1.30M,"0,36%"
"Aug 31, 2017",2470.00,2455.25,2474.25,2454.75,1.75M,"0,58%"
"Sep 01, 2017",2474.25,2470.25,2479.75,2470.00,1.06M,"0,17%"
"Sep 03, 2017",2464.75,2461.50,2466.50,2461.12,-,"-0,38%"
"Sep 04, 2017",2469.62,2464.75,2470.75,2462.00,-,"0,20%"
"Sep 05, 2017",2459.75,2461.25,2471.25,2445.50,2.12M,"-0,40%"
"Sep 06, 2017",2465.50,2460.25,2469.00,2456.50,1.57M,"0,23%"
"Sep 07, 2017",2466.50,2464.00,2468.75,2457.50,1.53M,"0,04%"
"Sep 08, 2017",2462.50,2466.50,2467.50,2456.75,1.24M,"-0,16%"
"Sep 11, 2017",2487.50,2468.00,2489.00,2468.00,1.33M,"1,02%"
"Sep 12, 2017",2496.00,2488.25,2497.00,2486.75,1.04M,"0,34%"
"Sep 13, 2017",2496.50,2497.00,2497.50,2490.75,611.37K,"0,02%"
"Sep 14, 2017",2496.50,2496.25,2498.25,2489.50,419.70K,"0,00%"
"Sep 15, 2017",2496.83,2496.00,2496.50,2489.50,54.76K,"0,01%"
"Sep 18, 2017",2502.75,2499.00,2506.00,2497.75,1.09M,"0,24%"
"Sep 19, 2017",2504.75,2502.75,2506.00,2501.00,961.11K,"0,08%"
"Sep 20, 2017",2505.25,2503.75,2507.25,2494.00,1.23M,"0,02%"
"Sep 21, 2017",2501.00,2504.50,2506.25,2496.50,1.12M,"-0,17%"
"Sep 22, 2017",2499.50,2500.75,2501.00,2492.00,1.02M,"-0,06%"
"Sep 25, 2017",2497.00,2499.00,2504.50,2485.00,1.54M,"-0,10%"
"Sep 26, 2017",2495.50,2498.00,2501.25,2492.25,1.14M,"-0,06%"
"Sep 27, 2017",2504.50,2495.00,2509.25,2493.00,1.58M,"0,36%"
"Sep 28, 2017",2507.75,2503.25,2508.25,2499.00,1.11M,"0,13%"
"Sep 29, 2017",2516.00,2507.75,2517.75,2504.75,1.37M,"0,33%"
"Oct 02, 2017",2526.25,2518.00,2528.00,2517.00,1.14M,"0,41%"
"Oct 03, 2017",2532.75,2527.25,2533.50,2525.50,849.15K,"0,26%"
"Oct 04, 2017",2536.25,2533.00,2538.00,2529.00,956.59K,"0,14%"
"Oct 05, 2017",2550.00,2535.25,2550.75,2534.50,1.10M,"0,54%"
"Oct 06, 2017",2545.00,2548.75,2549.75,2541.50,1.17M,"-0,20%"
"Oct 09, 2017",2543.75,2543.25,2550.50,2539.25,735.49K,"-0,05%"
"Oct 10, 2017",2548.50,2543.25,2553.25,2542.75,1.15M,"0,19%"
"Oct 11, 2017",2553.00,2548.75,2553.50,2544.25,818.24K,"0,18%"
"Oct 12, 2017",2549.50,2552.25,2553.25,2546.25,938.48K,"-0,14%"
"Oct 13, 2017",2552.75,2548.00,2555.50,2547.00,918.54K,"0,13%"
"Oct 16, 2017",2556.25,2552.25,2557.75,2550.75,795.92K,"0,14%"
"Oct 17, 2017",2557.00,2555.50,2557.75,2552.25,738.74K,"0,03%"
"Oct 18, 2017",2560.00,2556.50,2562.25,2556.25,753.38K,"0,12%"
"Oct 19, 2017",2560.50,2560.00,2561.50,2542.50,1.36M,"0,02%"
"Oct 20, 2017",2574.00,2561.00,2574.50,2559.50,1.25M,"0,53%"
"Oct 23, 2017",2563.50,2572.75,2577.25,2561.50,1.27M,"-0,41%"
"Oct 24, 2017",2567.25,2562.50,2570.25,2562.25,1.05M,"0,15%"
"Oct 25, 2017",2558.50,2564.75,2566.25,2541.50,2.10M,"-0,34%"
"Oct 26, 2017",2561.50,2559.50,2565.00,2555.50,1.39M,"0,12%"
"Oct 27, 2017",2578.50,2561.50,2580.75,2557.50,1.56M,"0,66%"
"Oct 30, 2017",2568.25,2575.50,2578.25,2565.50,1.24M,"-0,40%"
"Oct 31, 2017",2572.75,2568.00,2575.50,2566.75,1.05M,"0,18%"
"Nov 01, 2017",2574.75,2572.75,2585.50,2571.00,1.29M,"0,08%"
"Nov 02, 2017",2576.75,2571.50,2578.50,2562.25,1.30M,"0,08%"
"Nov 03, 2017",2582.75,2577.50,2585.50,2573.50,992.68K,"0,23%"
"Nov 06, 2017",2588.75,2580.00,2590.00,2575.50,848.12K,"0,23%"
"Nov 07, 2017",2586.75,2587.75,2593.50,2580.75,1.16M,"-0,08%"
"Nov 08, 2017",2591.00,2584.00,2592.50,2579.75,1.06M,"0,16%"
"Nov 09, 2017",2584.00,2591.25,2594.50,2563.25,2.22M,"-0,27%"
"Nov 10, 2017",2579.50,2582.00,2585.75,2571.50,1.19M,"-0,17%"
"Nov 13, 2017",2582.00,2580.25,2585.50,2570.25,1.05M,"0,10%"
"Nov 14, 2017",2578.00,2580.25,2582.25,2564.25,1.58M,"-0,15%"
"Nov 15, 2017",2565.00,2576.75,2577.00,2555.50,1.92M,"-0,50%"
"Nov 16, 2017",2585.00,2564.25,2589.50,2562.25,1.53M,"0,78%"
"Nov 17, 2017",2576.25,2584.25,2586.00,2574.75,1.19M,"-0,34%"
"Nov 20, 2017",2582.00,2576.00,2584.00,2567.75,1.00M,"0,22%"
"Nov 21, 2017",2596.25,2582.00,2600.50,2579.25,1.15M,"0,55%"
"Nov 22, 2017",2594.50,2595.75,2600.00,2592.75,770.81K,"-0,07%"
"Nov 23, 2017",2595.00,2594.12,2598.00,2589.50,-,"0,02%"
"Nov 24, 2017",2601.00,2593.25,2603.00,2589.50,551.20K,"0,23%"
"Nov 27, 2017",2601.75,2601.00,2605.50,2596.50,960.11K,"0,03%"
"Nov 28, 2017",2626.00,2602.25,2627.00,2597.50,1.56M,"0,93%"
"Nov 29, 2017",2625.00,2625.50,2634.25,2619.75,1.66M,"-0,04%"
"Nov 30, 2017",2648.00,2625.00,2658.50,2621.75,2.35M,"0,88%"
"Dec 01, 2017",2644.00,2640.75,2650.75,2605.00,2.52M,"-0,15%"
"Dec 04, 2017",2638.25,2654.50,2665.25,2633.75,1.76M,"-0,22%"
"Dec 05, 2017",2628.25,2636.00,2648.75,2627.25,1.39M,"-0,38%"
"Dec 06, 2017",2629.25,2626.75,2634.50,2620.00,1.31M,"0,04%"
"Dec 07, 2017",2639.50,2630.50,2641.25,2626.25,1.35M,"0,39%"
"Dec 08, 2017",2651.00,2639.50,2652.50,2637.75,1.15M,"0,44%"
"Dec 11, 2017",2661.50,2652.00,2664.75,2649.25,1.27M,"0,40%"
"Dec 12, 2017",2665.00,2662.75,2670.25,2660.50,1.03M,"0,13%"
"Dec 13, 2017",2666.50,2665.50,2672.50,2656.75,758.32K,"0,06%"
"Dec 14, 2017",2653.25,2665.50,2670.75,2649.25,473.84K,"-0,50%"
"Dec 15, 2017",2669.02,2650.00,2667.25,2650.00,34.57K,"0,59%"
"Dec 18, 2017",2694.50,2683.00,2698.00,2682.50,1.04M,"0,95%"
"Dec 19, 2017",2684.00,2695.00,2698.00,2682.50,980.48K,"-0,39%"
"Dec 20, 2017",2681.50,2684.75,2695.50,2679.00,981.22K,"-0,09%"
"Dec 21, 2017",2687.75,2681.50,2696.00,2680.75,853.75K,"0,23%"
"Dec 22, 2017",2686.00,2686.75,2691.50,2682.25,654.51K,"-0,07%"
"Dec 25, 2017",2688.25,2687.25,2689.50,2687.00,-,"0,08%"
"Dec 26, 2017",2687.00,2686.75,2689.50,2683.50,376.10K,"-0,05%"
"Dec 27, 2017",2685.50,2687.50,2691.00,2681.50,666.33K,"-0,06%"
"Dec 28, 2017",2685.75,2684.00,2689.00,2683.00,535.62K,"0,01%"
"Dec 29, 2017",2676.00,2684.75,2698.25,2667.75,1.09M,"-0,36%"
"Jan 01, 2018",2680.75,2675.75,2681.00,2674.75,-,"0,18%"
"Jan 02, 2018",2693.00,2675.25,2696.00,2674.50,996.27K,"0,46%"
"Jan 03, 2018",2711.00,2693.75,2714.25,2692.25,1.11M,"0,67%"
"Jan 04, 2018",2723.75,2710.25,2729.00,2708.50,1.17M,"0,47%"
"Jan 05, 2018",2742.50,2725.00,2743.25,2723.75,1.14M,"0,69%"
"Jan 08, 2018",2746.75,2741.75,2748.50,2736.50,903.54K,"0,15%"
"Jan 09, 2018",2752.25,2746.50,2760.00,2742.75,1.14M,"0,20%"
"Jan 10, 2018",2750.50,2749.75,2752.00,2736.50,1.29M,"-0,06%"
"Jan 11, 2018",2769.50,2750.00,2770.50,2747.75,1.05M,"0,69%"
"Jan 12, 2018",2788.75,2768.75,2790.00,2766.75,1.36M,"0,70%"
"Jan 14, 2018",2795.50,2789.75,2795.50,2789.75,-,"0,24%"
"Jan 15, 2018",2793.75,2795.50,2797.00,2791.00,-,"-0,06%"
"Jan 16, 2018",2782.50,2789.75,2808.50,2769.25,1.98M,"-0,40%"
"Jan 17, 2018",2803.75,2782.75,2809.50,2779.00,1.54M,"0,76%"
"Jan 18, 2018",2796.25,2803.25,2808.00,2793.75,1.35M,"-0,27%"
"Jan 19, 2018",2811.00,2797.00,2815.00,2791.75,1.36M,"0,53%"
"Jan 22, 2018",2835.25,2804.00,2838.25,2802.00,1.18M,"0,86%"
"Jan 23, 2018",2839.50,2835.25,2844.75,2828.75,1.28M,"0,15%"
"Jan 24, 2018",2841.00,2837.00,2855.25,2825.50,1.89M,"0,05%"
"Jan 25, 2018",2841.25,2840.00,2853.75,2830.75,1.44M,"0,01%"
"Jan 26, 2018",2874.50,2842.25,2876.00,2841.25,1.29M,"1,17%"
"Jan 29, 2018",2853.50,2874.25,2878.50,2851.50,1.40M,"-0,73%"
"Jan 30, 2018",2824.50,2853.25,2858.00,2818.50,2.13M,"-1,02%"
"Jan 31, 2018",2825.75,2823.25,2839.75,2813.00,1.84M,"0,04%"
"Feb 01, 2018",2822.50,2828.75,2837.25,2809.50,1.65M,"-0,12%"
"Feb 02, 2018",2756.75,2826.50,2831.00,2755.25,2.53M,"-2,33%"
"Feb 05, 2018",2607.75,2757.00,2763.00,2595.75,4.01M,"-5,40%"
"Feb 06, 2018",2694.25,2624.00,2699.75,2529.00,4.81M,"3,32%"
"Feb 07, 2018",2668.25,2685.50,2726.75,2660.50,2.49M,"-0,97%"
"Feb 08, 2018",2593.50,2664.75,2686.50,2577.00,3.12M,"-2,80%"
"Feb 09, 2018",2619.00,2593.75,2637.75,2530.25,3.91M,"0,98%"
"Feb 12, 2018",2655.25,2628.25,2671.50,2620.00,2.17M,"1,38%"
"Feb 13, 2018",2661.75,2653.25,2667.50,2634.25,1.46M,"0,24%"
"Feb 14, 2018",2697.00,2662.50,2701.75,2627.00,2.09M,"1,32%"
"Feb 15, 2018",2734.00,2695.50,2736.75,2688.50,1.67M,"1,37%"
"Feb 16, 2018",2735.00,2734.00,2754.75,2722.25,1.74M,"0,04%"
"Feb 18, 2018",2740.25,2736.25,2741.00,2734.50,-,"0,19%"
"Feb 19, 2018",2730.75,2740.25,2747.75,2719.75,-,"-0,35%"
"Feb 20, 2018",2714.00,2734.50,2747.75,2705.75,1.45M,"-0,61%"
"Feb 21, 2018",2698.75,2714.50,2747.75,2693.50,1.66M,"-0,56%"
"Feb 22, 2018",2711.50,2698.50,2731.00,2682.00,1.62M,"0,47%"
"Feb 23, 2018",2748.75,2712.75,2750.25,2710.00,1.29M,"1,37%"
"Feb 26, 2018",2784.50,2751.50,2786.00,2742.50,1.26M,"1,30%"
"Feb 27, 2018",2747.50,2783.50,2789.75,2742.00,1.72M,"-1,33%"
"Feb 28, 2018",2714.50,2746.50,2762.00,2712.00,1.88M,"-1,20%"
"Mar 01, 2018",2678.25,2718.25,2731.00,2658.50,2.82M,"-1,34%"
"Mar 02, 2018",2690.25,2678.75,2696.00,2647.00,2.17M,"0,45%"
"Mar 05, 2018",2718.50,2683.25,2727.75,2663.75,1.78M,"1,05%"
"Mar 06, 2018",2724.00,2719.00,2734.50,2710.25,1.45M,"0,20%"
"Mar 07, 2018",2723.25,2700.00,2730.25,2681.25,1.87M,"-0,03%"
"Mar 08, 2018",2739.25,2722.50,2740.50,2720.00,1.50M,"0,59%"
"Mar 09, 2018",2784.00,2736.50,2787.00,2730.00,1.54M,"1,63%"
"Mar 12, 2018",2784.00,2784.00,2800.50,2779.00,1.23M,"0,00%"
"Mar 13, 2018",2768.50,2782.25,2802.50,2758.50,1.23M,"-0,56%"
"Mar 14, 2018",2749.75,2763.00,2779.50,2744.25,766.90K,"-0,68%"
"Mar 15, 2018",2751.50,2750.75,2763.50,2741.00,358.57K,"0,06%"
"Mar 16, 2018",2751.83,2753.75,2757.00,2747.00,46.76K,"0,01%"
"Mar 19, 2018",2722.75,2756.25,2756.50,2697.25,1.99M,"-1,06%"
"Mar 20, 2018",2723.50,2721.50,2729.00,2712.75,1.10M,"0,03%"
"Mar 21, 2018",2718.25,2723.25,2744.00,2712.50,1.42M,"-0,19%"
"Mar 22, 2018",2643.25,2718.25,2726.25,2641.75,2.55M,"-2,76%"
"Mar 23, 2018",2597.75,2645.75,2658.75,2586.00,2.88M,"-1,72%"
"Mar 26, 2018",2659.50,2595.00,2662.75,2591.00,2.30M,"2,38%"
"Mar 27, 2018",2615.75,2659.50,2679.75,2596.00,2.45M,"-1,65%"
"Mar 28, 2018",2607.50,2612.75,2633.75,2593.00,2.80M,"-0,32%"
"Mar 29, 2018",2643.00,2609.75,2659.50,2601.00,2.04M,"1,36%"
"Apr 02, 2018",2575.00,2635.00,2641.50,2552.00,2.40M,"-2,57%"
"Apr 03, 2018",2613.25,2581.25,2618.75,2573.50,2.22M,"1,49%"
"Apr 04, 2018",2647.00,2612.00,2649.75,2559.50,2.25M,"1,29%"
"Apr 05, 2018",2661.75,2645.75,2672.25,2644.00,1.64M,"0,56%"
"Apr 06, 2018",2605.75,2663.00,2664.00,2584.50,2.62M,"-2,10%"
"Apr 09, 2018",2619.00,2607.50,2653.75,2607.50,1.76M,"0,51%"
"Apr 10, 2018",2655.00,2617.75,2666.25,2612.25,2.00M,"1,37%"
"Apr 11, 2018",2641.00,2654.50,2661.25,2626.00,1.64M,"-0,53%"
"Apr 12, 2018",2664.00,2642.50,2675.00,2639.75,1.30M,"0,87%"
"Apr 13, 2018",2657.25,2661.75,2680.50,2644.75,1.71M,"-0,25%"
"Apr 16, 2018",2681.75,2673.25,2687.00,2660.75,1.24M,"0,92%"
"Apr 17, 2018",2706.50,2679.25,2713.75,2678.75,1.25M,"0,92%"
"Apr 18, 2018",2709.75,2704.50,2718.50,2703.75,1.04M,"0,12%"
"Apr 19, 2018",2693.00,2711.75,2713.25,2681.50,1.58M,"-0,62%"
"Apr 20, 2018",2671.50,2692.50,2698.25,2659.75,1.60M,"-0,80%"
"Apr 23, 2018",2671.25,2683.00,2684.75,2657.25,1.24M,"-0,01%"
"Apr 24, 2018",2635.25,2672.00,2688.50,2616.00,2.33M,"-1,35%"
"Apr 25, 2018",2644.50,2635.25,2648.25,2611.25,1.90M,"0,35%"
"Apr 26, 2018",2674.50,2648.25,2677.50,2639.50,1.28M,"1,13%"
"Apr 27, 2018",2671.50,2675.50,2676.25,2657.75,1.14M,"-0,11%"
"Apr 30, 2018",2647.00,2670.50,2682.25,2645.00,1.34M,"-0,92%"
"May 01, 2018",2652.25,2646.25,2658.00,2623.25,1.32M,"0,20%"
"May 02, 2018",2627.50,2655.50,2658.50,2624.25,1.43M,"-0,93%"
"May 03, 2018",2631.75,2626.75,2636.25,2591.25,2.15M,"0,16%"
"May 04, 2018",2663.00,2631.75,2669.50,2612.25,1.70M,"1,19%"
"May 07, 2018",2670.00,2662.75,2681.50,2661.25,1.15M,"0,26%"
"May 08, 2018",2670.25,2668.00,2674.25,2652.25,1.28M,"0,01%"
"May 09, 2018",2696.00,2669.75,2700.00,2666.50,1.25M,"0,96%"
"May 10, 2018",2718.75,2696.00,2725.00,2692.75,1.17M,"0,84%"
"May 11, 2018",2729.50,2716.25,2732.50,2716.25,1.07M,"0,40%"
"May 14, 2018",2731.00,2727.25,2741.25,2724.25,945.96K,"0,05%"
"May 15, 2018",2709.00,2728.50,2731.25,2700.50,1.52M,"-0,81%"
"May 16, 2018",2723.00,2711.25,2728.00,2704.50,1.06M,"0,52%"
"May 17, 2018",2718.75,2721.75,2732.00,2711.00,1.07M,"-0,16%"
"May 18, 2018",2713.00,2718.75,2727.00,2708.75,1.01M,"-0,21%"
"May 21, 2018",2733.00,2728.75,2739.25,2724.25,951.91K,"0,74%"
"May 22, 2018",2726.00,2731.25,2741.75,2721.50,891.51K,"-0,26%"
"May 23, 2018",2730.75,2724.50,2733.00,2704.50,1.30M,"0,17%"
"May 24, 2018",2727.50,2729.75,2733.25,2705.75,1.28M,"-0,12%"
"May 25, 2018",2718.25,2726.75,2737.75,2713.75,993.78K,"-0,34%"
"May 27, 2018",2729.50,2731.00,2731.00,2726.00,-,"0,41%"
"May 28, 2018",2722.00,2729.50,2731.75,2718.25,-,"-0,27%"
"May 29, 2018",2692.25,2729.00,2731.75,2675.00,1.99M,"-1,09%"
"May 30, 2018",2724.50,2693.25,2729.25,2685.75,1.42M,"1,20%"
"May 31, 2018",2705.50,2720.25,2728.25,2699.75,1.67M,"-0,70%"
"Jun 01, 2018",2733.75,2707.50,2737.00,2706.00,1.24M,"1,04%"
"Jun 04, 2018",2745.50,2731.00,2749.25,2729.00,857.85K,"0,43%"
"Jun 05, 2018",2751.50,2746.00,2753.25,2739.00,1.03M,"0,22%"
"Jun 06, 2018",2772.25,2751.00,2774.75,2748.00,1.33M,"0,75%"
"Jun 07, 2018",2772.25,2773.25,2779.75,2760.00,1.77M,"0,00%"
"Jun 08, 2018",2778.75,2771.00,2779.75,2752.00,1.37M,"0,23%"
"Jun 11, 2018",2783.00,2771.00,2790.50,2770.50,1.22M,"0,15%"
"Jun 12, 2018",2784.00,2781.25,2789.75,2778.50,988.75K,"0,04%"
"Jun 13, 2018",2774.25,2788.00,2791.75,2773.75,614.17K,"-0,35%"
"Jun 14, 2018",2783.25,2773.25,2789.25,2767.50,398.11K,"0,32%"
"Jun 15, 2018",2776.85,2782.50,2784.00,2766.25,45.30K,"-0,23%"
"Jun 18, 2018",2779.75,2780.00,2786.75,2761.25,993.12K,"0,10%"
"Jun 19, 2018",2766.25,2778.25,2780.25,2735.75,1.66M,"-0,49%"
"Jun 20, 2018",2772.00,2765.25,2778.25,2757.25,1.08M,"0,21%"
"Jun 21, 2018",2752.50,2771.75,2785.25,2747.00,1.49M,"-0,70%"
"Jun 22, 2018",2759.50,2750.50,2768.50,2749.25,1.11M,"0,25%"
"Jun 25, 2018",2722.25,2757.00,2758.00,2700.50,2.21M,"-1,35%"
"Jun 26, 2018",2728.50,2721.75,2735.25,2714.75,1.40M,"0,23%"
"Jun 27, 2018",2705.00,2726.50,2748.00,2701.00,2.12M,"-0,86%"
"Jun 28, 2018",2719.50,2705.00,2726.25,2693.25,1.68M,"0,54%"
"Jun 29, 2018",2721.50,2720.00,2745.50,2716.75,1.64M,"0,07%"
"Jul 02, 2018",2727.25,2721.00,2728.50,2698.50,1.21M,"0,21%"
"Jul 03, 2018",2713.25,2727.25,2741.50,2712.00,860.53K,"-0,51%"
"Jul 04, 2018",2719.75,2713.00,2724.00,2712.25,-,"0,24%"
"Jul 05, 2018",2738.50,2713.00,2739.75,2710.75,1.17M,"0,69%"
"Jul 06, 2018",2763.00,2737.00,2766.25,2731.25,1.29M,"0,89%"
"Jul 09, 2018",2787.50,2762.00,2788.00,2761.75,970.34K,"0,89%"
"Jul 10, 2018",2796.75,2787.50,2797.75,2780.50,925.71K,"0,33%"
"Jul 11, 2018",2774.00,2780.75,2787.75,2765.75,1.37M,"-0,81%"
"Jul 12, 2018",2798.50,2776.75,2801.00,2773.75,1.12M,"0,88%"
"Jul 13, 2018",2803.25,2798.50,2807.25,2793.25,952.31K,"0,17%"
"Jul 16, 2018",2796.50,2804.75,2809.00,2795.00,801.61K,"-0,24%"
"Jul 17, 2018",2811.25,2795.75,2815.75,2789.75,1.06M,"0,53%"
"Jul 18, 2018",2816.00,2813.00,2818.25,2806.75,860.52K,"0,17%"
"Jul 19, 2018",2805.25,2814.50,2818.00,2800.25,1.08M,"-0,38%"
"Jul 20, 2018",2800.75,2805.50,2810.50,2793.00,1.01M,"-0,16%"
"Jul 23, 2018",2812.00,2805.25,2812.50,2792.50,812.48K,"0,40%"
"Jul 24, 2018",2821.00,2810.50,2831.25,2810.25,1.35M,"0,32%"
"Jul 25, 2018",2841.25,2819.25,2849.50,2814.00,1.30M,"0,72%"
"Jul 26, 2018",2842.50,2835.25,2846.50,2833.25,1.04M,"0,04%"
"Jul 27, 2018",2817.50,2840.25,2847.00,2808.75,1.49M,"-0,88%"
"Jul 30, 2018",2803.25,2816.00,2821.75,2798.25,1.17M,"-0,51%"
"Jul 31, 2018",2817.00,2805.50,2827.75,2802.75,1.37M,"0,49%"
"Aug 01, 2018",2810.75,2824.25,2825.75,2805.50,1.10M,"-0,22%"
"Aug 02, 2018",2828.50,2814.00,2831.25,2791.00,1.24M,"0,63%"
"Aug 03, 2018",2839.50,2830.75,2841.50,2824.75,922.24K,"0,39%"
"Aug 06, 2018",2850.00,2841.50,2853.50,2835.00,797.32K,"0,37%"
"Aug 07, 2018",2859.75,2849.25,2863.75,2848.25,780.22K,"0,34%"
"Aug 08, 2018",2855.25,2860.50,2862.50,2852.50,745.41K,"-0,16%"
"Aug 09, 2018",2853.75,2853.50,2862.75,2850.50,696.70K,"-0,05%"
"Aug 10, 2018",2836.75,2852.50,2852.75,2826.00,1.42M,"-0,60%"
"Aug 13, 2018",2825.50,2835.75,2843.75,2820.00,1.28M,"-0,40%"
"Aug 14, 2018",2841.00,2826.75,2843.50,2825.75,1.02M,"0,55%"
"Aug 15, 2018",2821.25,2841.75,2843.00,2803.00,1.87M,"-0,70%"
"Aug 16, 2018",2844.75,2822.25,2851.75,2817.50,1.27M,"0,83%"
"Aug 17, 2018",2852.25,2843.50,2857.00,2835.00,1.20M,"0,26%"
"Aug 20, 2018",2858.50,2851.75,2860.75,2850.25,817.38K,"0,22%"
"Aug 21, 2018",2861.75,2856.75,2874.00,2852.00,1.06M,"0,11%"
"Aug 22, 2018",2861.25,2853.00,2868.25,2846.25,996.43K,"-0,02%"
"Aug 23, 2018",2858.00,2861.75,2869.75,2854.75,1.05M,"-0,11%"
"Aug 24, 2018",2876.75,2858.25,2877.50,2856.25,1.06M,"0,66%"
"Aug 27, 2018",2898.50,2877.75,2899.50,2876.75,961.50K,"0,76%"
"Aug 28, 2018",2899.25,2899.00,2906.25,2894.25,902.71K,"0,03%"
"Aug 29, 2018",2914.75,2900.50,2917.50,2897.50,1.11M,"0,53%"
"Aug 30, 2018",2902.00,2915.75,2916.25,2895.50,1.33M,"-0,44%"
"Aug 31, 2018",2902.00,2898.00,2907.50,2891.75,1.32M,"0,00%"
"Sep 02, 2018",2906.50,2906.75,2907.00,2904.75,-,"0,16%"
"Sep 03, 2018",2906.25,2906.50,2912.50,2902.50,-,"-0,01%"
"Sep 04, 2018",2898.25,2906.50,2912.50,2885.50,1.61M,"-0,28%"
"Sep 05, 2018",2888.25,2898.75,2900.50,2877.50,1.60M,"-0,35%"
"Sep 06, 2018",2879.00,2888.50,2893.00,2868.00,1.63M,"-0,32%"
"Sep 07, 2018",2874.75,2877.75,2885.00,2865.00,1.69M,"-0,15%"
"Sep 10, 2018",2880.25,2873.75,2888.25,2873.25,1.25M,"0,19%"
"Sep 11, 2018",2889.75,2879.75,2893.00,2867.25,1.27M,"0,33%"
"Sep 12, 2018",2888.50,2890.00,2895.25,2879.50,1.58M,"-0,04%"
"Sep 13, 2018",2905.25,2887.00,2907.00,2884.75,1.64M,"0,58%"
"Sep 14, 2018",2906.25,2904.75,2912.25,2896.75,1.20M,"0,03%"
"Sep 17, 2018",2891.00,2903.50,2906.25,2887.25,1.16M,"-0,52%"
"Sep 18, 2018",2906.50,2890.50,2912.50,2878.50,986.83K,"0,54%"
"Sep 19, 2018",2910.00,2907.75,2913.75,2900.75,563.50K,"0,12%"
"Sep 20, 2018",2934.00,2911.25,2935.75,2908.25,360.70K,"0,82%"
"Sep 21, 2018",2940.45,2934.75,2944.00,2932.25,38.48K,"0,22%"
"Sep 24, 2018",2925.50,2929.50,2930.25,2917.75,1.16M,"-0,51%"
"Sep 25, 2018",2921.25,2926.50,2934.25,2918.25,1.03M,"-0,15%"
"Sep 26, 2018",2911.50,2922.50,2936.00,2907.50,1.31M,"-0,33%"
"Sep 27, 2018",2920.00,2911.50,2932.00,2907.50,1.21M,"0,29%"
"Sep 28, 2018",2919.00,2922.25,2925.50,2908.00,1.43M,"-0,03%"
"Oct 01, 2018",2930.00,2922.50,2942.00,2922.50,1.24M,"0,38%"
"Oct 02, 2018",2928.50,2929.25,2936.00,2917.50,1.13M,"-0,05%"
"Oct 03, 2018",2931.50,2929.00,2944.75,2924.75,1.24M,"0,10%"
"Oct 04, 2018",2907.75,2926.00,2926.25,2887.75,2.17M,"-0,81%"
"Oct 05, 2018",2894.00,2910.00,2915.50,2873.25,2.29M,"-0,47%"
"Oct 08, 2018",2893.75,2897.50,2898.25,2866.00,1.76M,"-0,01%"
"Oct 09, 2018",2888.25,2892.25,2900.00,2874.50,1.77M,"-0,19%"
"Oct 10, 2018",2781.00,2886.75,2891.25,2771.50,3.46M,"-3,71%"
"Oct 11, 2018",2745.50,2776.50,2798.75,2712.25,4.01M,"-1,28%"
"Oct 12, 2018",2768.50,2748.50,2785.00,2732.25,2.85M,"0,84%"
"Oct 15, 2018",2749.00,2770.00,2778.75,2745.25,1.76M,"-0,70%"
"Oct 16, 2018",2817.75,2747.50,2819.00,2745.50,1.78M,"2,50%"
"Oct 17, 2018",2816.25,2816.25,2824.25,2783.25,1.95M,"-0,05%"
"Oct 18, 2018",2772.25,2813.25,2814.75,2756.50,2.22M,"-1,56%"
"Oct 19, 2018",2767.50,2774.75,2800.50,2762.25,2.02M,"-0,17%"
"Oct 22, 2018",2756.50,2758.00,2782.00,2749.75,1.67M,"-0,40%"
"Oct 23, 2018",2746.25,2755.75,2757.50,2692.25,2.85M,"-0,37%"
"Oct 24, 2018",2664.25,2745.25,2750.00,2652.25,2.86M,"-2,99%"
"Oct 25, 2018",2688.25,2673.75,2723.75,2658.75,2.54M,"0,90%"
"Oct 26, 2018",2669.50,2678.00,2692.75,2627.25,3.51M,"-0,70%"
"Oct 29, 2018",2643.50,2667.00,2707.00,2603.00,2.79M,"-0,97%"
"Oct 30, 2018",2685.25,2639.00,2690.25,2633.25,2.50M,"1,58%"
"Oct 31, 2018",2711.00,2690.75,2737.25,2682.00,2.47M,"0,96%"
"Nov 01, 2018",2738.00,2706.00,2741.25,2705.50,1.82M,"1,00%"
"Nov 02, 2018",2724.25,2724.00,2766.25,2699.50,2.37M,"-0,50%"
"Nov 05, 2018",2739.50,2722.50,2743.75,2712.75,1.31M,"0,56%"
"Nov 06, 2018",2759.00,2739.00,2761.00,2729.75,1.27M,"0,71%"
"Nov 07, 2018",2816.50,2756.75,2817.75,2744.75,1.89M,"2,08%"
"Nov 08, 2018",2808.75,2815.75,2818.00,2795.00,1.32M,"-0,28%"
"Nov 09, 2018",2779.00,2804.00,2811.25,2764.50,1.72M,"-1,06%"
"Nov 12, 2018",2727.75,2778.75,2795.25,2722.25,1.92M,"-1,84%"
"Nov 13, 2018",2727.50,2732.00,2755.75,2714.50,2.10M,"-0,01%"
"Nov 14, 2018",2698.50,2731.25,2748.25,2686.25,2.30M,"-1,06%"
"Nov 15, 2018",2734.50,2702.00,2736.75,2671.25,2.38M,"1,33%"
"Nov 16, 2018",2743.00,2731.75,2748.75,2708.75,1.88M,"0,31%"
"Nov 19, 2018",2696.25,2733.00,2748.00,2681.50,1.99M,"-1,70%"
"Nov 20, 2018",2640.00,2696.25,2696.75,2631.75,2.53M,"-2,09%"
"Nov 21, 2018",2649.00,2639.75,2671.25,2632.25,1.45M,"0,34%"
"Nov 22, 2018",2641.50,2650.50,2656.25,2629.00,-,"-0,28%"
"Nov 23, 2018",2629.50,2650.00,2656.25,2626.00,872.86K,"-0,45%"
"Nov 26, 2018",2670.00,2633.50,2676.25,2631.50,1.37M,"1,54%"
"Nov 27, 2018",2683.50,2661.00,2686.75,2655.25,1.50M,"0,51%"
"Nov 28, 2018",2741.50,2686.25,2745.00,2681.00,1.87M,"2,16%"
"Nov 29, 2018",2744.25,2738.00,2754.50,2723.25,1.49M,"0,10%"
"Nov 30, 2018",2758.25,2742.00,2764.75,2729.00,1.48M,"0,51%"
"Dec 03, 2018",2790.75,2793.50,2814.00,2773.50,1.91M,"1,18%"
"Dec 04, 2018",2701.75,2789.75,2790.50,2696.00,2.71M,"-3,19%"
"Dec 05, 2018",2701.75,2699.50,2720.75,2698.00,184.90K,"0,00%"
"Dec 06, 2018",2691.00,2713.25,2714.00,2621.25,3.31M,"-0,40%"
"Dec 07, 2018",2636.00,2694.25,2709.75,2623.25,2.60M,"-2,04%"
"Dec 10, 2018",2643.00,2625.00,2648.50,2583.00,2.56M,"0,27%"
"Dec 11, 2018",2641.25,2644.00,2678.00,2621.25,2.27M,"-0,07%"
"Dec 12, 2018",2652.50,2632.50,2686.50,2631.75,1.90M,"0,43%"
"Dec 13, 2018",2645.50,2653.00,2671.00,2637.25,2.04M,"-0,26%"
"Dec 14, 2018",2602.00,2646.50,2648.75,2594.00,1.66M,"-1,64%"
"Dec 17, 2018",2552.50,2594.00,2613.75,2530.50,1.60M,"-1,90%"
"Dec 18, 2018",2535.75,2553.75,2574.75,2528.00,1.22M,"-0,66%"
"Dec 19, 2018",2503.25,2530.50,2593.25,2488.00,823.82K,"-1,28%"
"Dec 20, 2018",2485.75,2503.50,2517.50,2441.00,630.21K,"-0,70%"
"Dec 21, 2018",2458.90,2487.00,2491.25,2466.75,65.70K,"-1,08%"
"Dec 24, 2018",2341.75,2407.75,2434.50,2340.50,1.29M,"-4,76%"
"Dec 25, 2018",2345.62,2341.50,2349.38,2317.38,-,"0,17%"
"Dec 26, 2018",2471.00,2348.50,2477.75,2316.75,2.02M,"5,35%"
"Dec 27, 2018",2495.00,2470.25,2498.75,2397.00,2.28M,"0,97%"
"Dec 28, 2018",2486.00,2491.50,2523.00,2472.75,2.01M,"-0,36%"
"Dec 31, 2018",2505.25,2495.50,2513.00,2482.75,1.41M,"0,77%"
"Jan 01, 2019",2517.00,2505.25,2520.88,2505.25,-,"0,47%"
"Jan 02, 2019",2511.00,2508.00,2521.25,2452.25,1.97M,"-0,24%"
"Jan 03, 2019",2447.75,2482.25,2493.50,2443.25,2.26M,"-2,52%"
"Jan 04, 2019",2531.25,2451.75,2539.25,2438.50,2.35M,"3,41%"
"Jan 07, 2019",2550.50,2537.25,2567.50,2523.25,1.63M,"0,76%"
"Jan 08, 2019",2572.50,2553.25,2581.25,2547.50,1.66M,"0,86%"
"Jan 09, 2019",2582.50,2569.50,2596.75,2568.50,1.60M,"0,39%"
"Jan 10, 2019",2594.00,2580.00,2599.50,2560.50,1.53M,"0,45%"
"Jan 11, 2019",2595.00,2594.00,2597.75,2577.00,1.21M,"0,04%"
"Jan 14, 2019",2580.50,2588.50,2592.00,2567.25,1.20M,"-0,56%"
"Jan 15, 2019",2605.50,2581.50,2613.75,2580.00,1.53M,"0,97%"
"Jan 16, 2019",2613.25,2605.75,2626.25,2602.50,1.33M,"0,30%"
"Jan 17, 2019",2635.25,2614.50,2645.50,2596.50,1.51M,"0,84%"
"Jan 18, 2019",2671.50,2636.75,2677.75,2632.75,1.75M,"1,38%"
"Jan 20, 2019",2668.38,2676.50,2677.50,2667.38,-,"-0,12%"
"Jan 21, 2019",2663.25,2668.12,2669.38,2655.25,-,"-0,19%"
"Jan 22, 2019",2632.00,2669.25,2673.50,2616.50,1.88M,"-1,17%"
"Jan 23, 2019",2638.25,2630.75,2653.75,2612.50,1.58M,"0,24%"
"Jan 24, 2019",2634.00,2635.00,2647.50,2626.00,1.27M,"-0,16%"
"Jan 25, 2019",2663.50,2636.25,2672.50,2634.50,1.39M,"1,12%"
"Jan 28, 2019",2642.00,2660.00,2663.50,2622.25,1.41M,"-0,81%"
"Jan 29, 2019",2640.25,2640.25,2650.00,2628.50,1.26M,"-0,07%"
"Jan 30, 2019",2682.50,2648.50,2689.75,2636.25,1.56M,"1,60%"
"Jan 31, 2019",2704.50,2683.50,2713.00,2675.75,1.94M,"0,82%"
"Feb 01, 2019",2704.25,2707.75,2716.00,2695.50,1.47M,"-0,01%"
"Feb 04, 2019",2721.25,2699.25,2725.00,2697.00,1.02M,"0,63%"
"Feb 05, 2019",2731.00,2719.50,2737.75,2716.25,1.23M,"0,36%"
"Feb 06, 2019",2729.50,2730.75,2736.50,2722.25,1.20M,"-0,05%"
"Feb 07, 2019",2704.00,2727.00,2729.25,2685.50,1.92M,"-0,93%"
"Feb 08, 2019",2706.25,2702.00,2709.00,2680.75,1.58M,"0,08%"
"Feb 11, 2019",2708.25,2710.75,2721.50,2700.50,1.11M,"0,07%"
"Feb 12, 2019",2744.75,2707.00,2748.00,2705.50,1.31M,"1,35%"
"Feb 13, 2019",2749.50,2743.50,2762.00,2742.75,1.21M,"0,17%"
"Feb 14, 2019",2743.50,2749.25,2763.00,2730.25,1.68M,"-0,22%"
"Feb 15, 2019",2777.00,2741.25,2778.50,2729.00,1.52M,"1,22%"
"Feb 17, 2019",2778.62,2777.25,2781.38,2775.25,-,"0,06%"
"Feb 18, 2019",2775.88,2778.12,2780.12,2773.38,-,"-0,10%"
"Feb 19, 2019",2778.75,2777.00,2787.50,2766.00,1.20M,"0,10%"
"Feb 20, 2019",2787.00,2777.75,2790.75,2773.25,1.28M,"0,30%"
"Feb 21, 2019",2774.25,2787.00,2798.00,2764.25,1.43M,"-0,46%"
"Feb 22, 2019",2791.25,2773.50,2795.50,2770.50,1.19M,"0,61%"
"Feb 25, 2019",2797.00,2799.50,2814.00,2794.50,1.26M,"0,21%"
"Feb 26, 2019",2791.50,2795.75,2803.50,2783.25,1.20M,"-0,20%"
"Feb 27, 2019",2795.00,2788.00,2797.25,2775.00,1.14M,"0,13%"
"Feb 28, 2019",2784.75,2795.25,2795.75,2781.75,1.36M,"-0,37%"
"Mar 01, 2019",2805.00,2785.25,2808.25,2783.00,1.27M,"0,73%"
"Mar 04, 2019",2791.50,2814.00,2819.75,2767.50,1.79M,"-0,48%"
"Mar 05, 2019",2791.50,2790.50,2799.00,2783.25,1.20M,"0,00%"
"Mar 06, 2019",2771.50,2786.50,2792.75,2768.50,1.51M,"-0,72%"
"Mar 07, 2019",2750.00,2770.50,2776.25,2738.50,1.92M,"-0,78%"
"Mar 08, 2019",2747.00,2749.00,2751.50,2722.00,1.38M,"-0,11%"
"Mar 11, 2019",2784.00,2745.50,2787.50,2736.75,1.30M,"1,35%"
"Mar 12, 2019",2792.00,2784.75,2798.25,2780.50,958.32K,"0,29%"
"Mar 13, 2019",2814.50,2792.25,2821.25,2783.00,583.01K,"0,81%"
"Mar 14, 2019",2807.25,2816.00,2820.00,2803.75,330.52K,"-0,26%"
"Mar 15, 2019",2811.89,2808.00,2821.50,2807.50,42.98K,"0,17%"
"Mar 18, 2019",2840.50,2827.00,2842.00,2824.00,1.04M,"1,02%"
"Mar 19, 2019",2836.50,2841.50,2858.75,2829.00,1.50M,"-0,14%"
"Mar 20, 2019",2827.00,2837.25,2849.25,2817.25,1.69M,"-0,33%"
"Mar 21, 2019",2862.50,2823.75,2866.00,2813.75,1.66M,"1,26%"
"Mar 22, 2019",2810.75,2859.50,2864.75,2805.25,2.25M,"-1,81%"
"Mar 25, 2019",2807.00,2813.00,2818.50,2789.50,1.80M,"-0,13%"
"Mar 26, 2019",2823.00,2808.50,2835.00,2806.00,1.46M,"0,57%"
"Mar 27, 2019",2810.50,2823.50,2831.75,2791.75,1.73M,"-0,44%"
"Mar 28, 2019",2821.00,2807.00,2824.25,2795.00,1.19M,"0,37%"
"Mar 29, 2019",2837.75,2820.50,2840.75,2820.25,1.49M,"0,59%"
"Apr 01, 2019",2870.50,2844.50,2873.50,2844.50,1.26M,"1,15%"
"Apr 02, 2019",2867.00,2868.50,2873.75,2862.25,859.94K,"-0,12%"
"Apr 03, 2019",2879.75,2866.00,2889.25,2865.25,1.24M,"0,44%"
"Apr 04, 2019",2882.75,2880.75,2885.75,2871.00,1.05M,"0,10%"
"Apr 05, 2019",2896.00,2882.50,2898.00,2880.50,1.22M,"0,46%"
"Apr 08, 2019",2898.25,2896.25,2899.75,2884.25,978.91K,"0,08%"
"Apr 09, 2019",2882.50,2898.50,2900.00,2877.25,1.18M,"-0,54%"
"Apr 10, 2019",2894.50,2882.00,2896.00,2878.00,972.31K,"0,42%"
"Apr 11, 2019",2891.75,2894.75,2900.00,2885.25,968.65K,"-0,10%"
"Apr 12, 2019",2912.50,2892.00,2914.75,2890.75,1.23M,"0,72%"
"Apr 15, 2019",2909.50,2912.00,2914.50,2900.50,955.66K,"-0,10%"
"Apr 16, 2019",2911.50,2910.25,2921.25,2904.50,1.12M,"0,07%"
"Apr 17, 2019",2900.50,2910.25,2923.50,2898.50,1.38M,"-0,38%"
"Apr 18, 2019",2910.00,2901.00,2911.75,2889.50,1.34M,"0,33%"
"Apr 19, 2019",2910.50,2910.50,2910.50,2910.50,-,"0,02%"
"Apr 22, 2019",2912.50,2908.75,2915.75,2899.00,706.07K,"0,07%"
"Apr 23, 2019",2938.00,2911.75,2939.75,2908.00,1.19M,"0,88%"
"Apr 24, 2019",2930.75,2937.25,2939.75,2927.75,1.13M,"-0,25%"
"Apr 25, 2019",2926.25,2930.00,2935.75,2914.25,1.38M,"-0,15%"
"Apr 26, 2019",2941.50,2923.75,2942.75,2917.25,1.25M,"0,52%"
"Apr 29, 2019",2943.00,2939.25,2951.50,2937.75,944.85K,"0,05%"
"Apr 30, 2019",2948.50,2942.50,2956.50,2926.00,1.49M,"0,19%"
"May 01, 2019",2923.00,2955.00,2961.25,2916.00,1.50M,"-0,86%"
"May 02, 2019",2917.50,2916.50,2932.75,2901.00,1.81M,"-0,19%"
"May 03, 2019",2947.50,2918.50,2949.50,2916.50,1.30M,"1,03%"
"May 06, 2019",2932.50,2917.75,2938.25,2883.50,2.04M,"-0,51%"
"May 07, 2019",2890.75,2911.75,2930.50,2862.50,2.81M,"-1,42%"
"May 08, 2019",2887.25,2889.75,2899.50,2868.75,2.04M,"-0,12%"
"May 09, 2019",2872.75,2884.00,2885.50,2836.25,2.71M,"-0,50%"
"May 10, 2019",2887.00,2869.75,2893.00,2826.00,2.85M,"0,50%"
"May 13, 2019",2807.00,2858.50,2869.25,2802.00,2.79M,"-2,77%"
"May 14, 2019",2839.25,2806.00,2853.75,2799.75,1.80M,"1,15%"
"May 15, 2019",2855.00,2840.75,2860.00,2815.00,1.75M,"0,55%"
"May 16, 2019",2878.50,2853.50,2894.00,2840.50,1.69M,"0,82%"
"May 17, 2019",2862.00,2879.75,2887.50,2852.50,1.93M,"-0,57%"
"May 20, 2019",2844.00,2861.50,2876.50,2832.50,1.66M,"-0,63%"
"May 21, 2019",2866.00,2848.00,2870.75,2846.25,1.30M,"0,77%"
"May 22, 2019",2857.50,2864.75,2869.50,2848.25,1.26M,"-0,30%"
"May 23, 2019",2819.50,2857.75,2858.50,2805.75,2.01M,"-1,33%"
"May 24, 2019",2831.75,2821.75,2842.00,2819.25,1.20M,"0,43%"
"May 26, 2019",2830.62,2830.88,2834.88,2829.38,-,"-0,04%"
"May 27, 2019",2833.25,2829.88,2838.38,2826.62,-,"0,09%"
"May 28, 2019",2805.00,2831.00,2841.25,2800.50,1.63M,"-1,00%"
"May 29, 2019",2780.00,2804.25,2806.00,2766.25,2.09M,"-0,89%"
"May 30, 2019",2790.50,2779.50,2799.00,2776.50,1.28M,"0,38%"
"May 31, 2019",2752.50,2788.75,2791.00,2750.00,2.21M,"-1,36%"
"Jun 03, 2019",2749.50,2741.00,2763.75,2728.75,2.30M,"-0,11%"
"Jun 04, 2019",2805.00,2754.00,2806.25,2744.00,1.84M,"2,02%"
"Jun 05, 2019",2827.75,2806.50,2829.50,2801.00,1.74M,"0,81%"
"Jun 06, 2019",2845.75,2820.50,2853.00,2812.75,1.57M,"0,64%"
"Jun 07, 2019",2875.00,2840.00,2886.25,2838.00,1.69M,"1,03%"
"Jun 10, 2019",2889.25,2893.25,2905.75,2880.50,1.42M,"0,50%"
"Jun 11, 2019",2887.00,2890.25,2911.50,2879.25,1.40M,"-0,08%"
"Jun 12, 2019",2881.00,2887.25,2891.00,2875.25,1.21M,"-0,21%"
"Jun 13, 2019",2894.50,2882.00,2896.50,2867.25,1.44M,"0,47%"
"Jun 14, 2019",2890.50,2893.75,2898.75,2880.50,1.26M,"-0,14%"
"Jun 17, 2019",2892.00,2890.75,2900.75,2887.75,1.16M,"0,05%"
"Jun 18, 2019",2921.75,2893.50,2931.75,2884.50,1.07M,"1,03%"
"Jun 19, 2019",2929.00,2920.50,2932.50,2909.00,638.95K,"0,25%"
"Jun 20, 2019",2955.75,2926.75,2960.00,2926.00,473.31K,"0,91%"
"Jun 21, 2019",2953.90,2953.75,2956.00,2944.00,47.73K,"-0,06%"
"Jun 24, 2019",2952.00,2948.00,2961.75,2947.25,910.17K,"-0,06%"
"Jun 25, 2019",2922.00,2951.00,2958.25,2920.00,1.42M,"-1,02%"
"Jun 26, 2019",2918.00,2922.50,2939.00,2914.50,1.23M,"-0,14%"
"Jun 27, 2019",2931.00,2914.75,2935.75,2914.75,1.06M,"0,45%"
"Jun 28, 2019",2944.25,2932.75,2955.25,2930.00,1.32M,"0,45%"
"Jul 01, 2019",2967.75,2970.00,2981.75,2955.50,1.46M,"0,80%"
"Jul 02, 2019",2979.50,2968.00,2980.00,2958.50,1.12M,"0,40%"
"Jul 03, 2019",3000.25,2979.00,3001.50,2973.75,805.26K,"0,70%"
"Jul 04, 2019",3002.62,2999.38,3003.62,2997.38,-,"0,08%"
"Jul 05, 2019",2990.50,3000.75,3006.00,2971.25,1.34M,"-0,40%"
"Jul 08, 2019",2978.50,2990.75,2994.75,2973.25,1.02M,"-0,40%"
"Jul 09, 2019",2982.00,2977.75,2986.25,2963.50,956.65K,"0,12%"
"Jul 10, 2019",2997.50,2982.25,3007.50,2971.25,1.42M,"0,52%"
"Jul 11, 2019",3004.00,2996.00,3006.75,2992.50,1.18M,"0,22%"
"Jul 12, 2019",3015.50,3003.00,3018.00,3002.25,969.96K,"0,38%"
"Jul 15, 2019",3017.25,3015.25,3023.50,3010.75,829.94K,"0,06%"
"Jul 16, 2019",3007.00,3017.25,3021.75,3004.50,939.81K,"-0,34%"
"Jul 17, 2019",2985.00,3005.75,3013.00,2980.50,1.04M,"-0,73%"
"Jul 18, 2019",2997.50,2980.75,3005.25,2974.50,1.35M,"0,42%"
"Jul 19, 2019",2977.00,3003.75,3009.75,2969.50,1.48M,"-0,68%"
"Jul 22, 2019",2989.00,2974.50,2993.50,2972.50,1.10M,"0,40%"
"Jul 23, 2019",3008.00,2988.75,3008.50,2987.50,1.06M,"0,64%"
"Jul 24, 2019",3021.50,3003.00,3022.00,2996.00,1.07M,"0,45%"
"Jul 25, 2019",3006.50,3018.00,3027.75,2998.00,1.33M,"-0,50%"
"Jul 26, 2019",3024.50,3006.50,3029.50,3006.00,961.02K,"0,60%"
"Jul 29, 2019",3021.75,3022.00,3027.25,3015.50,823.57K,"-0,09%"
"Jul 30, 2019",3012.25,3022.25,3027.50,3001.50,1.18M,"-0,31%"
"Jul 31, 2019",2982.25,3016.25,3020.75,2958.00,1.95M,"-1,00%"
"Aug 01, 2019",2952.00,2970.25,3014.25,2944.50,2.74M,"-1,01%"
"Aug 02, 2019",2932.50,2950.25,2961.00,2913.50,2.45M,"-0,66%"
"Aug 05, 2019",2830.00,2929.25,2933.50,2820.50,3.07M,"-3,50%"
"Aug 06, 2019",2876.00,2816.25,2883.75,2775.75,2.60M,"1,63%"
"Aug 07, 2019",2880.50,2873.75,2891.50,2823.25,2.68M,"0,16%"
"Aug 08, 2019",2940.00,2879.00,2940.75,2870.50,1.80M,"2,07%"
"Aug 09, 2019",2919.75,2928.00,2935.75,2899.00,2.03M,"-0,69%"
"Aug 12, 2019",2880.25,2918.75,2931.00,2872.50,1.71M,"-1,35%"
"Aug 13, 2019",2932.00,2882.25,2944.25,2866.75,2.18M,"1,80%"
"Aug 14, 2019",2840.75,2931.00,2936.50,2835.75,2.79M,"-3,11%"
"Aug 15, 2019",2848.50,2836.00,2871.75,2817.75,2.50M,"0,27%"
"Aug 16, 2019",2891.50,2851.00,2894.75,2849.50,1.63M,"1,51%"
"Aug 19, 2019",2923.75,2893.00,2932.25,2892.50,1.29M,"1,12%"
"Aug 20, 2019",2898.25,2921.25,2932.25,2894.25,1.48M,"-0,87%"
"Aug 21, 2019",2929.25,2893.25,2932.50,2893.00,1.18M,"1,07%"
"Aug 22, 2019",2922.25,2931.25,2939.75,2904.25,1.47M,"-0,24%"
"Aug 23, 2019",2855.50,2920.25,2936.75,2834.00,2.86M,"-2,28%"
"Aug 26, 2019",2883.25,2831.00,2888.50,2810.25,1.85M,"0,97%"
"Aug 27, 2019",2865.50,2882.75,2899.50,2860.00,1.53M,"-0,62%"
"Aug 28, 2019",2889.75,2866.25,2890.50,2851.75,1.49M,"0,85%"
"Aug 29, 2019",2926.75,2883.25,2930.75,2875.25,1.49M,"1,28%"
"Aug 30, 2019",2924.75,2923.25,2946.50,2913.25,1.64M,"-0,07%"
"Sep 01, 2019",2908.88,2923.50,2923.50,2893.75,-,"-0,54%"
"Sep 02, 2019",2902.88,2909.12,2926.50,2890.50,-,"-0,21%"
"Sep 03, 2019",2906.00,2901.00,2926.50,2889.00,2.00M,"0,11%"
"Sep 04, 2019",2938.50,2903.00,2939.50,2902.00,1.25M,"1,12%"
"Sep 05, 2019",2972.00,2938.00,2986.50,2936.50,1.67M,"1,14%"
"Sep 06, 2019",2980.75,2970.75,2988.25,2970.25,1.18M,"0,29%"
"Sep 09, 2019",2978.25,2980.25,2991.50,2969.50,1.20M,"-0,08%"
"Sep 10, 2019",2978.50,2979.25,2985.00,2957.25,1.49M,"0,01%"
"Sep 11, 2019",3002.00,2979.00,3004.25,2972.00,1.42M,"0,79%"
"Sep 12, 2019",3011.75,3003.00,3021.75,3001.00,1.75M,"0,32%"
"Sep 13, 2019",3006.50,3010.00,3023.75,3003.50,1.28M,"-0,17%"
"Sep 16, 2019",2999.00,2993.50,3003.25,2981.25,1.20M,"-0,25%"
"Sep 17, 2019",3005.50,3001.75,3006.50,2991.50,1.10M,"0,22%"
"Sep 18, 2019",3006.25,3006.00,3011.00,2978.50,637.34K,"0,02%"
"Sep 19, 2019",3006.00,3008.00,3022.25,2988.75,372.85K,"-0,01%"
"Sep 20, 2019",3013.61,3005.50,3015.50,3001.75,37.79K,"0,25%"
"Sep 23, 2019",2997.00,2995.75,3008.25,2982.00,1.04M,"-0,55%"
"Sep 24, 2019",2970.25,3001.00,3012.25,2958.50,1.94M,"-0,89%"
"Sep 25, 2019",2986.25,2971.00,2991.75,2953.75,1.50M,"0,54%"
"Sep 26, 2019",2980.50,2985.75,2995.00,2964.25,1.35M,"-0,19%"
"Sep 27, 2019",2963.75,2979.75,2993.00,2946.25,1.67M,"-0,56%"
"Sep 30, 2019",2978.50,2976.00,2986.25,2964.50,1.16M,"0,50%"
"Oct 01, 2019",2937.75,2984.00,2994.50,2937.00,1.60M,"-1,37%"
"Oct 02, 2019",2880.50,2942.25,2949.00,2874.00,2.13M,"-1,95%"
"Oct 03, 2019",2911.75,2883.75,2912.50,2855.00,2.04M,"1,08%"
"Oct 04, 2019",2951.00,2911.50,2953.25,2896.75,1.50M,"1,35%"
"Oct 07, 2019",2937.50,2929.75,2959.50,2928.00,1.27M,"-0,46%"
"Oct 08, 2019",2892.50,2934.50,2950.00,2890.50,1.87M,"-1,53%"
"Oct 09, 2019",2919.00,2893.50,2934.25,2888.25,1.31M,"0,92%"
"Oct 10, 2019",2941.00,2920.50,2954.00,2881.75,1.58M,"0,75%"
"Oct 11, 2019",2970.75,2949.00,2994.00,2941.75,1.74M,"1,01%"
"Oct 14, 2019",2965.50,2968.00,2982.50,2953.75,833.67K,"-0,18%"
"Oct 15, 2019",2997.75,2966.75,3003.25,2966.50,1.18M,"1,09%"
"Oct 16, 2019",2991.50,2996.50,2997.75,2984.75,1.15M,"-0,21%"
"Oct 17, 2019",2998.00,2992.25,3008.00,2985.25,1.12M,"0,22%"
"Oct 18, 2019",2988.25,2997.75,3001.25,2975.00,1.34M,"-0,33%"
"Oct 21, 2019",3006.50,2984.75,3007.50,2983.75,886.56K,"0,61%"
"Oct 22, 2019",2994.50,3006.50,3014.25,2988.25,1.13M,"-0,40%"
"Oct 23, 2019",3005.75,2992.00,3006.00,2982.00,1.06M,"0,38%"
"Oct 24, 2019",3004.25,3006.00,3015.25,2998.75,1.06M,"-0,05%"
"Oct 25, 2019",3020.25,3003.75,3026.50,3000.00,1.10M,"0,53%"
"Oct 28, 2019",3036.25,3023.00,3042.75,3022.75,1.04M,"0,53%"
"Oct 29, 2019",3035.75,3038.25,3046.25,3029.50,1.04M,"-0,02%"
"Oct 30, 2019",3047.75,3036.50,3055.00,3023.25,1.18M,"0,40%"
"Oct 31, 2019",3035.75,3051.75,3052.00,3020.25,1.77M,"-0,39%"
"Nov 01, 2019",3063.25,3036.00,3065.00,3033.00,1.28M,"0,91%"
"Nov 04, 2019",3075.75,3064.75,3083.75,3064.75,1.18M,"0,41%"
"Nov 05, 2019",3072.00,3076.75,3085.75,3069.75,1.12M,"-0,12%"
"Nov 06, 2019",3075.50,3071.50,3078.00,3063.00,1.08M,"0,11%"
"Nov 07, 2019",3086.00,3077.25,3097.00,3070.25,1.35M,"0,34%"
"Nov 08, 2019",3090.50,3086.25,3092.50,3072.50,1.08M,"0,15%"
"Nov 11, 2019",3087.50,3090.50,3092.25,3074.50,844.60K,"-0,10%"
"Nov 12, 2019",3092.00,3087.75,3102.00,3081.25,1.10M,"0,15%"
"Nov 13, 2019",3095.50,3091.25,3097.00,3075.75,1.25M,"0,11%"
"Nov 14, 2019",3097.00,3096.25,3099.75,3081.75,1.11M,"0,05%"
"Nov 15, 2019",3118.25,3097.00,3119.50,3095.75,1.25M,"0,69%"
"Nov 18, 2019",3121.75,3119.00,3127.75,3111.00,1.03M,"0,11%"
"Nov 19, 2019",3118.50,3121.50,3132.50,3112.75,1.20M,"-0,10%"
"Nov 20, 2019",3109.00,3116.50,3118.50,3090.75,1.69M,"-0,30%"
"Nov 21, 2019",3104.00,3097.25,3114.50,3091.25,1.43M,"-0,16%"
"Nov 22, 2019",3111.50,3104.00,3114.50,3097.75,995.42K,"0,24%"
"Nov 25, 2019",3132.75,3119.00,3133.50,3116.50,947.83K,"0,68%"
"Nov 26, 2019",3143.75,3131.25,3145.00,3128.00,1.07M,"0,35%"
"Nov 27, 2019",3153.75,3143.75,3155.00,3141.75,928.79K,"0,32%"
"Nov 28, 2019",3151.12,3144.62,3151.62,3142.00,-,"-0,08%"
"Nov 29, 2019",3143.75,3154.75,3155.00,3139.50,902.19K,"-0,23%"
"Dec 02, 2019",3114.25,3146.25,3158.00,3110.25,1.93M,"-0,94%"
"Dec 03, 2019",3091.00,3114.25,3121.75,3069.50,2.15M,"-0,75%"
"Dec 04, 2019",3111.00,3091.75,3119.50,3081.75,1.49M,"0,65%"
"Dec 05, 2019",3117.75,3111.00,3124.75,3103.25,1.32M,"0,22%"
"Dec 06, 2019",3146.00,3117.75,3151.00,3117.00,1.30M,"0,91%"
"Dec 09, 2019",3134.50,3146.50,3149.50,3131.25,1.15M,"-0,37%"
"Dec 10, 2019",3136.00,3133.50,3143.00,3116.25,1.43M,"0,05%"
"Dec 11, 2019",3143.00,3135.50,3144.50,3129.50,1.23M,"0,22%"
"Dec 12, 2019",3168.00,3144.00,3177.50,3137.25,2.38M,"0,80%"
"Dec 13, 2019",3172.00,3175.75,3185.00,3156.75,1.83M,"0,13%"
"Dec 16, 2019",3194.25,3176.50,3198.75,3173.75,1.41M,"0,70%"
"Dec 17, 2019",3192.00,3192.50,3199.25,3187.75,1.03M,"-0,07%"
"Dec 18, 2019",3194.75,3189.50,3199.00,3188.50,582.63K,"0,09%"
"Dec 19, 2019",3207.10,3195.00,3209.00,3190.25,433.42K,"0,39%"
"Dec 20, 2019",3231.02,3208.50,3220.25,3204.25,46.15K,"0,75%"
"Dec 23, 2019",3227.25,3227.00,3234.25,3224.25,665.90K,"-0,12%"
"Dec 24, 2019",3225.75,3228.25,3231.25,3222.50,297.97K,"-0,05%"
"Dec 25, 2019",3227.38,3226.25,3228.12,3226.25,-,"0,05%"
"Dec 26, 2019",3244.50,3227.50,3244.75,3227.00,464.64K,"0,53%"
"Dec 27, 2019",3237.50,3242.00,3254.00,3235.50,984.39K,"-0,22%"
"Dec 30, 2019",3223.50,3238.25,3244.25,3217.25,1.12M,"-0,43%"
"Dec 31, 2019",3231.00,3223.25,3236.25,3213.00,1.16M,"0,23%"
"Jan 01, 2020",3237.62,3236.00,3240.62,3234.88,-,"0,20%"
"Jan 02, 2020",3259.00,3237.00,3261.75,3234.25,1.42M,"0,66%"
"Jan 03, 2020",3235.50,3261.00,3263.50,3206.75,1.76M,"-0,72%"
"Jan 06, 2020",3243.50,3220.25,3249.50,3208.75,1.50M,"0,25%"
"Jan 07, 2020",3235.25,3243.50,3254.50,3226.00,1.29M,"-0,25%"
"Jan 08, 2020",3260.25,3231.75,3267.75,3181.00,2.28M,"0,77%"
"Jan 09, 2020",3276.00,3261.25,3276.75,3257.75,1.30M,"0,48%"
"Jan 10, 2020",3264.75,3275.50,3287.00,3260.75,1.53M,"-0,34%"
"Jan 13, 2020",3289.75,3265.75,3291.00,3265.50,1.01M,"0,77%"
"Jan 14, 2020",3288.00,3289.25,3296.75,3275.25,1.69M,"-0,05%"
"Jan 15, 2020",3293.75,3287.75,3299.00,3277.75,1.47M,"0,17%"
"Jan 16, 2020",3316.50,3294.25,3318.00,3294.00,1.34M,"0,69%"
"Jan 17, 2020",3325.00,3316.75,3330.25,3316.00,1.31M,"0,26%"
"Jan 20, 2020",3322.88,3327.88,3328.38,3318.62,-,"-0,06%"
"Jan 21, 2020",3319.50,3325.00,3329.75,3307.25,1.57M,"-0,10%"
"Jan 22, 2020",3319.75,3321.25,3337.50,3315.25,1.51M,"0,01%"
"Jan 23, 2020",3326.00,3317.25,3327.00,3301.25,1.72M,"0,19%"
"Jan 24, 2020",3293.50,3326.50,3337.00,3280.50,2.52M,"-0,98%"
"Jan 27, 2020",3239.50,3269.75,3269.75,3233.00,2.58M,"-1,64%"
"Jan 28, 2020",3278.25,3239.50,3285.00,3238.75,1.91M,"1,20%"
"Jan 29, 2020",3272.50,3281.75,3292.75,3265.25,1.67M,"-0,18%"
"Jan 30, 2020",3289.75,3271.50,3295.25,3239.75,2.42M,"0,53%"
"Jan 31, 2020",3224.00,3292.00,3297.50,3212.75,3.15M,"-2,00%"
"Feb 03, 2020",3245.50,3222.75,3267.25,3222.00,1.92M,"0,67%"
"Feb 04, 2020",3299.50,3244.25,3305.25,3236.00,1.70M,"1,66%"
"Feb 05, 2020",3335.00,3300.25,3338.00,3288.25,2.05M,"1,08%"
"Feb 06, 2020",3345.25,3337.00,3357.75,3332.50,1.46M,"0,31%"
"Feb 07, 2020",3325.50,3349.00,3350.00,3320.75,1.70M,"-0,59%"
"Feb 10, 2020",3353.00,3322.25,3353.50,3303.50,1.40M,"0,83%"
"Feb 11, 2020",3357.50,3351.00,3374.50,3349.25,1.49M,"0,13%"
"Feb 12, 2020",3380.50,3360.50,3381.50,3355.50,1.23M,"0,69%"
"Feb 13, 2020",3377.50,3381.25,3384.75,3348.50,1.77M,"-0,09%"
"Feb 14, 2020",3381.00,3379.50,3388.50,3365.25,1.33M,"0,10%"
"Feb 16, 2020",3387.38,3382.62,3389.38,3382.62,-,"0,19%"
"Feb 17, 2020",3376.00,3387.62,3392.38,3372.12,-,"-0,34%"
"Feb 18, 2020",3369.25,3382.25,3392.50,3355.25,1.74M,"-0,20%"
"Feb 19, 2020",3387.25,3372.00,3393.75,3370.75,1.16M,"0,53%"
"Feb 20, 2020",3369.25,3391.75,3397.50,3339.25,2.07M,"-0,53%"
"Feb 21, 2020",3339.25,3367.00,3369.25,3328.00,2.29M,"-0,89%"
"Feb 24, 2020",3226.25,3309.00,3312.00,3213.75,3.64M,"-3,38%"
"Feb 25, 2020",3132.50,3223.00,3259.50,3117.25,4.38M,"-2,91%"
"Feb 26, 2020",3110.25,3138.00,3182.00,3091.00,3.89M,"-0,71%"
"Feb 27, 2020",2957.00,3100.25,3117.00,2944.50,4.73M,"-4,93%"
"Feb 28, 2020",2951.00,2950.00,2996.00,2853.25,5.72M,"-0,20%"
"Mar 02, 2020",3065.00,2900.00,3093.25,2889.25,3.69M,"3,86%"
"Mar 03, 2020",2997.00,3077.00,3137.00,2973.00,3.75M,"-2,22%"
"Mar 04, 2020",3114.75,2988.25,3129.50,2976.50,2.59M,"3,93%"
"Mar 05, 2020",3015.50,3109.25,3113.75,2996.50,2.81M,"-3,19%"
"Mar 06, 2020",2964.00,3024.25,3037.00,2898.00,3.16M,"-1,71%"
"Mar 09, 2020",2747.75,2916.00,2916.00,2715.00,2.67M,"-7,30%"
"Mar 10, 2020",2865.75,2733.00,2884.75,2695.25,3.42M,"4,29%"
"Mar 11, 2020",2740.25,2859.50,2869.50,2702.75,2.99M,"-4,38%"
"Mar 12, 2020",2469.00,2738.00,2774.00,2442.50,4.37M,"-9,90%"
"Mar 13, 2020",2696.00,2429.50,2707.75,2393.50,3.42M,"9,19%"
"Mar 16, 2020",2416.25,2673.75,2675.00,2360.25,2.38M,"-10,38%"
"Mar 17, 2020",2495.50,2417.25,2554.50,2365.00,1.68M,"3,28%"
"Mar 18, 2020",2414.00,2478.50,2498.00,2274.75,976.54K,"-3,27%"
"Mar 19, 2020",2403.25,2414.25,2474.00,2288.00,631.23K,"-0,45%"
"Mar 20, 2020",2437.98,2364.25,2512.75,2346.25,71.68K,"1,45%"
"Mar 23, 2020",2220.50,2220.25,2386.00,2174.00,-,"-8,92%"
"Mar 24, 2020",2438.00,2233.25,2447.75,2230.50,-,"9,80%"
"Mar 25, 2020",2467.00,2442.75,2560.75,2386.00,-,"1,19%"
"Mar 26, 2020",2608.00,2471.00,2625.75,2402.25,-,"5,72%"
"Mar 27, 2020",2524.00,2627.75,2634.50,2505.25,-,"-3,22%"
"Mar 30, 2020",2611.25,2459.00,2621.75,2445.00,-,"3,46%"
"Mar 31, 2020",2569.75,2613.25,2635.75,2555.75,-,"-1,59%"
"Apr 01, 2020",2448.00,2562.00,2562.25,2434.25,-,"-4,74%"
"Apr 02, 2020",2516.50,2459.00,2525.00,2424.75,-,"2,80%"
"Apr 03, 2020",2482.75,2513.75,2529.50,2449.00,-,"-1,34%"
"Apr 06, 2020",2644.50,2485.00,2668.50,2484.75,-,"6,51%"
"Apr 07, 2020",2642.00,2645.50,2750.00,2623.50,-,"-0,09%"
"Apr 08, 2020",2735.00,2640.50,2752.50,2620.75,-,"3,52%"
"Apr 09, 2020",2779.75,2737.75,2809.50,2701.00,2.34M,"1,64%"
"Apr 10, 2020",2787.25,2787.25,2787.25,2787.25,-,"0,27%"
"Apr 13, 2020",2759.25,2811.00,2819.50,2711.00,-,"-1,00%"
"Apr 14, 2020",2843.00,2760.00,2846.00,2752.50,-,"3,04%"
"Apr 15, 2020",2775.00,2843.75,2845.50,2751.25,-,"-2,39%"
"Apr 16, 2020",2787.50,2767.75,2831.50,2746.00,1.75M,"0,45%"
"Apr 17, 2020",2870.00,2863.00,2885.00,2821.00,-,"2,96%"
