Date,Price,Open,High,Low
"Jun 03, 2019",36.45709991455078,36.32379913330078,37.09519958496094,36.32379913330078
"Jun 04, 2019",36.19049835205078,36.75239944458008,36.80950164794922,35.819000244140625
"Jun 05, 2019",35.76190185546875,36.41899871826172,36.80950164794922,35.46670150756836
"Jun 06, 2019",36.476200103759766,35.80950164794922,37.09519958496094,35.771400451660156
"Jun 07, 2019",36.95240020751953,36.61899948120117,37.0,36.13330078125
"Jun 10, 2019",36.88570022583008,36.504798889160156,37.06669998168945,36.342899322509766
"Jun 11, 2019",37.4286003112793,37.09519958496094,37.80950164794922,37.06669998168945
"Jun 12, 2019",37.13330078125,37.447601318359375,38.07619857788086,36.714298248291016
"Jun 13, 2019",37.54290008544922,37.38100051879883,37.8286018371582,37.13330078125
"Jun 14, 2019",37.504798889160156,37.53329849243164,37.90480041503906,37.20949935913086
"Jun 17, 2019",37.85710144042969,37.53329849243164,38.51430130004883,37.314300537109375
"Jun 18, 2019",38.20949935913086,38.20949935913086,38.61899948120117,37.93330001831055
"Jun 19, 2019",39.009498596191406,38.20949935913086,39.25709915161133,38.01900100708008
"Jun 21, 2019",38.95240020751953,38.895198822021484,39.504798889160156,38.6952018737793
"Jun 24, 2019",39.59049987792969,39.14289855957031,39.59049987792969,38.79050064086914
"Jun 25, 2019",38.37139892578125,39.23809814453125,39.23809814453125,38.04759979248047
"Jun 26, 2019",38.41899871826172,38.495201110839844,38.78099822998047,37.8286018371582
"Jun 27, 2019",38.35240173339844,38.009498596191406,38.64759826660156,37.733299255371094
"Jun 28, 2019",39.02859878540039,38.733299255371094,39.02859878540039,38.400001525878906
"Jul 01, 2019",38.85710144042969,39.02859878540039,39.09519958496094,38.5619010925293
"Jul 02, 2019",39.13330078125,38.95240020751953,39.13330078125,38.504798889160156
"Jul 03, 2019",39.819000244140625,38.685699462890625,40.104801177978516,38.599998474121094
"Jul 04, 2019",40.61899948120117,40.37139892578125,40.95240020751953,40.09519958496094
"Jul 05, 2019",40.83810043334961,40.266700744628906,41.33330154418945,39.83810043334961
"Jul 08, 2019",41.4286003112793,40.85710144042969,42.057098388671875,40.85710144042969
"Jul 10, 2019",42.02859878540039,41.4286003112793,42.228599548339844,40.79050064086914
"Jul 11, 2019",41.057098388671875,42.07619857788086,42.08570098876953,40.74290084838867
"Jul 12, 2019",40.23809814453125,41.057098388671875,41.495201110839844,39.76190185546875
"Jul 15, 2019",39.98099899291992,40.285701751708984,40.61899948120117,39.72380065917969
"Jul 16, 2019",40.95240020751953,40.02859878540039,41.06669998168945,39.95240020751953
"Jul 17, 2019",41.13330078125,41.11429977416992,41.76190185546875,40.98099899291992
"Jul 18, 2019",41.523799896240234,41.4286003112793,41.714298248291016,40.88570022583008
"Jul 19, 2019",40.819000244140625,41.23809814453125,41.45709991455078,40.62860107421875
"Jul 22, 2019",41.01900100708008,41.13330078125,41.87620162963867,40.66669845581055
"Jul 23, 2019",40.476200103759766,41.152400970458984,41.152400970458984,40.285701751708984
"Jul 24, 2019",41.16189956665039,40.4286003112793,41.447601318359375,40.4286003112793
"Jul 25, 2019",41.23809814453125,41.19049835205078,41.361900329589844,40.523799896240234
"Jul 26, 2019",41.1713981628418,41.152400970458984,41.476200103759766,40.819000244140625
"Jul 29, 2019",41.714298248291016,41.04759979248047,41.714298248291016,40.8286018371582
"Jul 30, 2019",41.90480041503906,41.78099822998047,42.32379913330078,41.33330154418945
"Jul 31, 2019",41.90480041503906,42.228599548339844,42.266700744628906,41.152400970458984
"Aug 01, 2019",42.74290084838867,42.38100051879883,42.79050064086914,41.51430130004883
"Aug 02, 2019",43.53329849243164,43.25709915161133,43.714298248291016,41.53329849243164
"Aug 05, 2019",42.0,42.657100677490234,42.92380142211914,41.33330154418945
"Aug 06, 2019",42.76190185546875,42.27619934082031,42.847599029541016,41.90480041503906
"Aug 07, 2019",41.41899871826172,41.990501403808594,42.33330154418945,41.33330154418945
"Aug 08, 2019",42.85710144042969,41.72380065917969,42.85710144042969,41.599998474121094
"Aug 09, 2019",42.476200103759766,43.0,43.552398681640625,42.11429977416992
"Aug 12, 2019",41.8286018371582,41.85710144042969,41.895198822021484,41.4286003112793
"Aug 13, 2019",42.83810043334961,41.714298248291016,42.847599029541016,41.20949935913086
"Aug 14, 2019",41.97140121459961,42.20949935913086,42.53329849243164,41.599998474121094
"Aug 15, 2019",41.38100051879883,42.390499114990234,42.390499114990234,40.58100128173828
"Aug 16, 2019",42.847599029541016,41.66669845581055,42.847599029541016,41.12379837036133
"Aug 19, 2019",42.61899948120117,43.23809814453125,43.33330154418945,42.13330078125
"Aug 20, 2019",42.1713981628418,42.61899948120117,42.61899948120117,41.5713996887207
"Aug 21, 2019",43.23809814453125,42.85710144042969,43.495201110839844,42.40950012207031
"Aug 22, 2019",42.504798889160156,43.51430130004883,43.51430130004883,42.390499114990234
"Aug 23, 2019",41.67620086669922,42.08570098876953,42.390499114990234,41.1713981628418
"Aug 26, 2019",40.86669921875,42.14289855957031,42.14289855957031,40.638099670410156
"Aug 27, 2019",42.5713996887207,41.03810119628906,42.67620086669922,41.03810119628906
"Aug 28, 2019",42.92380142211914,42.37139892578125,42.97140121459961,41.72380065917969
"Aug 29, 2019",44.0,42.92380142211914,44.08570098876953,42.48569869995117
"Aug 30, 2019",44.79999923706055,44.476200103759766,45.504798889160156,44.23809814453125
"Sep 02, 2019",44.66669845581055,44.76190185546875,45.21900177001953,44.38100051879883
"Sep 03, 2019",44.342899322509766,44.609500885009766,45.76190185546875,44.057098388671875
"Sep 04, 2019",44.93330001831055,44.86669921875,45.21900177001953,44.14289855957031
"Sep 05, 2019",45.0,45.21900177001953,45.75239944458008,44.67620086669922
"Sep 06, 2019",44.599998474121094,45.152400970458984,45.40950012207031,44.20949935913086
"Sep 09, 2019",43.35240173339844,44.66669845581055,45.14289855957031,43.21900177001953
"Sep 10, 2019",42.75239944458008,43.06669998168945,43.4286003112793,41.3047981262207
"Sep 11, 2019",43.476200103759766,43.09519958496094,43.66669845581055,42.98099899291992
"Sep 12, 2019",43.285701751708984,43.88570022583008,44.057098388671875,42.97140121459961
"Sep 13, 2019",41.90480041503906,43.285701751708984,43.5713996887207,41.61899948120117
"Sep 16, 2019",42.13330078125,41.90480041503906,42.400001525878906,41.495201110839844
"Sep 17, 2019",42.38100051879883,41.819000244140625,42.990501403808594,41.59049987792969
"Sep 18, 2019",42.98099899291992,42.0,43.08570098876953,41.76190185546875
"Sep 19, 2019",43.685699462890625,43.104801177978516,44.09519958496094,43.09519958496094
"Sep 20, 2019",43.78099822998047,44.07619857788086,44.07619857788086,42.819000244140625
"Sep 23, 2019",42.32379913330078,43.13330078125,43.19049835205078,42.12379837036133
"Sep 24, 2019",41.523799896240234,42.400001525878906,42.476200103759766,41.12379837036133
"Sep 25, 2019",42.51430130004883,41.41899871826172,42.8286018371582,41.390499114990234
"Sep 26, 2019",42.25709915161133,42.771400451660156,43.01900100708008,42.23809814453125
"Sep 27, 2019",42.057098388671875,42.25709915161133,42.90480041503906,41.942901611328125
"Sep 30, 2019",43.29520034790039,42.152400970458984,43.5713996887207,42.07619857788086
"Oct 01, 2019",42.29520034790039,43.33330154418945,43.33330154418945,41.95240020751953
"Oct 02, 2019",40.66669845581055,41.90480041503906,41.90480041503906,40.390499114990234
"Oct 03, 2019",41.08570098876953,40.66669845581055,41.21900177001953,39.523799896240234
"Oct 04, 2019",41.76190185546875,41.3047981262207,42.1713981628418,40.95240020751953
"Oct 07, 2019",41.14289855957031,41.38100051879883,41.66669845581055,40.8286018371582
"Oct 08, 2019",40.90480041503906,41.35240173339844,41.76190185546875,40.32379913330078
"Oct 09, 2019",41.02859878540039,41.314300537109375,41.314300537109375,40.599998474121094
"Oct 10, 2019",40.06669998168945,40.95240020751953,41.13330078125,39.88570022583008
"Oct 11, 2019",41.23809814453125,40.361900329589844,41.895198822021484,40.285701751708984
"Oct 14, 2019",41.96189880371094,41.23809814453125,41.96189880371094,40.98099899291992
"Oct 15, 2019",42.771400451660156,41.78099822998047,43.13330078125,41.51430130004883
"Oct 16, 2019",42.180999755859375,42.895198822021484,43.009498596191406,41.62860107421875
"Oct 17, 2019",42.13330078125,42.400001525878906,42.476200103759766,41.86669921875
"Oct 18, 2019",42.79050064086914,42.285701751708984,42.79050064086914,41.733299255371094
"Oct 21, 2019",42.476200103759766,42.80950164794922,43.21900177001953,41.90480041503906
"Oct 22, 2019",42.5619010925293,42.53329849243164,43.04759979248047,42.19049835205078
"Oct 23, 2019",42.266700744628906,42.685699462890625,42.771400451660156,41.266700744628906
"Oct 24, 2019",39.657100677490234,40.104801177978516,40.847599029541016,39.342899322509766
"Oct 25, 2019",39.78099822998047,39.80950164794922,39.990501403808594,38.504798889160156
"Oct 28, 2019",39.45709991455078,39.90480041503906,40.14289855957031,39.29520034790039
"Oct 29, 2019",39.45709991455078,39.46670150756836,39.78099822998047,39.06669998168945
"Oct 30, 2019",40.88570022583008,39.523799896240234,40.990501403808594,39.45709991455078
"Oct 31, 2019",41.12379837036133,40.76190185546875,41.12379837036133,40.057098388671875
"Nov 01, 2019",41.23809814453125,41.11429977416992,41.76190185546875,40.72380065917969
"Nov 04, 2019",40.23809814453125,41.21900177001953,41.41899871826172,40.228599548339844
"Nov 05, 2019",40.1713981628418,40.4286003112793,40.447601318359375,39.58100128173828
"Nov 06, 2019",40.180999755859375,40.1713981628418,40.552398681640625,39.64759826660156
"Nov 07, 2019",40.33330154418945,40.27619934082031,40.76190185546875,39.79050064086914
"Nov 08, 2019",39.5713996887207,40.12379837036133,40.14289855957031,39.07619857788086
"Nov 11, 2019",40.12379837036133,39.4286003112793,40.266700744628906,39.27619934082031
"Nov 12, 2019",39.32379913330078,39.847599029541016,40.180999755859375,38.75239944458008
"Nov 13, 2019",39.20000076293945,39.23809814453125,39.76190185546875,38.76190185546875
"Nov 14, 2019",39.76190185546875,39.23809814453125,39.990501403808594,38.990501403808594
"Nov 18, 2019",39.19049835205078,40.0,40.16189956665039,39.19049835205078
"Nov 19, 2019",39.06669998168945,39.45709991455078,39.79050064086914,38.599998474121094
"Nov 21, 2019",41.25709915161133,39.06669998168945,41.25709915161133,38.78099822998047
"Nov 22, 2019",42.16189956665039,41.25709915161133,42.16189956665039,40.78099822998047
"Nov 25, 2019",41.96189880371094,42.104801177978516,42.21900177001953,41.37139892578125
"Nov 26, 2019",41.447601318359375,41.96189880371094,41.96189880371094,40.54290008544922
"Nov 27, 2019",41.20949935913086,41.447601318359375,41.657100677490234,40.59049987792969
"Nov 28, 2019",42.61899948120117,41.04759979248047,42.61899948120117,41.01900100708008
"Nov 29, 2019",42.895198822021484,42.714298248291016,42.895198822021484,42.01900100708008
"Dec 02, 2019",42.4380989074707,42.85710144042969,42.85710144042969,42.0
"Dec 03, 2019",42.70479965209961,42.609500885009766,42.92380142211914,41.80950164794922
"Dec 04, 2019",42.285701751708984,42.847599029541016,43.33330154418945,41.96189880371094
"Dec 05, 2019",42.895198822021484,42.45709991455078,42.895198822021484,41.93330001831055
"Dec 06, 2019",43.523799896240234,42.895198822021484,43.942901611328125,42.733299255371094
"Dec 09, 2019",42.990501403808594,43.74290084838867,43.97140121459961,42.66669845581055
"Dec 10, 2019",42.33330154418945,42.990501403808594,43.03810119628906,42.0
"Dec 11, 2019",43.4380989074707,42.33330154418945,43.895198822021484,42.33330154418945
"Dec 12, 2019",44.552398681640625,43.5713996887207,44.552398681640625,43.447601318359375
"Dec 13, 2019",44.599998474121094,44.76190185546875,45.23809814453125,44.09519958496094
"Dec 16, 2019",45.23809814453125,44.62860107421875,45.61899948120117,44.48569869995117
"Dec 17, 2019",45.04759979248047,45.25709915161133,45.599998474121094,44.5619010925293
"Dec 18, 2019",46.02859878540039,45.06669998168945,46.02859878540039,44.54290008544922
"Dec 19, 2019",46.5713996887207,45.79050064086914,47.009498596191406,45.32379913330078
"Dec 20, 2019",45.54290008544922,46.64759826660156,46.64759826660156,45.4380989074707
"Dec 23, 2019",46.79999923706055,45.939998626708984,46.79999923706055,45.349998474121094
"Dec 26, 2019",48.2599983215332,46.83000183105469,48.54999923706055,46.22999954223633
"Dec 27, 2019",47.959999084472656,48.25,48.279998779296875,47.18000030517578
"Dec 30, 2019",47.40999984741211,47.959999084472656,48.290000915527344,47.29999923706055
"Jan 02, 2020",49.619998931884766,48.220001220703125,49.619998931884766,47.61000061035156
"Jan 03, 2020",48.900001525878906,49.09000015258789,49.75,48.54999923706055
"Jan 06, 2020",48.33000183105469,48.54999923706055,48.88999938964844,47.83000183105469
"Jan 07, 2020",48.79999923706055,48.20000076293945,48.79999923706055,47.880001068115234
"Jan 08, 2020",48.560001373291016,48.939998626708984,49.47999954223633,48.220001220703125
"Jan 09, 2020",48.81999969482422,48.36000061035156,49.22999954223633,48.18000030517578
"Jan 10, 2020",47.849998474121094,48.880001068115234,49.29999923706055,47.599998474121094
"Jan 13, 2020",48.0,48.11000061035156,48.38999938964844,47.72999954223633
"Jan 14, 2020",48.20000076293945,47.84000015258789,48.20000076293945,47.45000076293945
"Jan 15, 2020",48.209999084472656,48.09000015258789,48.459999084472656,47.7599983215332
"Jan 16, 2020",49.150001525878906,48.65999984741211,49.150001525878906,48.099998474121094
"Jan 17, 2020",49.4900016784668,49.20000076293945,49.4900016784668,48.75
"Jan 20, 2020",49.599998474121094,49.290000915527344,49.970001220703125,49.04999923706055
"Jan 21, 2020",49.20000076293945,49.400001525878906,49.810001373291016,48.810001373291016
"Jan 22, 2020",49.83000183105469,49.79999923706055,49.83000183105469,49.029998779296875
"Jan 23, 2020",51.7400016784668,49.52000045776367,51.83000183105469,48.709999084472656
"Jan 24, 2020",51.40999984741211,51.70000076293945,52.099998474121094,51.189998626708984
"Jan 27, 2020",51.439998626708984,50.400001525878906,52.13999938964844,49.400001525878906
"Jan 28, 2020",52.900001525878906,51.400001525878906,53.20000076293945,51.029998779296875
"Jan 29, 2020",54.25,52.900001525878906,54.54999923706055,52.779998779296875
"Jan 30, 2020",53.83000183105469,54.16999816894531,54.16999816894531,52.7400016784668
"Jan 31, 2020",53.630001068115234,53.150001525878906,53.65999984741211,52.93000030517578
"Feb 03, 2020",54.459999084472656,53.650001525878906,55.349998474121094,53.33000183105469
"Feb 04, 2020",55.0,55.119998931884766,55.5,54.41999816894531
"Feb 05, 2020",55.52000045776367,55.29999923706055,56.209999084472656,55.29999923706055
"Feb 06, 2020",53.84000015258789,55.7400016784668,56.279998779296875,53.29999923706055
"Feb 07, 2020",52.93000030517578,53.66999816894531,54.150001525878906,52.18000030517578
"Feb 10, 2020",52.31999969482422,53.900001525878906,53.900001525878906,51.7599983215332
"Feb 11, 2020",54.099998474121094,52.68000030517578,54.209999084472656,52.34000015258789
"Feb 12, 2020",55.47999954223633,54.2400016784668,55.47999954223633,53.369998931884766
"Feb 13, 2020",55.02000045776367,54.27000045776367,55.189998626708984,54.02000045776367
"Feb 14, 2020",55.0,54.900001525878906,55.189998626708984,54.220001220703125
"Feb 17, 2020",55.22999954223633,55.150001525878906,56.119998931884766,54.810001373291016
"Feb 18, 2020",55.29999923706055,54.810001373291016,55.58000183105469,54.33000183105469
"Feb 19, 2020",55.04999923706055,54.79999923706055,55.65999984741211,54.65999984741211
"Feb 20, 2020",54.720001220703125,54.5099983215332,55.0,54.209999084472656
"Feb 21, 2020",54.400001525878906,54.130001068115234,54.66999816894531,53.61000061035156
"Feb 27, 2020",49.349998474121094,50.029998779296875,51.209999084472656,49.349998474121094
"Feb 28, 2020",49.540000915527344,49.349998474121094,49.540000915527344,47.060001373291016
"Mar 02, 2020",49.849998474121094,48.959999084472656,50.43000030517578,48.79999923706055
"Mar 03, 2020",49.65999984741211,49.0,51.599998474121094,48.7599983215332
"Mar 04, 2020",50.79999923706055,50.5,51.25,50.099998474121094
"Mar 05, 2020",48.25,50.09000015258789,50.7599983215332,46.43000030517578
"Mar 06, 2020",45.04999923706055,46.099998474121094,46.45000076293945,44.150001525878906
"Mar 09, 2020",39.79999923706055,42.79999923706055,42.79999923706055,38.529998779296875
"Mar 10, 2020",41.95000076293945,41.099998474121094,42.31999969482422,39.9900016784668
"Mar 11, 2020",38.959999084472656,40.79999923706055,41.5099983215332,37.5
"Mar 12, 2020",33.0,30.100000381469727,34.18000030517578,29.049999237060547
"Mar 13, 2020",36.0,38.5,39.599998474121094,31.65999984741211
"Mar 16, 2020",27.5,30.200000762939453,31.3700008392334,27.5
"Mar 17, 2020",27.700000762939453,28.219999313354492,28.959999084472656,25.940000534057617
"Mar 18, 2020",23.8700008392334,24.68000030517578,24.989999771118164,20.610000610351562
"Mar 19, 2020",26.079999923706055,22.0,28.5,21.90999984741211
"Mar 20, 2020",27.549999237060547,27.0,28.649999618530273,25.110000610351562
"Mar 23, 2020",24.100000381469727,27.520000457763672,28.110000610351562,22.950000762939453
"Mar 24, 2020",27.18000030517578,26.600000381469727,28.149999618530273,24.889999389648438
"Mar 25, 2020",34.470001220703125,27.100000381469727,35.20000076293945,26.809999465942383
"Mar 26, 2020",34.689998626708984,33.75,36.06999969482422,32.0099983215332
"Mar 27, 2020",31.31999969482422,32.70000076293945,32.79999923706055,30.299999237060547
"Mar 30, 2020",28.700000762939453,31.549999237060547,31.790000915527344,28.34000015258789
"Mar 31, 2020",26.299999237060547,28.84000015258789,29.299999237060547,25.5
"Apr 01, 2020",23.700000762939453,25.399999618530273,25.399999618530273,23.31999969482422
"Apr 02, 2020",26.139999389648438,23.950000762939453,26.139999389648438,23.139999389648438
"Apr 03, 2020",23.309999465942383,25.770000457763672,25.770000457763672,22.510000228881836
"Apr 06, 2020",28.0,25.149999618530273,29.06999969482422,25.110000610351562
"Apr 07, 2020",29.219999313354492,30.799999237060547,31.399999618530273,28.1200008392334
"Apr 08, 2020",31.899999618530273,29.420000076293945,33.47999954223633,28.540000915527344
"Apr 09, 2020",30.149999618530273,32.16999816894531,33.599998474121094,30.100000381469727
"Apr 13, 2020",29.75,30.0,30.459999084472656,28.68000030517578
"Apr 14, 2020",30.489999771118164,30.520000457763672,31.5,29.850000381469727
"Apr 15, 2020",30.1200008392334,29.850000381469727,31.850000381469727,29.290000915527344
"Apr 16, 2020",29.559999465942383,30.8799991607666,30.8799991607666,29.299999237060547
"Apr 17, 2020",32.029998779296875,30.450000762939453,32.209999084472656,30.079999923706055
"Apr 20, 2020",34.0,31.200000762939453,35.0,30.719999313354492
"Apr 22, 2020",36.5,34.099998474121094,37.099998474121094,33.56999969482422
"Apr 23, 2020",34.97999954223633,37.0,38.189998626708984,34.61000061035156
"Apr 24, 2020",32.97999954223633,34.2599983215332,34.849998474121094,30.520000457763672
"Apr 27, 2020",33.5,34.0,34.72999954223633,32.72999954223633
"Apr 28, 2020",35.20000076293945,34.849998474121094,35.29999923706055,33.02000045776367
"Apr 29, 2020",36.150001525878906,35.77000045776367,36.459999084472656,35.29999923706055
"Apr 30, 2020",34.189998626708984,35.29999923706055,35.72999954223633,33.93000030517578
"May 04, 2020",33.40999984741211,33.2400016784668,34.04999923706055,32.43000030517578
"May 05, 2020",33.630001068115234,34.0,34.91999816894531,32.95000076293945
"May 06, 2020",32.5,33.880001068115234,34.2400016784668,32.29999923706055
"May 07, 2020",29.770000457763672,32.86000061035156,32.939998626708984,29.770000457763672
"May 08, 2020",29.649999618530273,30.5,30.81999969482422,29.270000457763672
"May 11, 2020",28.100000381469727,29.31999969482422,29.719999313354492,27.850000381469727
"May 12, 2020",27.510000228881836,28.450000762939453,29.200000762939453,27.510000228881836
"May 13, 2020",27.309999465942383,27.600000381469727,28.280000686645508,26.670000076293945
"May 14, 2020",29.290000915527344,27.010000228881836,29.290000915527344,26.309999465942383
"May 15, 2020",30.200000762939453,28.979999542236328,31.0,28.239999771118164
"May 18, 2020",33.5099983215332,31.110000610351562,33.90999984741211,31.030000686645508
"May 19, 2020",35.06999969482422,33.5099983215332,36.04999923706055,32.900001525878906
"May 20, 2020",35.29999923706055,35.45000076293945,36.36000061035156,34.869998931884766
"May 21, 2020",36.290000915527344,35.59000015258789,37.75,35.439998626708984
"May 22, 2020",36.189998626708984,35.79999923706055,36.86000061035156,35.13999938964844
"May 25, 2020",36.70000076293945,37.36000061035156,38.18000030517578,36.45000076293945
"May 26, 2020",36.880001068115234,37.0,38.119998931884766,36.130001068115234
"May 27, 2020",39.099998474121094,37.119998931884766,39.56999969482422,37.119998931884766
"May 28, 2020",37.31999969482422,39.18000030517578,39.529998779296875,37.13999938964844
"May 29, 2020",38.47999954223633,37.310001373291016,38.47999954223633,35.849998474121094
"Jun 01, 2020",37.61000061035156,38.400001525878906,38.95000076293945,37.310001373291016
"Jun 02, 2020",38.25,38.099998474121094,39.38999938964844,37.459999084472656
"Jun 03, 2020",41.02000045776367,39.59000015258789,41.540000915527344,39.060001373291016
"Jun 04, 2020",40.0,40.900001525878906,40.900001525878906,39.099998474121094
"Jun 05, 2020",40.84000015258789,41.400001525878906,41.970001220703125,39.90999984741211
"Jun 08, 2020",43.20000076293945,41.11000061035156,43.439998626708984,40.70000076293945
"Jun 09, 2020",42.900001525878906,41.970001220703125,43.41999816894531,40.79999923706055
"Jun 10, 2020",41.099998474121094,43.4900016784668,43.720001220703125,40.63999938964844
"Jun 12, 2020",40.290000915527344,39.5099983215332,40.84000015258789,38.900001525878906
"Jun 15, 2020",40.70000076293945,39.4900016784668,41.68000030517578,38.56999969482422
"Jun 16, 2020",40.16999816894531,42.0,42.27000045776367,39.93000030517578
"Jun 17, 2020",40.83000183105469,39.5,41.83000183105469,39.31999969482422
"Jun 18, 2020",41.209999084472656,40.52000045776367,41.72999954223633,40.29999923706055
"Jun 19, 2020",41.900001525878906,42.0099983215332,42.47999954223633,41.400001525878906
"Jun 22, 2020",41.2400016784668,42.4900016784668,42.4900016784668,41.099998474121094
"Jun 23, 2020",41.7599983215332,41.79999923706055,42.290000915527344,41.369998931884766
"Jun 24, 2020",40.97999954223633,41.06999969482422,42.459999084472656,40.36000061035156
"Jun 25, 2020",41.45000076293945,41.33000183105469,42.11000061035156,40.90999984741211
"Jun 26, 2020",40.25,41.22999954223633,42.0,40.06999969482422
"Jun 29, 2020",41.209999084472656,40.5,41.5,40.220001220703125
"Jun 30, 2020",40.90999984741211,40.720001220703125,41.65999984741211,40.41999816894531
"Jul 01, 2020",42.349998474121094,40.75,42.81999969482422,40.61000061035156
"Jul 02, 2020",42.38999938964844,43.22999954223633,43.34000015258789,41.959999084472656
"Jul 03, 2020",42.70000076293945,42.2400016784668,42.849998474121094,41.83000183105469
"Jul 06, 2020",43.25,43.540000915527344,43.7599983215332,42.5099983215332
"Jul 07, 2020",44.0099983215332,43.369998931884766,44.540000915527344,43.08000183105469
"Jul 08, 2020",44.41999816894531,44.29999923706055,45.220001220703125,43.81999969482422
"Jul 09, 2020",43.33000183105469,44.599998474121094,44.70000076293945,42.86000061035156
"Jul 10, 2020",43.540000915527344,42.880001068115234,43.88999938964844,42.7400016784668
"Jul 13, 2020",42.099998474121094,43.61000061035156,43.95000076293945,41.939998626708984
"Jul 14, 2020",43.900001525878906,42.099998474121094,44.2599983215332,41.75
"Jul 15, 2020",44.7400016784668,44.25,45.18000030517578,44.0099983215332
"Jul 16, 2020",44.59000015258789,44.279998779296875,44.70000076293945,43.79999923706055
"Jul 17, 2020",45.95000076293945,44.77000045776367,46.34000015258789,44.34000015258789
"Jul 20, 2020",46.209999084472656,45.95000076293945,46.7400016784668,45.650001525878906
"Jul 21, 2020",46.88999938964844,46.47999954223633,47.619998931884766,46.22999954223633
"Jul 22, 2020",46.38999938964844,46.939998626708984,47.45000076293945,45.90999984741211
"Jul 23, 2020",45.880001068115234,46.7400016784668,48.06999969482422,45.13999938964844
"Jul 24, 2020",44.70000076293945,46.20000076293945,46.540000915527344,44.31999969482422
"Jul 27, 2020",45.40999984741211,44.720001220703125,46.4900016784668,44.720001220703125
"Jul 28, 2020",44.88999938964844,44.959999084472656,45.349998474121094,44.5
"Jul 29, 2020",45.06999969482422,45.400001525878906,45.540000915527344,44.709999084472656
"Jul 30, 2020",49.959999084472656,46.290000915527344,50.689998626708984,45.79999923706055
"Jul 31, 2020",50.91999816894531,49.38999938964844,53.0,49.33000183105469
"Aug 03, 2020",50.290000915527344,51.11000061035156,52.13999938964844,49.619998931884766
"Aug 04, 2020",49.900001525878906,50.150001525878906,51.900001525878906,49.189998626708984
"Aug 05, 2020",51.0099983215332,50.90999984741211,51.900001525878906,50.5
"Aug 06, 2020",51.630001068115234,51.06999969482422,52.56999969482422,51.02000045776367
"Aug 07, 2020",50.810001373291016,50.630001068115234,52.529998779296875,50.58000183105469
"Aug 10, 2020",50.90999984741211,51.06999969482422,51.70000076293945,50.33000183105469
"Aug 11, 2020",50.790000915527344,51.400001525878906,52.34000015258789,50.70000076293945
"Aug 12, 2020",50.45000076293945,51.189998626708984,51.41999816894531,49.5
"Aug 13, 2020",49.02000045776367,50.5099983215332,52.439998626708984,48.959999084472656
"Aug 14, 2020",49.58000183105469,49.11000061035156,50.099998474121094,48.810001373291016
"Aug 17, 2020",47.720001220703125,49.849998474121094,49.91999816894531,46.38999938964844
"Aug 18, 2020",49.599998474121094,48.70000076293945,50.0099983215332,48.38999938964844
"Aug 19, 2020",49.0099983215332,49.25,49.689998626708984,48.470001220703125
"Aug 20, 2020",49.939998626708984,47.599998474121094,50.04999923706055,47.400001525878906
"Aug 21, 2020",48.970001220703125,49.65999984741211,49.72999954223633,48.47999954223633
"Aug 24, 2020",49.040000915527344,49.02000045776367,49.40999984741211,48.22999954223633
"Aug 25, 2020",49.16999816894531,49.040000915527344,49.95000076293945,48.83000183105469
"Aug 26, 2020",48.41999816894531,48.900001525878906,49.58000183105469,47.040000915527344
"Aug 27, 2020",49.11000061035156,48.5,49.36000061035156,48.150001525878906
"Aug 28, 2020",50.0,49.11000061035156,50.7400016784668,48.849998474121094
"Aug 31, 2020",48.22999954223633,49.09000015258789,49.7400016784668,48.22999954223633
