Date,Price,Open,High,Low
"Jun 03, 2019",35.08000183105469,35.20000076293945,35.31999969482422,34.72999954223633
"Jun 04, 2019",35.02000045776367,35.20000076293945,35.29999923706055,34.7599983215332
"Jun 05, 2019",34.34000015258789,35.09000015258789,35.15999984741211,34.27000045776367
"Jun 06, 2019",34.70000076293945,34.689998626708984,34.88999938964844,34.380001068115234
"Jun 07, 2019",35.06999969482422,34.779998779296875,35.279998779296875,34.66999816894531
"Jun 10, 2019",34.630001068115234,34.849998474121094,34.869998931884766,34.11000061035156
"Jun 11, 2019",34.79999923706055,34.849998474121094,34.97999954223633,34.2400016784668
"Jun 12, 2019",34.599998474121094,34.79999923706055,35.119998931884766,34.470001220703125
"Jun 13, 2019",33.97999954223633,34.54999923706055,34.58000183105469,33.709999084472656
"Jun 14, 2019",33.9900016784668,33.900001525878906,34.06999969482422,33.47999954223633
"Jun 17, 2019",33.95000076293945,33.900001525878906,34.31999969482422,33.810001373291016
"Jun 18, 2019",34.83000183105469,34.349998474121094,34.83000183105469,34.18000030517578
"Jun 19, 2019",35.380001068115234,34.63999938964844,35.4900016784668,34.470001220703125
"Jun 21, 2019",36.18000030517578,35.58000183105469,36.18000030517578,35.5
"Jun 24, 2019",36.099998474121094,36.2400016784668,36.5,35.790000915527344
"Jun 25, 2019",35.650001525878906,36.0,36.22999954223633,35.47999954223633
"Jun 26, 2019",36.5,35.849998474121094,36.5,35.72999954223633
"Jun 27, 2019",36.25,36.20000076293945,36.43000030517578,35.70000076293945
"Jun 28, 2019",36.2599983215332,36.45000076293945,36.59000015258789,36.13999938964844
"Jul 01, 2019",36.08000183105469,36.77000045776367,36.77000045776367,35.939998626708984
"Jul 02, 2019",35.95000076293945,36.04999923706055,36.31999969482422,35.709999084472656
"Jul 03, 2019",36.56999969482422,35.70000076293945,36.650001525878906,35.630001068115234
"Jul 04, 2019",36.9900016784668,36.77000045776367,37.5,36.709999084472656
"Jul 05, 2019",37.400001525878906,36.84000015258789,37.45000076293945,36.66999816894531
"Jul 08, 2019",37.29999923706055,37.470001220703125,37.5,37.060001373291016
"Jul 10, 2019",37.20000076293945,37.529998779296875,37.720001220703125,36.95000076293945
"Jul 11, 2019",37.150001525878906,36.970001220703125,37.150001525878906,36.58000183105469
"Jul 12, 2019",36.459999084472656,37.45000076293945,37.459999084472656,36.459999084472656
"Jul 15, 2019",36.36000061035156,36.68000030517578,36.70000076293945,36.119998931884766
"Jul 16, 2019",36.5,36.400001525878906,36.650001525878906,36.209999084472656
"Jul 17, 2019",36.400001525878906,36.59000015258789,36.91999816894531,36.380001068115234
"Jul 18, 2019",37.369998931884766,36.470001220703125,37.369998931884766,36.459999084472656
"Jul 19, 2019",36.400001525878906,37.08000183105469,37.279998779296875,36.400001525878906
"Jul 22, 2019",37.02000045776367,36.689998626708984,37.25,36.619998931884766
"Jul 23, 2019",37.380001068115234,37.25,37.54999923706055,36.72999954223633
"Jul 24, 2019",37.349998474121094,37.5,37.75,37.130001068115234
"Jul 25, 2019",36.20000076293945,37.650001525878906,37.650001525878906,35.97999954223633
"Jul 26, 2019",36.849998474121094,36.47999954223633,37.08000183105469,36.0099983215332
"Jul 29, 2019",37.0,36.7599983215332,37.27000045776367,36.45000076293945
"Jul 30, 2019",35.77000045776367,36.79999923706055,36.79999923706055,35.65999984741211
"Jul 31, 2019",34.81999969482422,35.7400016784668,35.779998779296875,34.70000076293945
"Aug 01, 2019",34.880001068115234,35.209999084472656,36.119998931884766,34.880001068115234
"Aug 02, 2019",34.93000030517578,35.0,35.20000076293945,34.58000183105469
"Aug 05, 2019",34.45000076293945,34.20000076293945,34.720001220703125,34.040000915527344
"Aug 06, 2019",35.4900016784668,34.939998626708984,35.4900016784668,34.79999923706055
"Aug 07, 2019",36.79999923706055,35.06999969482422,36.79999923706055,34.959999084472656
"Aug 08, 2019",37.0,37.0,37.349998474121094,36.66999816894531
"Aug 09, 2019",36.720001220703125,36.9900016784668,37.0,36.349998474121094
"Aug 12, 2019",35.20000076293945,36.0,36.040000915527344,35.189998626708984
"Aug 13, 2019",35.88999938964844,35.18000030517578,36.119998931884766,35.119998931884766
"Aug 14, 2019",35.099998474121094,35.400001525878906,35.56999969482422,35.02000045776367
"Aug 15, 2019",35.0,35.47999954223633,35.47999954223633,34.810001373291016
"Aug 16, 2019",34.349998474121094,34.79999923706055,34.86000061035156,34.130001068115234
"Aug 19, 2019",34.20000076293945,34.650001525878906,34.869998931884766,33.90999984741211
"Aug 20, 2019",33.81999969482422,34.369998931884766,34.45000076293945,33.54999923706055
"Aug 21, 2019",34.08000183105469,34.189998626708984,34.34000015258789,33.7599983215332
"Aug 22, 2019",33.540000915527344,34.150001525878906,34.33000183105469,33.5
"Aug 23, 2019",33.150001525878906,33.09000015258789,33.900001525878906,32.93000030517578
"Aug 26, 2019",33.13999938964844,33.40999984741211,33.43000030517578,32.689998626708984
"Aug 27, 2019",33.529998779296875,33.150001525878906,33.93000030517578,33.08000183105469
"Aug 28, 2019",33.90999984741211,33.220001220703125,34.09000015258789,33.15999984741211
"Aug 29, 2019",34.09000015258789,34.04999923706055,34.470001220703125,33.540000915527344
"Aug 30, 2019",33.939998626708984,34.529998779296875,34.560001373291016,33.779998779296875
"Sep 02, 2019",33.5,33.900001525878906,34.189998626708984,33.5
"Sep 03, 2019",32.86000061035156,33.5099983215332,33.810001373291016,32.77000045776367
"Sep 04, 2019",33.09000015258789,33.279998779296875,33.310001373291016,32.810001373291016
"Sep 05, 2019",34.029998779296875,33.41999816894531,34.65999984741211,33.38999938964844
"Sep 06, 2019",35.16999816894531,34.25,35.22999954223633,34.25
"Sep 09, 2019",36.029998779296875,35.369998931884766,36.29999923706055,35.36000061035156
"Sep 10, 2019",35.33000183105469,36.11000061035156,36.290000915527344,35.09000015258789
"Sep 11, 2019",35.16999816894531,35.5099983215332,35.68000030517578,34.9900016784668
"Sep 12, 2019",35.38999938964844,35.5,35.599998474121094,35.150001525878906
"Sep 13, 2019",35.869998931884766,35.5099983215332,36.40999984741211,35.5099983215332
"Sep 16, 2019",35.22999954223633,35.529998779296875,35.619998931884766,34.90999984741211
"Sep 17, 2019",35.36000061035156,34.900001525878906,35.45000076293945,34.869998931884766
"Sep 18, 2019",35.25,35.369998931884766,35.63999938964844,34.83000183105469
"Sep 19, 2019",34.65999984741211,35.540000915527344,35.83000183105469,34.52000045776367
"Sep 20, 2019",34.75,34.880001068115234,35.099998474121094,34.619998931884766
"Sep 23, 2019",34.63999938964844,34.70000076293945,34.720001220703125,34.20000076293945
"Sep 24, 2019",34.279998779296875,34.81999969482422,34.88999938964844,34.11000061035156
"Sep 25, 2019",34.68000030517578,34.189998626708984,34.91999816894531,34.04999923706055
"Sep 26, 2019",35.68000030517578,34.880001068115234,35.70000076293945,34.599998474121094
"Sep 27, 2019",35.529998779296875,35.59000015258789,35.63999938964844,34.970001220703125
"Sep 30, 2019",35.029998779296875,35.54999923706055,35.790000915527344,35.029998779296875
"Oct 01, 2019",34.220001220703125,35.220001220703125,35.310001373291016,34.20000076293945
"Oct 02, 2019",33.279998779296875,33.849998474121094,33.939998626708984,33.119998931884766
"Oct 03, 2019",33.290000915527344,33.2400016784668,33.599998474121094,32.849998474121094
"Oct 04, 2019",33.45000076293945,33.22999954223633,33.5,32.77000045776367
"Oct 07, 2019",32.83000183105469,33.290000915527344,33.63999938964844,32.779998779296875
"Oct 08, 2019",32.689998626708984,33.119998931884766,33.27000045776367,32.560001373291016
"Oct 09, 2019",33.209999084472656,32.9900016784668,33.439998626708984,32.630001068115234
"Oct 10, 2019",33.45000076293945,33.099998474121094,33.560001373291016,33.0099983215332
"Oct 11, 2019",33.880001068115234,33.599998474121094,34.279998779296875,33.59000015258789
"Oct 14, 2019",34.45000076293945,33.810001373291016,34.540000915527344,33.720001220703125
"Oct 15, 2019",34.369998931884766,34.47999954223633,34.63999938964844,34.189998626708984
"Oct 16, 2019",34.86000061035156,34.470001220703125,34.97999954223633,33.83000183105469
"Oct 17, 2019",34.650001525878906,34.849998474121094,35.130001068115234,34.31999969482422
"Oct 18, 2019",34.2400016784668,34.619998931884766,34.619998931884766,34.150001525878906
"Oct 21, 2019",34.79999923706055,34.2599983215332,34.869998931884766,33.9900016784668
"Oct 22, 2019",35.880001068115234,34.77000045776367,35.88999938964844,34.66999816894531
"Oct 23, 2019",36.38999938964844,35.59000015258789,36.75,35.5099983215332
"Oct 24, 2019",36.560001373291016,36.459999084472656,36.83000183105469,36.130001068115234
"Oct 25, 2019",36.79999923706055,36.54999923706055,37.130001068115234,36.34000015258789
"Oct 28, 2019",37.29999923706055,36.650001525878906,37.529998779296875,36.529998779296875
"Oct 29, 2019",36.63999938964844,37.09000015258789,37.22999954223633,36.56999969482422
"Oct 30, 2019",36.869998931884766,36.470001220703125,37.0,35.90999984741211
"Oct 31, 2019",36.22999954223633,36.29999923706055,36.66999816894531,35.68000030517578
"Nov 01, 2019",36.349998474121094,36.65999984741211,36.90999984741211,35.90999984741211
"Nov 04, 2019",36.470001220703125,36.45000076293945,36.75,36.2400016784668
"Nov 05, 2019",37.099998474121094,37.63999938964844,37.9900016784668,36.79999923706055
"Nov 06, 2019",36.599998474121094,37.099998474121094,37.36000061035156,36.56999969482422
"Nov 07, 2019",36.81999969482422,36.779998779296875,36.95000076293945,36.56999969482422
"Nov 08, 2019",36.27000045776367,36.36000061035156,36.779998779296875,36.02000045776367
"Nov 11, 2019",36.43000030517578,36.20000076293945,36.79999923706055,35.900001525878906
"Nov 12, 2019",35.810001373291016,36.02000045776367,36.290000915527344,35.43000030517578
"Nov 13, 2019",35.45000076293945,35.66999816894531,35.84000015258789,35.18000030517578
"Nov 14, 2019",35.68000030517578,35.5,35.790000915527344,35.15999984741211
"Nov 18, 2019",35.52000045776367,36.0,36.20000076293945,35.47999954223633
"Nov 19, 2019",35.130001068115234,35.5,35.599998474121094,34.849998474121094
"Nov 21, 2019",35.4900016784668,35.130001068115234,35.5,35.029998779296875
"Nov 22, 2019",35.72999954223633,35.2599983215332,35.83000183105469,35.209999084472656
"Nov 25, 2019",35.220001220703125,35.790000915527344,35.900001525878906,35.0099983215332
"Nov 26, 2019",34.5,35.0,35.09000015258789,34.349998474121094
"Nov 27, 2019",34.70000076293945,34.70000076293945,34.93000030517578,34.2599983215332
"Nov 28, 2019",34.599998474121094,34.45000076293945,34.70000076293945,34.02000045776367
"Nov 29, 2019",34.79999923706055,34.66999816894531,34.83000183105469,34.29999923706055
"Dec 02, 2019",35.279998779296875,34.91999816894531,35.52000045776367,34.84000015258789
"Dec 03, 2019",35.290000915527344,35.59000015258789,35.709999084472656,34.90999984741211
"Dec 04, 2019",36.560001373291016,35.38999938964844,36.56999969482422,35.29999923706055
"Dec 05, 2019",36.5099983215332,36.369998931884766,37.06999969482422,36.29999923706055
"Dec 06, 2019",35.849998474121094,36.5,36.68000030517578,35.849998474121094
"Dec 09, 2019",36.54999923706055,36.0,36.880001068115234,35.77000045776367
"Dec 10, 2019",36.02000045776367,36.54999923706055,36.77000045776367,35.779998779296875
"Dec 11, 2019",35.599998474121094,36.5,36.66999816894531,35.560001373291016
"Dec 12, 2019",35.59000015258789,35.95000076293945,36.09000015258789,35.349998474121094
"Dec 13, 2019",36.310001373291016,35.79999923706055,36.369998931884766,35.349998474121094
"Dec 16, 2019",35.47999954223633,36.439998626708984,36.63999938964844,35.47999954223633
"Dec 17, 2019",36.02000045776367,35.75,36.279998779296875,35.540000915527344
"Dec 18, 2019",36.47999954223633,35.91999816894531,36.75,35.72999954223633
"Dec 19, 2019",36.65999984741211,36.15999984741211,36.709999084472656,36.11000061035156
"Dec 20, 2019",36.5,36.630001068115234,36.70000076293945,36.29999923706055
"Dec 23, 2019",36.84000015258789,36.5,36.84000015258789,36.310001373291016
"Dec 26, 2019",37.400001525878906,36.79999923706055,37.400001525878906,36.650001525878906
"Dec 27, 2019",37.29999923706055,37.5,37.689998626708984,36.90999984741211
"Dec 30, 2019",37.099998474121094,37.34000015258789,37.59000015258789,36.86000061035156
"Jan 02, 2020",38.029998779296875,37.279998779296875,38.029998779296875,36.9900016784668
"Jan 03, 2020",37.630001068115234,37.5,38.2400016784668,37.45000076293945
"Jan 06, 2020",37.06999969482422,37.54999923706055,37.58000183105469,36.90999984741211
"Jan 07, 2020",36.209999084472656,37.06999969482422,37.2400016784668,36.209999084472656
"Jan 08, 2020",35.619998931884766,36.45000076293945,36.810001373291016,35.619998931884766
"Jan 09, 2020",34.90999984741211,35.790000915527344,35.93000030517578,34.52000045776367
"Jan 10, 2020",34.599998474121094,35.08000183105469,35.45000076293945,34.56999969482422
"Jan 13, 2020",35.060001373291016,35.02000045776367,35.400001525878906,34.7400016784668
"Jan 14, 2020",35.060001373291016,34.91999816894531,35.060001373291016,34.630001068115234
"Jan 15, 2020",34.630001068115234,34.88999938964844,34.939998626708984,34.400001525878906
"Jan 16, 2020",34.70000076293945,34.900001525878906,35.06999969482422,34.41999816894531
"Jan 17, 2020",34.939998626708984,34.900001525878906,35.29999923706055,34.72999954223633
"Jan 20, 2020",34.22999954223633,34.79999923706055,35.0,34.15999984741211
"Jan 21, 2020",33.5,34.0099983215332,34.47999954223633,33.439998626708984
"Jan 22, 2020",33.70000076293945,33.849998474121094,34.06999969482422,33.5
"Jan 23, 2020",34.5,33.5,34.810001373291016,33.400001525878906
"Jan 24, 2020",34.2400016784668,34.61000061035156,34.619998931884766,33.95000076293945
"Jan 27, 2020",33.5,33.7400016784668,34.09000015258789,33.40999984741211
"Jan 28, 2020",33.4900016784668,33.77000045776367,33.970001220703125,33.29999923706055
"Jan 29, 2020",32.970001220703125,33.689998626708984,33.790000915527344,32.91999816894531
"Jan 30, 2020",33.45000076293945,32.650001525878906,33.45000076293945,32.58000183105469
"Jan 31, 2020",32.81999969482422,32.9900016784668,33.38999938964844,32.540000915527344
"Feb 03, 2020",32.900001525878906,33.0,33.310001373291016,32.790000915527344
"Feb 04, 2020",33.15999984741211,33.36000061035156,33.459999084472656,32.900001525878906
"Feb 05, 2020",33.36000061035156,33.709999084472656,34.119998931884766,33.36000061035156
"Feb 06, 2020",33.279998779296875,33.70000076293945,33.7400016784668,33.11000061035156
"Feb 07, 2020",33.709999084472656,33.04999923706055,34.150001525878906,33.0
"Feb 10, 2020",34.279998779296875,33.72999954223633,34.56999969482422,33.68000030517578
"Feb 11, 2020",35.06999969482422,35.15999984741211,35.45000076293945,34.63999938964844
"Feb 12, 2020",34.93000030517578,35.16999816894531,35.47999954223633,34.7599983215332
"Feb 13, 2020",34.38999938964844,34.709999084472656,34.790000915527344,34.20000076293945
"Feb 14, 2020",33.810001373291016,34.27000045776367,34.400001525878906,33.66999816894531
"Feb 17, 2020",33.5,33.9900016784668,33.9900016784668,33.36000061035156
"Feb 18, 2020",33.63999938964844,33.380001068115234,33.7400016784668,32.970001220703125
"Feb 19, 2020",34.119998931884766,33.70000076293945,34.41999816894531,33.52000045776367
"Feb 20, 2020",34.0,34.22999954223633,34.27000045776367,33.83000183105469
"Feb 21, 2020",32.68000030517578,32.779998779296875,32.900001525878906,32.45000076293945
"Feb 27, 2020",31.06999969482422,30.700000762939453,32.33000183105469,30.56999969482422
"Feb 28, 2020",32.0,31.100000381469727,32.08000183105469,30.799999237060547
"Mar 02, 2020",31.8799991607666,31.93000030517578,32.290000915527344,31.270000457763672
"Mar 03, 2020",31.299999237060547,31.649999618530273,31.969999313354492,30.959999084472656
"Mar 04, 2020",31.600000381469727,31.809999465942383,31.829999923706055,30.93000030517578
"Mar 05, 2020",30.520000457763672,31.260000228881836,31.489999771118164,30.18000030517578
"Mar 06, 2020",29.8700008392334,29.600000381469727,30.350000381469727,29.31999969482422
"Mar 09, 2020",27.799999237060547,28.0,28.450000762939453,27.3700008392334
"Mar 10, 2020",28.489999771118164,29.5,29.700000762939453,27.579999923706055
"Mar 11, 2020",26.170000076293945,27.799999237060547,28.139999389648438,25.030000686645508
"Mar 12, 2020",23.600000381469727,23.200000762939453,24.559999465942383,22.40999984741211
"Mar 13, 2020",26.209999084472656,26.940000534057617,27.18000030517578,23.649999618530273
"Mar 16, 2020",23.799999237060547,23.5,25.65999984741211,22.719999313354492
"Mar 17, 2020",25.200000762939453,24.510000228881836,26.709999084472656,23.5
"Mar 18, 2020",23.450000762939453,23.969999313354492,24.25,21.540000915527344
"Mar 19, 2020",22.850000381469727,22.770000457763672,23.729999542236328,21.1299991607666
"Mar 20, 2020",22.049999237060547,23.389999389648438,23.969999313354492,21.600000381469727
"Mar 23, 2020",20.520000457763672,22.260000228881836,22.489999771118164,20.0
"Mar 24, 2020",22.5,21.700000762939453,23.280000686645508,21.5
"Mar 25, 2020",23.600000381469727,22.229999542236328,24.729999542236328,22.010000228881836
"Mar 26, 2020",24.25,24.229999542236328,24.81999969482422,23.719999313354492
"Mar 27, 2020",22.969999313354492,23.020000457763672,24.020000457763672,22.510000228881836
"Mar 30, 2020",24.110000610351562,23.110000610351562,24.389999389648438,22.829999923706055
"Mar 31, 2020",23.09000015258789,23.950000762939453,24.25,22.809999465942383
"Apr 01, 2020",21.399999618530273,22.219999313354492,22.3799991607666,21.190000534057617
"Apr 02, 2020",21.5,21.3799991607666,22.0,21.149999618530273
"Apr 03, 2020",20.65999984741211,21.420000076293945,21.479999542236328,20.010000228881836
"Apr 06, 2020",22.18000030517578,22.139999389648438,22.68000030517578,21.889999389648438
"Apr 07, 2020",23.0,23.5,23.8799991607666,22.920000076293945
"Apr 08, 2020",24.18000030517578,23.010000228881836,24.389999389648438,22.940000534057617
"Apr 09, 2020",23.5,24.459999084472656,24.700000762939453,23.5
"Apr 13, 2020",24.0,23.450000762939453,24.0,23.020000457763672
"Apr 14, 2020",24.299999237060547,24.459999084472656,25.149999618530273,24.299999237060547
"Apr 15, 2020",23.399999618530273,23.850000381469727,24.479999542236328,23.3700008392334
"Apr 16, 2020",22.809999465942383,23.700000762939453,23.81999969482422,22.799999237060547
"Apr 17, 2020",23.219999313354492,23.440000534057617,23.610000610351562,22.610000610351562
"Apr 20, 2020",22.639999389648438,22.719999313354492,22.969999313354492,22.5
"Apr 22, 2020",22.3700008392334,22.399999618530273,23.1299991607666,22.209999084472656
"Apr 23, 2020",22.049999237060547,22.65999984741211,22.739999771118164,21.84000015258789
"Apr 24, 2020",20.8799991607666,21.739999771118164,21.81999969482422,20.3700008392334
"Apr 27, 2020",21.56999969482422,21.540000915527344,22.139999389648438,21.100000381469727
"Apr 28, 2020",23.350000381469727,22.979999542236328,23.610000610351562,22.59000015258789
"Apr 29, 2020",23.65999984741211,24.0,24.1200008392334,23.15999984741211
"Apr 30, 2020",22.770000457763672,22.59000015258789,23.329999923706055,22.459999084472656
"May 04, 2020",21.889999389648438,21.950000762939453,22.09000015258789,21.780000686645508
"May 05, 2020",22.700000762939453,22.200000762939453,23.3700008392334,21.90999984741211
"May 06, 2020",22.239999771118164,22.600000381469727,22.780000686645508,22.0
"May 07, 2020",21.440000534057617,22.3799991607666,22.479999542236328,21.1299991607666
"May 08, 2020",22.31999969482422,22.020000457763672,22.770000457763672,21.899999618530273
"May 11, 2020",22.3799991607666,22.170000076293945,23.030000686645508,22.170000076293945
"May 12, 2020",21.610000610351562,22.510000228881836,22.65999984741211,21.59000015258789
"May 13, 2020",21.600000381469727,21.739999771118164,21.940000534057617,21.200000762939453
"May 14, 2020",22.549999237060547,21.309999465942383,22.59000015258789,20.729999542236328
"May 15, 2020",21.6299991607666,22.5,22.770000457763672,21.6299991607666
"May 18, 2020",22.670000076293945,22.450000762939453,22.940000534057617,22.010000228881836
"May 19, 2020",21.690000534057617,22.6299991607666,22.719999313354492,21.610000610351562
"May 20, 2020",21.600000381469727,21.93000030517578,21.950000762939453,21.360000610351562
"May 21, 2020",22.84000015258789,21.719999313354492,22.84000015258789,21.709999084472656
"May 22, 2020",22.959999084472656,22.600000381469727,23.350000381469727,22.209999084472656
"May 25, 2020",23.959999084472656,23.90999984741211,24.190000534057617,23.389999389648438
"May 26, 2020",23.010000228881836,24.329999923706055,24.420000076293945,22.860000610351562
"May 27, 2020",23.729999542236328,23.639999389648438,23.729999542236328,23.15999984741211
"May 28, 2020",23.309999465942383,23.489999771118164,24.049999237060547,23.309999465942383
"May 29, 2020",23.040000915527344,23.18000030517578,23.299999237060547,22.709999084472656
"Jun 01, 2020",23.65999984741211,22.829999923706055,23.850000381469727,22.700000762939453
"Jun 02, 2020",25.25,24.0,25.299999237060547,23.829999923706055
"Jun 03, 2020",25.920000076293945,26.299999237060547,26.770000457763672,25.799999237060547
"Jun 04, 2020",26.670000076293945,25.770000457763672,26.829999923706055,25.479999542236328
"Jun 05, 2020",27.260000228881836,28.15999984741211,28.700000762939453,27.18000030517578
"Jun 08, 2020",28.360000610351562,27.610000610351562,28.479999542236328,27.510000228881836
"Jun 09, 2020",27.799999237060547,27.56999969482422,28.239999771118164,27.260000228881836
"Jun 10, 2020",26.59000015258789,28.110000610351562,28.170000076293945,26.479999542236328
"Jun 12, 2020",26.059999465942383,25.90999984741211,26.3700008392334,25.6200008392334
"Jun 15, 2020",25.450000762939453,25.100000381469727,25.989999771118164,25.030000686645508
"Jun 16, 2020",26.18000030517578,26.5,26.56999969482422,25.700000762939453
"Jun 17, 2020",26.510000228881836,26.18000030517578,26.940000534057617,26.149999618530273
"Jun 18, 2020",27.549999237060547,26.5,27.90999984741211,26.31999969482422
"Jun 19, 2020",28.09000015258789,28.100000381469727,28.239999771118164,27.579999923706055
"Jun 22, 2020",27.219999313354492,28.040000915527344,28.239999771118164,26.90999984741211
"Jun 23, 2020",26.860000610351562,27.700000762939453,27.75,26.559999465942383
"Jun 24, 2020",25.84000015258789,26.790000915527344,26.920000076293945,25.600000381469727
"Jun 25, 2020",26.149999618530273,26.030000686645508,26.329999923706055,25.510000228881836
"Jun 26, 2020",25.709999084472656,25.709999084472656,26.219999313354492,25.540000915527344
"Jun 29, 2020",26.479999542236328,25.899999618530273,26.520000457763672,25.75
"Jun 30, 2020",25.450000762939453,26.219999313354492,26.309999465942383,25.450000762939453
"Jul 01, 2020",26.100000381469727,25.600000381469727,26.209999084472656,25.540000915527344
"Jul 02, 2020",26.549999237060547,26.5,27.25,26.40999984741211
"Jul 03, 2020",26.5,26.389999389648438,26.690000534057617,26.200000762939453
"Jul 06, 2020",27.729999542236328,27.1200008392334,27.850000381469727,26.850000381469727
"Jul 07, 2020",26.3700008392334,27.43000030517578,27.709999084472656,26.31999969482422
"Jul 08, 2020",26.940000534057617,26.649999618530273,27.06999969482422,26.5
"Jul 09, 2020",26.950000762939453,27.020000457763672,27.170000076293945,26.579999923706055
"Jul 10, 2020",27.200000762939453,26.950000762939453,27.309999465942383,26.6200008392334
"Jul 13, 2020",26.799999237060547,27.450000762939453,27.549999237060547,26.799999237060547
"Jul 14, 2020",27.25,26.75,27.420000076293945,26.440000534057617
"Jul 15, 2020",27.440000534057617,27.540000915527344,27.799999237060547,27.06999969482422
"Jul 16, 2020",26.979999542236328,27.170000076293945,27.31999969482422,26.920000076293945
"Jul 17, 2020",27.219999313354492,27.110000610351562,27.399999618530273,27.0
"Jul 20, 2020",27.299999237060547,27.25,27.530000686645508,26.959999084472656
"Jul 21, 2020",27.780000686645508,27.600000381469727,28.040000915527344,27.360000610351562
"Jul 22, 2020",27.06999969482422,27.850000381469727,27.850000381469727,26.770000457763672
"Jul 23, 2020",26.5,27.100000381469727,27.139999389648438,26.459999084472656
"Jul 24, 2020",26.469999313354492,26.350000381469727,26.8799991607666,26.110000610351562
"Jul 27, 2020",27.799999237060547,26.6299991607666,27.920000076293945,26.540000915527344
"Jul 28, 2020",27.639999389648438,27.719999313354492,28.260000228881836,27.520000457763672
"Jul 29, 2020",28.290000915527344,28.149999618530273,28.489999771118164,27.8799991607666
"Jul 30, 2020",27.809999465942383,27.8700008392334,28.229999542236328,27.420000076293945
"Jul 31, 2020",26.889999389648438,27.940000534057617,27.979999542236328,26.790000915527344
"Aug 03, 2020",27.280000686645508,27.100000381469727,27.709999084472656,26.5
"Aug 04, 2020",25.690000534057617,26.25,26.690000534057617,25.40999984741211
"Aug 05, 2020",25.670000076293945,26.149999618530273,26.299999237060547,25.360000610351562
"Aug 06, 2020",26.030000686645508,25.700000762939453,26.299999237060547,25.40999984741211
"Aug 07, 2020",25.479999542236328,25.6299991607666,26.450000762939453,25.399999618530273
"Aug 10, 2020",25.809999465942383,25.520000457763672,26.079999923706055,25.40999984741211
"Aug 11, 2020",25.510000228881836,26.1200008392334,26.290000915527344,25.510000228881836
"Aug 12, 2020",25.219999313354492,25.690000534057617,25.860000610351562,24.90999984741211
"Aug 13, 2020",24.5,25.459999084472656,25.549999237060547,24.5
"Aug 14, 2020",24.729999542236328,24.56999969482422,25.209999084472656,24.3700008392334
"Aug 17, 2020",24.139999389648438,24.719999313354492,24.75,23.850000381469727
"Aug 18, 2020",24.239999771118164,24.6200008392334,24.639999389648438,24.049999237060547
"Aug 19, 2020",24.1200008392334,24.31999969482422,24.420000076293945,24.020000457763672
"Aug 20, 2020",24.1200008392334,23.700000762939453,24.239999771118164,23.540000915527344
"Aug 21, 2020",24.079999923706055,23.90999984741211,24.239999771118164,23.809999465942383
"Aug 24, 2020",24.479999542236328,24.25,24.829999923706055,24.229999542236328
"Aug 25, 2020",24.299999237060547,24.639999389648438,24.700000762939453,24.1200008392334
"Aug 26, 2020",23.790000915527344,24.299999237060547,24.360000610351562,23.510000228881836
"Aug 27, 2020",24.18000030517578,23.889999389648438,24.5,23.799999237060547
"Aug 28, 2020",24.43000030517578,24.299999237060547,24.559999465942383,24.149999618530273
"Aug 31, 2020",23.549999237060547,24.170000076293945,24.290000915527344,23.549999237060547
