Date,Price,Open,High,Low
"Jun 03, 2019",44.060001373291016,44.41999816894531,44.7400016784668,43.81999969482422
"Jun 04, 2019",48.88999938964844,45.349998474121094,48.88999938964844,45.27000045776367
"Jun 05, 2019",48.849998474121094,49.18000030517578,49.34000015258789,47.900001525878906
"Jun 06, 2019",48.65999984741211,50.0,50.70000076293945,47.95000076293945
"Jun 07, 2019",47.650001525878906,49.0,49.33000183105469,47.63999938964844
"Jun 10, 2019",47.400001525878906,47.650001525878906,47.970001220703125,47.08000183105469
"Jun 11, 2019",47.13999938964844,47.400001525878906,47.77000045776367,45.959999084472656
"Jun 12, 2019",46.68000030517578,47.349998474121094,47.88999938964844,46.310001373291016
"Jun 13, 2019",47.869998931884766,46.79999923706055,48.34000015258789,46.70000076293945
"Jun 14, 2019",46.63999938964844,47.869998931884766,47.970001220703125,46.060001373291016
"Jun 17, 2019",47.220001220703125,46.38999938964844,47.77000045776367,45.900001525878906
"Jun 18, 2019",46.900001525878906,47.790000915527344,47.790000915527344,46.400001525878906
"Jun 19, 2019",47.88999938964844,46.75,47.88999938964844,46.2400016784668
"Jun 21, 2019",46.75,47.900001525878906,47.900001525878906,46.75
"Jun 24, 2019",46.5,46.97999954223633,47.290000915527344,46.040000915527344
"Jun 25, 2019",46.20000076293945,46.380001068115234,46.900001525878906,45.59000015258789
"Jun 26, 2019",45.86000061035156,45.900001525878906,46.470001220703125,45.45000076293945
"Jun 27, 2019",46.2599983215332,45.4900016784668,46.290000915527344,44.619998931884766
"Jun 28, 2019",47.27000045776367,46.290000915527344,47.36000061035156,46.2599983215332
"Jul 01, 2019",48.119998931884766,47.45000076293945,48.59000015258789,47.0
"Jul 02, 2019",47.630001068115234,48.0,48.5,47.529998779296875
"Jul 03, 2019",48.16999816894531,47.349998474121094,48.16999816894531,46.540000915527344
"Jul 04, 2019",49.38999938964844,48.47999954223633,49.38999938964844,48.119998931884766
"Jul 05, 2019",48.970001220703125,48.88999938964844,49.130001068115234,48.209999084472656
"Jul 08, 2019",49.209999084472656,49.15999984741211,49.59000015258789,48.79999923706055
"Jul 10, 2019",49.5,49.810001373291016,50.5,49.119998931884766
"Jul 11, 2019",51.810001373291016,50.79999923706055,52.70000076293945,50.459999084472656
"Jul 12, 2019",51.86000061035156,52.0,52.34000015258789,50.54999923706055
"Jul 15, 2019",51.47999954223633,51.869998931884766,52.06999969482422,51.040000915527344
"Jul 16, 2019",50.90999984741211,51.41999816894531,51.900001525878906,50.33000183105469
"Jul 17, 2019",51.68000030517578,50.90999984741211,51.68000030517578,50.599998474121094
"Jul 18, 2019",53.97999954223633,52.09000015258789,54.08000183105469,52.06999969482422
"Jul 19, 2019",53.0,53.79999923706055,53.810001373291016,52.380001068115234
"Jul 22, 2019",52.70000076293945,53.09000015258789,53.15999984741211,51.869998931884766
"Jul 23, 2019",52.5,53.099998474121094,53.099998474121094,52.119998931884766
"Jul 24, 2019",52.65999984741211,53.40999984741211,53.40999984741211,51.900001525878906
"Jul 25, 2019",52.15999984741211,52.38999938964844,52.7400016784668,51.59000015258789
"Jul 26, 2019",52.599998474121094,52.290000915527344,52.720001220703125,51.81999969482422
"Jul 29, 2019",52.0,52.459999084472656,52.63999938964844,51.52000045776367
"Jul 30, 2019",53.45000076293945,52.38999938964844,53.45000076293945,52.04999923706055
"Jul 31, 2019",53.400001525878906,53.790000915527344,53.790000915527344,52.43000030517578
"Aug 01, 2019",55.310001373291016,53.470001220703125,56.029998779296875,53.27000045776367
"Aug 02, 2019",55.93000030517578,55.099998474121094,56.099998474121094,54.47999954223633
"Aug 05, 2019",53.72999954223633,55.0,55.189998626708984,53.470001220703125
"Aug 06, 2019",54.56999969482422,53.70000076293945,54.59000015258789,53.31999969482422
"Aug 07, 2019",54.86000061035156,53.81999969482422,54.91999816894531,53.0
"Aug 08, 2019",56.54999923706055,54.810001373291016,56.9900016784668,54.4900016784668
"Aug 09, 2019",57.59000015258789,55.79999923706055,57.650001525878906,55.79999923706055
"Aug 12, 2019",57.70000076293945,57.29999923706055,57.70000076293945,56.11000061035156
"Aug 13, 2019",57.70000076293945,57.599998474121094,58.13999938964844,56.939998626708984
"Aug 14, 2019",55.959999084472656,56.869998931884766,57.61000061035156,55.40999984741211
"Aug 15, 2019",52.63999938964844,55.0,55.0,51.02000045776367
"Aug 16, 2019",52.5,54.040000915527344,54.040000915527344,52.150001525878906
"Aug 19, 2019",52.58000183105469,52.560001373291016,53.400001525878906,52.0099983215332
"Aug 20, 2019",52.900001525878906,52.65999984741211,52.97999954223633,51.41999816894531
"Aug 21, 2019",55.380001068115234,53.189998626708984,55.380001068115234,52.5
"Aug 22, 2019",54.689998626708984,55.5,55.5,54.650001525878906
"Aug 23, 2019",52.43000030517578,54.63999938964844,55.189998626708984,52.369998931884766
"Aug 26, 2019",51.70000076293945,52.880001068115234,53.41999816894531,51.040000915527344
"Aug 27, 2019",50.79999923706055,51.81999969482422,52.29999923706055,50.13999938964844
"Aug 28, 2019",50.810001373291016,50.77000045776367,50.810001373291016,49.709999084472656
"Aug 29, 2019",51.20000076293945,50.310001373291016,51.43000030517578,50.310001373291016
"Aug 30, 2019",51.70000076293945,51.619998931884766,51.77000045776367,50.560001373291016
"Sep 02, 2019",51.9900016784668,51.54999923706055,52.33000183105469,51.09000015258789
"Sep 03, 2019",50.869998931884766,51.900001525878906,52.029998779296875,50.2599983215332
"Sep 04, 2019",51.529998779296875,51.52000045776367,51.529998779296875,49.959999084472656
"Sep 05, 2019",52.11000061035156,51.709999084472656,52.72999954223633,51.33000183105469
"Sep 06, 2019",51.599998474121094,52.68000030517578,52.68000030517578,50.7599983215332
"Sep 09, 2019",49.560001373291016,51.2599983215332,51.81999969482422,49.06999969482422
"Sep 10, 2019",50.470001220703125,49.5099983215332,50.599998474121094,48.650001525878906
"Sep 11, 2019",51.0099983215332,50.59000015258789,51.380001068115234,50.11000061035156
"Sep 12, 2019",51.5,51.689998626708984,52.34000015258789,51.18000030517578
"Sep 13, 2019",51.16999816894531,51.619998931884766,51.66999816894531,50.5
"Sep 16, 2019",50.650001525878906,51.20000076293945,51.20000076293945,50.16999816894531
"Sep 17, 2019",50.22999954223633,50.470001220703125,50.84000015258789,50.02000045776367
"Sep 18, 2019",50.33000183105469,50.189998626708984,50.689998626708984,49.7400016784668
"Sep 19, 2019",50.779998779296875,50.7400016784668,51.84000015258789,50.36000061035156
"Sep 20, 2019",49.0099983215332,51.5,51.5,49.0099983215332
"Sep 23, 2019",49.08000183105469,49.29999923706055,49.4900016784668,48.40999984741211
"Sep 24, 2019",48.880001068115234,48.900001525878906,49.09000015258789,48.47999954223633
"Sep 25, 2019",48.189998626708984,48.47999954223633,48.63999938964844,46.81999969482422
"Sep 26, 2019",48.90999984741211,48.20000076293945,49.29999923706055,45.90999984741211
"Sep 27, 2019",48.45000076293945,48.79999923706055,48.970001220703125,48.02000045776367
"Sep 30, 2019",49.599998474121094,48.47999954223633,49.84000015258789,48.439998626708984
"Oct 01, 2019",49.75,49.79999923706055,50.880001068115234,49.34000015258789
"Oct 02, 2019",49.0,49.470001220703125,50.02000045776367,48.630001068115234
"Oct 03, 2019",50.45000076293945,48.79999923706055,50.45000076293945,48.34000015258789
"Oct 04, 2019",50.540000915527344,50.380001068115234,50.61000061035156,49.4900016784668
"Oct 07, 2019",48.470001220703125,50.29999923706055,50.310001373291016,48.470001220703125
"Oct 08, 2019",49.279998779296875,48.5,49.29999923706055,48.43000030517578
"Oct 09, 2019",50.119998931884766,49.40999984741211,50.849998474121094,49.40999984741211
"Oct 10, 2019",49.79999923706055,50.70000076293945,51.040000915527344,49.5
"Oct 11, 2019",50.43000030517578,50.38999938964844,50.84000015258789,49.900001525878906
"Oct 14, 2019",50.15999984741211,50.41999816894531,50.58000183105469,49.31999969482422
"Oct 15, 2019",50.380001068115234,50.130001068115234,51.7400016784668,49.79999923706055
"Oct 16, 2019",51.63999938964844,50.380001068115234,51.650001525878906,49.52000045776367
"Oct 17, 2019",50.619998931884766,51.689998626708984,51.689998626708984,50.619998931884766
"Oct 18, 2019",51.22999954223633,50.619998931884766,51.720001220703125,50.310001373291016
"Oct 21, 2019",51.56999969482422,51.5,51.79999923706055,50.43000030517578
"Oct 22, 2019",52.599998474121094,51.29999923706055,52.709999084472656,51.119998931884766
"Oct 23, 2019",53.970001220703125,52.34000015258789,54.2599983215332,52.029998779296875
"Oct 24, 2019",53.29999923706055,53.7400016784668,54.2599983215332,52.9900016784668
"Oct 25, 2019",52.599998474121094,53.43000030517578,53.849998474121094,52.56999969482422
"Oct 28, 2019",52.45000076293945,52.5,52.91999816894531,52.22999954223633
"Oct 29, 2019",53.04999923706055,52.02000045776367,53.209999084472656,51.540000915527344
"Oct 30, 2019",54.84000015258789,53.77000045776367,55.47999954223633,52.939998626708984
"Oct 31, 2019",54.619998931884766,55.0,55.970001220703125,54.380001068115234
"Nov 01, 2019",55.20000076293945,54.52000045776367,55.369998931884766,54.11000061035156
"Nov 04, 2019",55.5,55.0,55.720001220703125,54.4900016784668
"Nov 05, 2019",54.7599983215332,55.09000015258789,55.400001525878906,54.150001525878906
"Nov 06, 2019",53.93000030517578,54.29999923706055,55.34000015258789,53.93000030517578
"Nov 07, 2019",54.88999938964844,54.119998931884766,55.400001525878906,53.7599983215332
"Nov 08, 2019",53.900001525878906,54.400001525878906,54.439998626708984,52.81999969482422
"Nov 11, 2019",53.18000030517578,53.900001525878906,54.16999816894531,52.88999938964844
"Nov 12, 2019",52.18000030517578,53.0,53.119998931884766,51.40999984741211
"Nov 13, 2019",51.52000045776367,51.619998931884766,52.310001373291016,50.630001068115234
"Nov 14, 2019",51.880001068115234,51.7599983215332,52.029998779296875,51.0099983215332
"Nov 18, 2019",52.20000076293945,53.45000076293945,53.61000061035156,51.75
"Nov 19, 2019",51.61000061035156,52.470001220703125,52.70000076293945,51.20000076293945
"Nov 21, 2019",53.81999969482422,51.95000076293945,53.81999969482422,51.720001220703125
"Nov 22, 2019",55.08000183105469,53.5,55.08000183105469,52.650001525878906
"Nov 25, 2019",54.369998931884766,55.20000076293945,55.20000076293945,53.90999984741211
"Nov 26, 2019",54.2599983215332,54.0,54.40999984741211,52.0
"Nov 27, 2019",54.650001525878906,54.25,55.43000030517578,53.77000045776367
"Nov 28, 2019",56.25,54.790000915527344,56.560001373291016,54.540000915527344
"Nov 29, 2019",57.400001525878906,56.04999923706055,57.41999816894531,55.83000183105469
"Dec 02, 2019",58.09000015258789,57.65999984741211,59.310001373291016,57.650001525878906
"Dec 03, 2019",57.349998474121094,58.380001068115234,58.38999938964844,57.04999923706055
"Dec 04, 2019",58.22999954223633,57.400001525878906,59.36000061035156,56.5099983215332
"Dec 05, 2019",58.33000183105469,58.2599983215332,58.97999954223633,57.720001220703125
"Dec 06, 2019",58.45000076293945,58.599998474121094,59.41999816894531,58.40999984741211
"Dec 09, 2019",59.70000076293945,58.529998779296875,59.900001525878906,58.33000183105469
"Dec 10, 2019",59.88999938964844,59.720001220703125,60.38999938964844,59.029998779296875
"Dec 11, 2019",61.5,59.75,61.689998626708984,59.58000183105469
"Dec 12, 2019",59.439998626708984,61.79999923706055,61.95000076293945,58.59000015258789
"Dec 13, 2019",58.400001525878906,59.439998626708984,59.709999084472656,57.72999954223633
"Dec 16, 2019",58.540000915527344,58.380001068115234,58.900001525878906,57.959999084472656
"Dec 17, 2019",58.130001068115234,58.70000076293945,58.81999969482422,57.439998626708984
"Dec 18, 2019",59.310001373291016,58.41999816894531,59.310001373291016,57.75
"Dec 19, 2019",59.63999938964844,58.599998474121094,59.869998931884766,58.40999984741211
"Dec 20, 2019",59.68000030517578,59.630001068115234,59.95000076293945,58.810001373291016
"Dec 23, 2019",60.029998779296875,58.900001525878906,60.189998626708984,58.900001525878906
"Dec 26, 2019",61.61000061035156,59.72999954223633,61.70000076293945,59.72999954223633
"Dec 27, 2019",61.83000183105469,61.790000915527344,62.0099983215332,60.849998474121094
"Dec 30, 2019",60.560001373291016,61.83000183105469,61.83000183105469,60.40999984741211
"Jan 02, 2020",60.54999923706055,60.61000061035156,61.0,59.81999969482422
"Jan 03, 2020",59.5099983215332,59.560001373291016,60.27000045776367,59.41999816894531
"Jan 06, 2020",58.599998474121094,59.08000183105469,59.52000045776367,58.2400016784668
"Jan 07, 2020",57.599998474121094,58.70000076293945,58.790000915527344,57.029998779296875
"Jan 08, 2020",56.75,57.83000183105469,57.97999954223633,56.349998474121094
"Jan 09, 2020",57.619998931884766,58.29999923706055,58.29999923706055,56.72999954223633
"Jan 10, 2020",57.40999984741211,57.849998474121094,58.20000076293945,57.02000045776367
"Jan 13, 2020",59.90999984741211,57.650001525878906,59.90999984741211,57.650001525878906
"Jan 14, 2020",61.209999084472656,60.0099983215332,61.529998779296875,60.0099983215332
"Jan 15, 2020",60.900001525878906,61.310001373291016,61.689998626708984,60.83000183105469
"Jan 16, 2020",60.54999923706055,61.13999938964844,61.31999969482422,60.0099983215332
"Jan 17, 2020",60.150001525878906,60.650001525878906,60.97999954223633,59.91999816894531
"Jan 20, 2020",60.29999923706055,60.29999923706055,61.040000915527344,60.02000045776367
"Jan 21, 2020",60.33000183105469,60.08000183105469,60.869998931884766,60.0
"Jan 22, 2020",61.060001373291016,60.81999969482422,61.47999954223633,60.45000076293945
"Jan 23, 2020",62.630001068115234,60.56999969482422,62.720001220703125,60.099998474121094
"Jan 24, 2020",62.470001220703125,62.77000045776367,63.36000061035156,61.83000183105469
"Jan 27, 2020",61.58000183105469,61.4900016784668,61.7599983215332,60.720001220703125
"Jan 28, 2020",64.5,61.79999923706055,64.8499984741211,61.27000045776367
"Jan 29, 2020",62.400001525878906,64.52999877929688,64.52999877929688,62.2400016784668
"Jan 30, 2020",62.290000915527344,61.77000045776367,62.290000915527344,59.599998474121094
"Jan 31, 2020",61.0,61.029998779296875,61.630001068115234,60.369998931884766
"Feb 03, 2020",61.7599983215332,61.0,62.40999984741211,60.95000076293945
"Feb 04, 2020",62.939998626708984,62.040000915527344,64.04000091552734,62.040000915527344
"Feb 05, 2020",64.94999694824219,64.0,64.94999694824219,63.4900016784668
"Feb 06, 2020",63.79999923706055,64.98999786376953,65.5,63.209999084472656
"Feb 07, 2020",63.369998931884766,63.20000076293945,64.19999694824219,62.75
"Feb 10, 2020",61.33000183105469,63.2400016784668,63.56999969482422,60.720001220703125
"Feb 11, 2020",63.040000915527344,61.56999969482422,63.18000030517578,61.060001373291016
"Feb 12, 2020",63.939998626708984,63.20000076293945,64.62000274658203,62.400001525878906
"Feb 13, 2020",63.810001373291016,63.650001525878906,63.810001373291016,62.52000045776367
"Feb 14, 2020",64.44000244140625,63.70000076293945,64.44000244140625,62.900001525878906
"Feb 17, 2020",65.33000183105469,64.5999984741211,65.33000183105469,63.88999938964844
"Feb 18, 2020",65.12999725341797,64.69999694824219,65.12999725341797,63.720001220703125
"Feb 19, 2020",66.47000122070312,65.25,66.7699966430664,64.55999755859375
"Feb 20, 2020",65.0999984741211,66.33000183105469,66.38999938964844,64.0199966430664
"Feb 21, 2020",65.66999816894531,64.31999969482422,65.83000183105469,63.709999084472656
"Feb 27, 2020",59.5099983215332,60.65999984741211,61.33000183105469,59.27000045776367
"Feb 28, 2020",58.75,59.04999923706055,59.45000076293945,55.95000076293945
"Mar 02, 2020",60.13999938964844,58.25,60.13999938964844,57.599998474121094
"Mar 03, 2020",60.0,60.0,62.09000015258789,58.779998779296875
"Mar 04, 2020",62.81999969482422,60.779998779296875,62.86000061035156,60.29999923706055
"Mar 05, 2020",60.15999984741211,61.529998779296875,62.5,59.060001373291016
"Mar 06, 2020",57.369998931884766,57.58000183105469,58.310001373291016,56.029998779296875
"Mar 09, 2020",52.0,53.9900016784668,54.0,50.58000183105469
"Mar 10, 2020",54.720001220703125,53.099998474121094,54.720001220703125,51.130001068115234
"Mar 11, 2020",50.5,52.599998474121094,53.88999938964844,47.59000015258789
"Mar 12, 2020",42.84000015258789,43.380001068115234,45.5,39.5
"Mar 13, 2020",50.31999969482422,47.0,50.31999969482422,42.33000183105469
"Mar 16, 2020",47.5,44.43000030517578,47.5,42.380001068115234
"Mar 17, 2020",45.9900016784668,47.599998474121094,48.0,43.54999923706055
"Mar 18, 2020",37.790000915527344,41.0,42.290000915527344,30.510000228881836
"Mar 19, 2020",36.88999938964844,36.4900016784668,37.97999954223633,32.16999816894531
"Mar 20, 2020",33.709999084472656,37.279998779296875,37.689998626708984,33.099998474121094
"Mar 23, 2020",30.549999237060547,33.689998626708984,33.689998626708984,28.3700008392334
"Mar 24, 2020",32.099998474121094,32.0,32.79999923706055,29.790000915527344
"Mar 25, 2020",35.31999969482422,31.5,35.599998474121094,31.399999618530273
"Mar 26, 2020",40.0099983215332,34.900001525878906,40.79999923706055,34.5
"Mar 27, 2020",40.06999969482422,37.599998474121094,41.34000015258789,37.599998474121094
"Mar 30, 2020",40.810001373291016,40.08000183105469,41.59000015258789,39.209999084472656
"Mar 31, 2020",39.11000061035156,40.63999938964844,40.63999938964844,37.4900016784668
"Apr 01, 2020",36.63999938964844,37.560001373291016,37.68000030517578,35.79999923706055
"Apr 02, 2020",35.849998474121094,36.70000076293945,36.900001525878906,33.90999984741211
"Apr 03, 2020",34.18000030517578,35.61000061035156,35.97999954223633,33.150001525878906
"Apr 06, 2020",36.34000015258789,36.099998474121094,36.779998779296875,34.86000061035156
"Apr 07, 2020",38.34000015258789,38.7400016784668,39.849998474121094,37.84000015258789
"Apr 08, 2020",40.400001525878906,38.38999938964844,40.56999969482422,37.68000030517578
"Apr 09, 2020",41.779998779296875,40.54999923706055,42.5,40.13999938964844
"Apr 13, 2020",41.400001525878906,41.72999954223633,41.72999954223633,39.599998474121094
"Apr 14, 2020",41.959999084472656,42.0,43.0,41.189998626708984
"Apr 15, 2020",41.0,41.290000915527344,41.5,40.08000183105469
"Apr 16, 2020",41.459999084472656,41.209999084472656,41.849998474121094,40.220001220703125
"Apr 17, 2020",42.16999816894531,42.0,43.0,41.58000183105469
"Apr 20, 2020",41.5099983215332,41.4900016784668,41.599998474121094,40.54999923706055
"Apr 22, 2020",43.66999816894531,41.5099983215332,43.66999816894531,41.310001373291016
"Apr 23, 2020",42.380001068115234,43.70000076293945,43.959999084472656,41.29999923706055
"Apr 24, 2020",37.77000045776367,40.77000045776367,41.290000915527344,36.06999969482422
"Apr 27, 2020",40.970001220703125,38.75,41.040000915527344,38.29999923706055
"Apr 28, 2020",42.09000015258789,42.189998626708984,43.599998474121094,41.0
"Apr 29, 2020",41.22999954223633,42.09000015258789,42.09000015258789,40.47999954223633
"Apr 30, 2020",40.08000183105469,40.380001068115234,40.75,39.459999084472656
"May 04, 2020",39.90999984741211,38.5,40.220001220703125,38.099998474121094
"May 05, 2020",41.70000076293945,40.20000076293945,42.54999923706055,40.20000076293945
"May 06, 2020",40.5099983215332,41.88999938964844,41.88999938964844,39.91999816894531
"May 07, 2020",39.45000076293945,41.0,41.20000076293945,38.560001373291016
"May 08, 2020",41.0,40.36000061035156,41.0,39.349998474121094
"May 11, 2020",41.720001220703125,41.0,42.5099983215332,40.33000183105469
"May 12, 2020",39.810001373291016,41.849998474121094,42.380001068115234,39.5
"May 13, 2020",39.4900016784668,40.0,40.349998474121094,38.130001068115234
"May 14, 2020",40.13999938964844,38.880001068115234,40.59000015258789,37.59000015258789
"May 15, 2020",37.79999923706055,38.869998931884766,40.130001068115234,37.79999923706055
"May 18, 2020",41.0,38.650001525878906,41.20000076293945,38.52000045776367
"May 19, 2020",40.29999923706055,40.720001220703125,41.5099983215332,39.810001373291016
"May 20, 2020",39.31999969482422,40.29999923706055,40.779998779296875,39.13999938964844
"May 21, 2020",42.380001068115234,39.43000030517578,42.380001068115234,39.029998779296875
"May 22, 2020",44.16999816894531,41.20000076293945,44.16999816894531,41.20000076293945
"May 25, 2020",49.900001525878906,46.5,49.900001525878906,45.869998931884766
"May 26, 2020",50.150001525878906,51.4900016784668,51.4900016784668,48.68000030517578
"May 27, 2020",53.63999938964844,52.560001373291016,53.7400016784668,51.15999984741211
"May 28, 2020",53.09000015258789,52.810001373291016,53.880001068115234,51.79999923706055
"May 29, 2020",54.31999969482422,53.790000915527344,54.7400016784668,51.41999816894531
"Jun 01, 2020",54.150001525878906,53.709999084472656,54.720001220703125,53.400001525878906
"Jun 02, 2020",54.619998931884766,54.40999984741211,55.189998626708984,53.75
"Jun 03, 2020",54.84000015258789,55.0,55.77000045776367,53.25
"Jun 04, 2020",53.599998474121094,53.209999084472656,54.790000915527344,53.040000915527344
"Jun 05, 2020",52.9900016784668,54.2599983215332,56.0,52.43000030517578
"Jun 08, 2020",54.93000030517578,53.61000061035156,54.93000030517578,53.0
"Jun 09, 2020",55.29999923706055,54.400001525878906,56.27000045776367,52.93000030517578
"Jun 10, 2020",54.5,55.779998779296875,56.029998779296875,54.0
"Jun 12, 2020",53.959999084472656,53.9900016784668,54.209999084472656,52.0
"Jun 15, 2020",55.0,52.29999923706055,55.70000076293945,52.20000076293945
"Jun 16, 2020",54.470001220703125,56.849998474121094,56.849998474121094,54.0
"Jun 17, 2020",56.59000015258789,54.709999084472656,57.470001220703125,54.68000030517578
"Jun 18, 2020",57.79999923706055,55.90999984741211,57.79999923706055,55.5
"Jun 19, 2020",57.65999984741211,59.099998474121094,59.79999923706055,57.65999984741211
"Jun 22, 2020",60.20000076293945,59.91999816894531,60.439998626708984,58.560001373291016
"Jun 23, 2020",58.70000076293945,60.7599983215332,61.36000061035156,58.61000061035156
"Jun 24, 2020",60.06999969482422,59.0,60.880001068115234,58.209999084472656
"Jun 25, 2020",59.27000045776367,59.959999084472656,60.88999938964844,57.599998474121094
"Jun 26, 2020",56.29999923706055,58.91999816894531,58.91999816894531,55.77000045776367
"Jun 29, 2020",57.20000076293945,57.029998779296875,57.5,56.2400016784668
"Jun 30, 2020",57.70000076293945,56.470001220703125,57.959999084472656,56.20000076293945
"Jul 01, 2020",58.900001525878906,58.7400016784668,59.0,57.369998931884766
"Jul 02, 2020",57.59000015258789,59.27000045776367,59.630001068115234,57.189998626708984
"Jul 03, 2020",57.880001068115234,57.52000045776367,58.310001373291016,57.36000061035156
"Jul 06, 2020",59.16999816894531,59.099998474121094,59.65999984741211,58.220001220703125
"Jul 07, 2020",57.689998626708984,58.900001525878906,58.900001525878906,57.650001525878906
"Jul 08, 2020",58.75,58.0,59.150001525878906,57.869998931884766
"Jul 09, 2020",58.150001525878906,58.290000915527344,58.63999938964844,57.060001373291016
"Jul 10, 2020",58.720001220703125,57.599998474121094,58.869998931884766,57.29999923706055
"Jul 13, 2020",56.86000061035156,58.540000915527344,58.810001373291016,56.86000061035156
"Jul 14, 2020",56.79999923706055,56.54999923706055,57.5,56.0
"Jul 15, 2020",61.380001068115234,57.29999923706055,62.040000915527344,56.97999954223633
"Jul 16, 2020",60.0,61.150001525878906,62.349998474121094,59.65999984741211
"Jul 17, 2020",63.880001068115234,60.0,63.880001068115234,60.0
"Jul 20, 2020",62.61000061035156,63.63999938964844,63.720001220703125,61.90999984741211
"Jul 21, 2020",62.150001525878906,63.0,63.029998779296875,61.220001220703125
"Jul 22, 2020",63.220001220703125,62.38999938964844,63.220001220703125,61.70000076293945
"Jul 23, 2020",61.20000076293945,63.16999816894531,63.459999084472656,60.83000183105469
"Jul 24, 2020",61.540000915527344,61.349998474121094,61.7599983215332,60.189998626708984
"Jul 27, 2020",60.88999938964844,61.650001525878906,62.0,60.20000076293945
"Jul 28, 2020",60.119998931884766,60.65999984741211,60.77000045776367,59.63999938964844
"Jul 29, 2020",58.959999084472656,59.720001220703125,60.310001373291016,58.65999984741211
"Jul 30, 2020",59.13999938964844,58.5,59.70000076293945,58.5
"Jul 31, 2020",60.849998474121094,60.16999816894531,61.34000015258789,59.2599983215332
"Aug 03, 2020",60.13999938964844,60.790000915527344,61.290000915527344,59.720001220703125
"Aug 04, 2020",58.869998931884766,59.88999938964844,59.88999938964844,57.81999969482422
"Aug 05, 2020",58.45000076293945,59.38999938964844,59.75,57.93000030517578
"Aug 06, 2020",59.619998931884766,58.45000076293945,59.619998931884766,57.869998931884766
"Aug 07, 2020",59.4900016784668,58.70000076293945,59.7400016784668,58.27000045776367
"Aug 10, 2020",58.9900016784668,59.470001220703125,59.4900016784668,57.56999969482422
"Aug 11, 2020",57.130001068115234,59.099998474121094,59.34000015258789,56.900001525878906
"Aug 12, 2020",56.470001220703125,57.310001373291016,57.5,55.4900016784668
"Aug 13, 2020",56.099998474121094,56.70000076293945,57.11000061035156,55.27000045776367
"Aug 14, 2020",56.41999816894531,56.5,56.599998474121094,55.279998779296875
"Aug 17, 2020",54.5099983215332,56.38999938964844,56.38999938964844,53.349998474121094
"Aug 18, 2020",55.54999923706055,55.20000076293945,55.619998931884766,54.47999954223633
"Aug 19, 2020",52.75,55.099998474121094,55.529998779296875,49.599998474121094
"Aug 20, 2020",51.4900016784668,52.040000915527344,52.470001220703125,51.15999984741211
"Aug 21, 2020",51.88999938964844,51.310001373291016,52.09000015258789,50.619998931884766
"Aug 24, 2020",51.349998474121094,52.029998779296875,52.400001525878906,50.54999923706055
"Aug 25, 2020",51.939998626708984,51.290000915527344,52.75,50.720001220703125
"Aug 26, 2020",50.209999084472656,51.95000076293945,52.13999938964844,49.5099983215332
"Aug 27, 2020",50.54999923706055,50.29999923706055,51.38999938964844,49.90999984741211
"Aug 28, 2020",50.18000030517578,50.4900016784668,51.290000915527344,50.09000015258789
"Aug 31, 2020",47.75,49.97999954223633,50.18000030517578,47.75
