Date,Price,Open,High,Low
"Jun 03, 2019",31.25,32.279998779296875,32.599998474121094,30.90999984741211
"Jun 04, 2019",30.739999771118164,30.940000534057617,31.31999969482422,30.350000381469727
"Jun 05, 2019",30.450000762939453,30.850000381469727,31.15999984741211,30.200000762939453
"Jun 06, 2019",29.950000762939453,30.68000030517578,30.68000030517578,29.700000762939453
"Jun 07, 2019",30.360000610351562,29.719999313354492,30.899999618530273,29.170000076293945
"Jun 10, 2019",30.770000457763672,30.5,30.899999618530273,30.239999771118164
"Jun 11, 2019",30.850000381469727,30.989999771118164,31.100000381469727,30.31999969482422
"Jun 12, 2019",30.260000228881836,30.969999313354492,30.979999542236328,30.25
"Jun 13, 2019",31.93000030517578,30.420000076293945,32.31999969482422,30.1200008392334
"Jun 14, 2019",32.5,31.959999084472656,32.5,31.420000076293945
"Jun 17, 2019",32.900001525878906,32.65999984741211,33.650001525878906,32.349998474121094
"Jun 18, 2019",33.380001068115234,32.88999938964844,33.380001068115234,32.630001068115234
"Jun 19, 2019",33.0,33.54999923706055,33.79999923706055,32.880001068115234
"Jun 21, 2019",33.7599983215332,33.099998474121094,33.7599983215332,32.61000061035156
"Jun 24, 2019",34.52000045776367,33.709999084472656,35.0,33.5099983215332
"Jun 25, 2019",33.599998474121094,34.599998474121094,34.97999954223633,33.45000076293945
"Jun 26, 2019",33.38999938964844,33.599998474121094,34.20000076293945,33.220001220703125
"Jun 27, 2019",33.779998779296875,33.40999984741211,33.86000061035156,33.27000045776367
"Jun 28, 2019",32.849998474121094,33.70000076293945,33.79999923706055,32.16999816894531
"Jul 01, 2019",31.56999969482422,32.70000076293945,32.849998474121094,31.559999465942383
"Jul 02, 2019",31.0,31.68000030517578,31.920000076293945,30.729999542236328
"Jul 03, 2019",31.200000762939453,30.899999618530273,31.610000610351562,30.3700008392334
"Jul 04, 2019",31.75,31.0,31.780000686645508,30.979999542236328
"Jul 05, 2019",32.70000076293945,32.0099983215332,33.29999923706055,32.0099983215332
"Jul 08, 2019",32.54999923706055,32.599998474121094,32.91999816894531,32.0
"Jul 10, 2019",31.5,32.349998474121094,32.54999923706055,31.5
"Jul 11, 2019",31.049999237060547,31.389999389648438,31.469999313354492,31.049999237060547
"Jul 12, 2019",32.0,31.149999618530273,32.380001068115234,31.1200008392334
"Jul 15, 2019",32.900001525878906,32.29999923706055,33.0,32.08000183105469
"Jul 16, 2019",33.66999816894531,32.900001525878906,34.150001525878906,32.900001525878906
"Jul 17, 2019",34.75,33.88999938964844,34.869998931884766,33.41999816894531
"Jul 18, 2019",34.47999954223633,34.650001525878906,35.15999984741211,33.900001525878906
"Jul 19, 2019",33.08000183105469,34.400001525878906,34.400001525878906,32.900001525878906
"Jul 22, 2019",32.689998626708984,32.86000061035156,33.040000915527344,32.349998474121094
"Jul 23, 2019",32.06999969482422,32.59000015258789,32.689998626708984,31.969999313354492
"Jul 24, 2019",32.04999923706055,31.950000762939453,32.54999923706055,31.850000381469727
"Jul 25, 2019",31.719999313354492,32.20000076293945,32.459999084472656,31.309999465942383
"Jul 26, 2019",31.200000762939453,31.889999389648438,31.950000762939453,30.899999618530273
"Jul 29, 2019",30.670000076293945,31.280000686645508,31.399999618530273,30.450000762939453
"Jul 30, 2019",31.09000015258789,30.850000381469727,31.5,30.399999618530273
"Jul 31, 2019",30.670000076293945,31.3799991607666,31.3799991607666,30.510000228881836
"Aug 01, 2019",30.649999618530273,30.670000076293945,31.25,30.149999618530273
"Aug 02, 2019",30.209999084472656,30.5,32.16999816894531,29.959999084472656
"Aug 05, 2019",30.149999618530273,30.15999984741211,30.549999237060547,29.290000915527344
"Aug 06, 2019",30.270000457763672,30.110000610351562,30.350000381469727,29.75
"Aug 07, 2019",30.399999618530273,30.399999618530273,30.65999984741211,29.809999465942383
"Aug 08, 2019",31.100000381469727,30.600000381469727,31.43000030517578,30.3700008392334
"Aug 09, 2019",30.459999084472656,32.209999084472656,32.59000015258789,30.15999984741211
"Aug 12, 2019",30.84000015258789,30.5,31.190000534057617,30.190000534057617
"Aug 13, 2019",32.650001525878906,30.75,32.70000076293945,30.75
"Aug 14, 2019",32.060001373291016,32.54999923706055,33.29999923706055,31.8799991607666
"Aug 15, 2019",31.84000015258789,32.0,32.439998626708984,31.1299991607666
"Aug 16, 2019",32.040000915527344,32.04999923706055,32.380001068115234,31.350000381469727
"Aug 19, 2019",31.93000030517578,32.0,32.279998779296875,31.65999984741211
"Aug 20, 2019",31.149999618530273,31.850000381469727,32.2599983215332,30.950000762939453
"Aug 21, 2019",30.399999618530273,31.350000381469727,31.479999542236328,30.350000381469727
"Aug 22, 2019",29.399999618530273,30.5,30.770000457763672,29.399999618530273
"Aug 23, 2019",28.0,29.260000228881836,29.3700008392334,27.549999237060547
"Aug 26, 2019",28.040000915527344,28.25,28.520000457763672,27.59000015258789
"Aug 27, 2019",28.520000457763672,28.0,28.700000762939453,27.920000076293945
"Aug 28, 2019",28.719999313354492,28.389999389648438,28.790000915527344,28.040000915527344
"Aug 29, 2019",29.0,28.899999618530273,29.709999084472656,28.75
"Aug 30, 2019",29.079999923706055,29.200000762939453,29.5,28.6200008392334
"Sep 02, 2019",29.139999389648438,29.049999237060547,29.3799991607666,28.8700008392334
"Sep 03, 2019",28.6200008392334,29.200000762939453,29.270000457763672,28.40999984741211
"Sep 04, 2019",28.75,28.989999771118164,29.139999389648438,28.5
"Sep 05, 2019",29.549999237060547,29.010000228881836,30.059999465942383,28.950000762939453
"Sep 06, 2019",29.670000076293945,29.829999923706055,30.09000015258789,29.469999313354492
"Sep 09, 2019",31.6200008392334,29.700000762939453,31.6200008392334,29.3799991607666
"Sep 10, 2019",31.290000915527344,31.899999618530273,32.630001068115234,31.149999618530273
"Sep 11, 2019",30.920000076293945,31.219999313354492,31.899999618530273,30.65999984741211
"Sep 12, 2019",32.54999923706055,31.200000762939453,32.68000030517578,31.040000915527344
"Sep 13, 2019",33.29999923706055,32.650001525878906,33.619998931884766,32.650001525878906
"Sep 16, 2019",34.279998779296875,32.54999923706055,34.279998779296875,31.959999084472656
"Sep 17, 2019",34.099998474121094,33.95000076293945,34.310001373291016,33.5
"Sep 18, 2019",33.790000915527344,33.83000183105469,34.130001068115234,33.209999084472656
"Sep 19, 2019",32.9900016784668,34.0,34.09000015258789,32.9900016784668
"Sep 20, 2019",31.899999618530273,32.970001220703125,32.970001220703125,31.549999237060547
"Sep 23, 2019",32.9900016784668,31.899999618530273,33.20000076293945,31.899999618530273
"Sep 24, 2019",32.40999984741211,32.869998931884766,33.279998779296875,32.380001068115234
"Sep 25, 2019",33.400001525878906,32.29999923706055,33.70000076293945,32.11000061035156
"Sep 26, 2019",33.34000015258789,33.5,33.54999923706055,32.84000015258789
"Sep 27, 2019",33.75,33.20000076293945,34.09000015258789,33.060001373291016
"Sep 30, 2019",33.650001525878906,33.79999923706055,33.88999938964844,33.0
"Oct 01, 2019",33.650001525878906,33.650001525878906,33.95000076293945,33.15999984741211
"Oct 02, 2019",32.779998779296875,33.41999816894531,33.4900016784668,32.5
"Oct 03, 2019",32.33000183105469,32.61000061035156,32.7400016784668,31.940000534057617
"Oct 04, 2019",32.83000183105469,32.33000183105469,33.09000015258789,32.040000915527344
"Oct 07, 2019",32.25,32.70000076293945,32.70000076293945,32.0
"Oct 08, 2019",31.639999389648438,32.279998779296875,32.459999084472656,31.600000381469727
"Oct 09, 2019",32.22999954223633,31.639999389648438,32.41999816894531,31.56999969482422
"Oct 10, 2019",33.95000076293945,32.11000061035156,34.09000015258789,32.060001373291016
"Oct 11, 2019",35.2400016784668,34.13999938964844,35.5,34.099998474121094
"Oct 14, 2019",34.81999969482422,34.9900016784668,35.880001068115234,34.619998931884766
"Oct 15, 2019",35.11000061035156,34.599998474121094,35.33000183105469,34.15999984741211
"Oct 16, 2019",34.43000030517578,35.41999816894531,35.7400016784668,34.310001373291016
"Oct 17, 2019",34.09000015258789,34.689998626708984,34.7400016784668,33.83000183105469
"Oct 18, 2019",33.810001373291016,34.0,34.45000076293945,33.630001068115234
"Oct 21, 2019",34.880001068115234,33.849998474121094,34.88999938964844,33.83000183105469
"Oct 22, 2019",34.91999816894531,35.15999984741211,35.709999084472656,34.7599983215332
"Oct 23, 2019",34.5,35.04999923706055,35.13999938964844,34.41999816894531
"Oct 24, 2019",32.959999084472656,34.2400016784668,34.2599983215332,32.959999084472656
"Oct 25, 2019",32.70000076293945,32.93000030517578,33.36000061035156,32.56999969482422
"Oct 28, 2019",32.68000030517578,32.880001068115234,33.150001525878906,32.68000030517578
"Oct 29, 2019",32.720001220703125,32.810001373291016,32.9900016784668,32.52000045776367
"Oct 30, 2019",32.29999923706055,32.689998626708984,32.93000030517578,32.08000183105469
"Oct 31, 2019",32.63999938964844,32.20000076293945,33.040000915527344,31.860000610351562
"Nov 01, 2019",35.0099983215332,33.0,35.5,33.0
"Nov 04, 2019",36.439998626708984,34.900001525878906,36.439998626708984,34.5099983215332
"Nov 05, 2019",37.15999984741211,36.5,37.58000183105469,35.70000076293945
"Nov 06, 2019",36.95000076293945,37.13999938964844,37.5,36.38999938964844
"Nov 07, 2019",38.2599983215332,37.04999923706055,38.88999938964844,36.91999816894531
"Nov 08, 2019",38.0,38.0,38.70000076293945,37.5
"Nov 11, 2019",38.2400016784668,37.900001525878906,38.40999984741211,37.29999923706055
"Nov 12, 2019",38.2400016784668,38.25,39.2599983215332,37.91999816894531
"Nov 13, 2019",37.63999938964844,38.2400016784668,38.599998474121094,37.45000076293945
"Nov 14, 2019",36.650001525878906,37.79999923706055,37.95000076293945,36.209999084472656
"Nov 18, 2019",37.81999969482422,36.90999984741211,37.91999816894531,36.349998474121094
"Nov 19, 2019",37.91999816894531,38.0,38.54999923706055,37.619998931884766
"Nov 21, 2019",38.22999954223633,37.900001525878906,38.33000183105469,37.400001525878906
"Nov 22, 2019",38.310001373291016,38.22999954223633,38.689998626708984,37.869998931884766
"Nov 25, 2019",38.0,38.619998931884766,38.619998931884766,37.869998931884766
"Nov 26, 2019",38.08000183105469,38.119998931884766,38.790000915527344,37.79999923706055
"Nov 27, 2019",39.099998474121094,38.20000076293945,39.41999816894531,38.04999923706055
"Nov 28, 2019",38.56999969482422,39.13999938964844,39.5,38.41999816894531
"Nov 29, 2019",38.560001373291016,38.400001525878906,38.84000015258789,37.90999984741211
"Dec 02, 2019",38.79999923706055,38.560001373291016,39.150001525878906,38.380001068115234
"Dec 03, 2019",38.95000076293945,38.54999923706055,38.95000076293945,38.2599983215332
"Dec 04, 2019",37.90999984741211,38.95000076293945,38.95000076293945,37.63999938964844
"Dec 05, 2019",38.0,37.900001525878906,38.70000076293945,37.63999938964844
"Dec 06, 2019",38.20000076293945,38.099998474121094,38.650001525878906,37.939998626708984
"Dec 09, 2019",37.779998779296875,38.099998474121094,38.66999816894531,37.70000076293945
"Dec 10, 2019",38.09000015258789,37.79999923706055,38.45000076293945,37.7400016784668
"Dec 11, 2019",39.18000030517578,37.7599983215332,39.34000015258789,37.720001220703125
"Dec 12, 2019",39.15999984741211,39.349998474121094,39.779998779296875,39.0
"Dec 13, 2019",38.880001068115234,39.5,39.880001068115234,38.63999938964844
"Dec 16, 2019",39.20000076293945,39.0,39.790000915527344,38.93000030517578
"Dec 17, 2019",40.029998779296875,39.20000076293945,40.34000015258789,39.20000076293945
"Dec 18, 2019",39.56999969482422,40.25,40.25,39.0
"Dec 19, 2019",39.66999816894531,39.58000183105469,39.86000061035156,39.0099983215332
"Dec 20, 2019",40.18000030517578,39.70000076293945,40.5,39.209999084472656
"Dec 23, 2019",40.040000915527344,40.25,40.560001373291016,39.470001220703125
"Dec 26, 2019",40.720001220703125,40.040000915527344,40.790000915527344,39.54999923706055
"Dec 27, 2019",40.0,40.720001220703125,40.95000076293945,39.63999938964844
"Dec 30, 2019",39.68000030517578,40.0,40.560001373291016,39.68000030517578
"Jan 02, 2020",40.790000915527344,40.04999923706055,40.81999969482422,39.79999923706055
"Jan 03, 2020",40.650001525878906,40.220001220703125,41.36000061035156,40.20000076293945
"Jan 06, 2020",40.58000183105469,40.36000061035156,41.20000076293945,40.11000061035156
"Jan 07, 2020",41.099998474121094,40.619998931884766,41.33000183105469,40.08000183105469
"Jan 08, 2020",43.150001525878906,41.29999923706055,43.209999084472656,41.0099983215332
"Jan 09, 2020",43.040000915527344,43.13999938964844,43.58000183105469,42.599998474121094
"Jan 10, 2020",43.11000061035156,43.099998474121094,43.5,42.95000076293945
"Jan 13, 2020",44.70000076293945,43.5,44.90999984741211,43.2599983215332
"Jan 14, 2020",44.25,44.75,45.04999923706055,44.20000076293945
"Jan 15, 2020",44.939998626708984,44.099998474121094,45.27000045776367,43.84000015258789
"Jan 16, 2020",44.29999923706055,45.099998474121094,45.25,43.810001373291016
"Jan 17, 2020",43.779998779296875,44.029998779296875,44.5,43.43000030517578
"Jan 20, 2020",42.95000076293945,43.79999923706055,43.93000030517578,42.400001525878906
"Jan 21, 2020",42.70000076293945,43.0,43.16999816894531,42.310001373291016
"Jan 22, 2020",44.849998474121094,43.0,44.849998474121094,42.88999938964844
"Jan 23, 2020",44.45000076293945,44.400001525878906,44.849998474121094,43.5
"Jan 24, 2020",43.869998931884766,44.45000076293945,44.619998931884766,43.33000183105469
"Jan 27, 2020",40.93000030517578,42.45000076293945,42.630001068115234,40.88999938964844
"Jan 28, 2020",41.650001525878906,41.29999923706055,42.20000076293945,41.13999938964844
"Jan 29, 2020",41.02000045776367,42.099998474121094,42.209999084472656,40.93000030517578
"Jan 30, 2020",40.5099983215332,40.0,40.52000045776367,39.65999984741211
"Jan 31, 2020",39.66999816894531,39.9900016784668,40.45000076293945,39.439998626708984
"Feb 03, 2020",39.5,38.970001220703125,40.0,38.400001525878906
"Feb 04, 2020",38.88999938964844,39.81999969482422,40.29999923706055,38.65999984741211
"Feb 05, 2020",38.400001525878906,39.79999923706055,39.97999954223633,37.900001525878906
"Feb 06, 2020",38.900001525878906,38.91999816894531,39.220001220703125,38.220001220703125
"Feb 07, 2020",37.63999938964844,38.900001525878906,38.959999084472656,37.63999938964844
"Feb 10, 2020",37.0,37.689998626708984,38.119998931884766,36.400001525878906
"Feb 11, 2020",38.4900016784668,37.150001525878906,38.540000915527344,36.90999984741211
"Feb 12, 2020",40.0,38.540000915527344,40.41999816894531,38.5
"Feb 13, 2020",41.29999923706055,39.5,42.06999969482422,39.04999923706055
"Feb 14, 2020",39.810001373291016,41.599998474121094,41.79999923706055,39.560001373291016
"Feb 17, 2020",40.0,40.0,41.34000015258789,39.70000076293945
"Feb 18, 2020",40.099998474121094,40.04999923706055,40.68000030517578,39.0
"Feb 19, 2020",40.16999816894531,39.79999923706055,40.84000015258789,39.5
"Feb 20, 2020",40.189998626708984,40.13999938964844,40.95000076293945,39.70000076293945
"Feb 21, 2020",41.41999816894531,40.11000061035156,41.41999816894531,39.84000015258789
"Feb 27, 2020",38.130001068115234,38.380001068115234,39.08000183105469,37.810001373291016
"Feb 28, 2020",38.13999938964844,37.810001373291016,38.13999938964844,36.689998626708984
"Mar 02, 2020",39.650001525878906,38.70000076293945,39.959999084472656,38.130001068115234
"Mar 03, 2020",39.939998626708984,39.29999923706055,41.79999923706055,39.060001373291016
"Mar 04, 2020",43.540000915527344,41.29999923706055,43.75,40.599998474121094
"Mar 05, 2020",42.619998931884766,42.7599983215332,44.279998779296875,41.95000076293945
"Mar 06, 2020",40.029998779296875,41.83000183105469,42.09000015258789,40.029998779296875
"Mar 09, 2020",37.95000076293945,39.0,39.0,37.16999816894531
"Mar 10, 2020",38.86000061035156,38.70000076293945,39.709999084472656,36.849998474121094
"Mar 11, 2020",35.459999084472656,38.220001220703125,38.77000045776367,33.220001220703125
"Mar 12, 2020",29.739999771118164,32.0,33.70000076293945,29.030000686645508
"Mar 13, 2020",31.579999923706055,32.20000076293945,33.27000045776367,28.6299991607666
"Mar 16, 2020",28.3700008392334,28.84000015258789,31.579999923706055,27.549999237060547
"Mar 17, 2020",28.0,28.700000762939453,31.149999618530273,27.459999084472656
"Mar 18, 2020",24.6200008392334,27.299999237060547,29.0,23.260000228881836
"Mar 19, 2020",27.329999923706055,23.799999237060547,27.600000381469727,22.68000030517578
"Mar 20, 2020",27.389999389648438,28.200000762939453,29.0,25.389999389648438
"Mar 23, 2020",28.799999237060547,27.93000030517578,29.290000915527344,25.239999771118164
"Mar 24, 2020",28.899999618530273,30.049999237060547,30.459999084472656,28.3799991607666
"Mar 25, 2020",29.350000381469727,28.6200008392334,31.25,28.5
"Mar 26, 2020",28.049999237060547,29.889999389648438,30.149999618530273,27.510000228881836
"Mar 27, 2020",32.869998931884766,27.0,34.65999984741211,26.8700008392334
"Mar 30, 2020",33.9900016784668,34.02000045776367,35.9900016784668,33.529998779296875
"Mar 31, 2020",35.790000915527344,34.91999816894531,37.38999938964844,34.02000045776367
"Apr 01, 2020",37.380001068115234,34.5,37.400001525878906,33.970001220703125
"Apr 02, 2020",39.900001525878906,38.5,40.43000030517578,37.279998779296875
"Apr 03, 2020",39.79999923706055,40.400001525878906,40.84000015258789,37.25
"Apr 06, 2020",40.02000045776367,40.630001068115234,41.369998931884766,39.29999923706055
"Apr 07, 2020",37.189998626708984,40.90999984741211,41.400001525878906,36.81999969482422
"Apr 08, 2020",37.959999084472656,37.349998474121094,38.25,35.25
"Apr 09, 2020",35.400001525878906,38.13999938964844,38.439998626708984,35.20000076293945
"Apr 13, 2020",36.369998931884766,35.400001525878906,37.0,34.810001373291016
"Apr 14, 2020",38.0,36.72999954223633,38.380001068115234,36.47999954223633
"Apr 15, 2020",37.22999954223633,37.599998474121094,38.709999084472656,36.349998474121094
"Apr 16, 2020",36.18000030517578,37.5,37.72999954223633,35.5
"Apr 17, 2020",35.84000015258789,36.7400016784668,37.0,35.34000015258789
"Apr 20, 2020",34.91999816894531,35.31999969482422,35.790000915527344,34.70000076293945
"Apr 22, 2020",35.209999084472656,35.400001525878906,36.20000076293945,34.900001525878906
"Apr 23, 2020",36.560001373291016,35.25,37.209999084472656,34.810001373291016
"Apr 24, 2020",39.130001068115234,36.79999923706055,39.34000015258789,35.63999938964844
"Apr 27, 2020",40.099998474121094,39.5,40.7400016784668,39.15999984741211
"Apr 28, 2020",38.650001525878906,40.66999816894531,40.66999816894531,38.25
"Apr 29, 2020",38.720001220703125,38.900001525878906,39.349998474121094,38.349998474121094
"Apr 30, 2020",39.40999984741211,39.099998474121094,40.189998626708984,38.84000015258789
"May 04, 2020",40.5,38.72999954223633,40.5,38.38999938964844
"May 05, 2020",41.599998474121094,40.619998931884766,41.900001525878906,39.630001068115234
"May 06, 2020",41.869998931884766,41.779998779296875,42.4900016784668,40.619998931884766
"May 07, 2020",45.0099983215332,43.52000045776367,47.79999923706055,43.0
"May 08, 2020",47.349998474121094,46.9900016784668,48.20000076293945,45.459999084472656
"May 11, 2020",47.599998474121094,47.0,49.70000076293945,47.0
"May 12, 2020",48.54999923706055,48.20000076293945,49.47999954223633,46.61000061035156
"May 13, 2020",50.59000015258789,49.08000183105469,51.20000076293945,48.66999816894531
"May 14, 2020",47.540000915527344,51.0,51.150001525878906,46.54999923706055
"May 15, 2020",45.029998779296875,46.400001525878906,48.84000015258789,44.029998779296875
"May 18, 2020",41.18000030517578,44.79999923706055,45.220001220703125,41.18000030517578
"May 19, 2020",41.7599983215332,40.75,42.59000015258789,40.380001068115234
"May 20, 2020",40.25,42.189998626708984,42.45000076293945,39.79999923706055
"May 21, 2020",38.47999954223633,40.2400016784668,40.40999984741211,38.29999923706055
"May 22, 2020",38.61000061035156,38.7599983215332,39.869998931884766,38.0
"May 25, 2020",37.70000076293945,38.9900016784668,39.20000076293945,37.5
"May 26, 2020",37.880001068115234,37.630001068115234,38.4900016784668,37.02000045776367
"May 27, 2020",38.40999984741211,38.13999938964844,39.02000045776367,37.38999938964844
"May 28, 2020",38.36000061035156,39.349998474121094,39.369998931884766,38.09000015258789
"May 29, 2020",37.86000061035156,38.619998931884766,39.060001373291016,36.56999969482422
"Jun 01, 2020",38.45000076293945,38.310001373291016,39.0,37.5
"Jun 02, 2020",38.41999816894531,38.0099983215332,38.689998626708984,37.900001525878906
"Jun 03, 2020",38.130001068115234,38.36000061035156,38.45000076293945,37.40999984741211
"Jun 04, 2020",39.849998474121094,38.20000076293945,40.0,37.88999938964844
"Jun 05, 2020",38.29999923706055,39.2400016784668,39.369998931884766,38.16999816894531
"Jun 08, 2020",38.15999984741211,38.150001525878906,38.95000076293945,37.56999969482422
"Jun 09, 2020",38.16999816894531,38.91999816894531,39.20000076293945,37.939998626708984
"Jun 10, 2020",38.130001068115234,38.369998931884766,38.939998626708984,37.90999984741211
"Jun 12, 2020",37.0099983215332,37.90999984741211,38.650001525878906,36.20000076293945
"Jun 15, 2020",38.4900016784668,36.619998931884766,38.869998931884766,36.40999984741211
"Jun 16, 2020",38.099998474121094,38.150001525878906,39.09000015258789,37.91999816894531
"Jun 17, 2020",38.900001525878906,38.400001525878906,38.900001525878906,38.06999969482422
"Jun 18, 2020",39.54999923706055,39.20000076293945,39.790000915527344,38.650001525878906
"Jun 19, 2020",39.5,39.54999923706055,40.150001525878906,38.900001525878906
"Jun 22, 2020",38.9900016784668,39.61000061035156,39.779998779296875,38.529998779296875
"Jun 23, 2020",38.040000915527344,38.4900016784668,39.20000076293945,37.81999969482422
"Jun 24, 2020",38.599998474121094,38.20000076293945,38.79999923706055,37.869998931884766
"Jun 25, 2020",38.08000183105469,38.619998931884766,38.79999923706055,37.900001525878906
"Jun 26, 2020",37.880001068115234,38.349998474121094,38.7599983215332,37.5099983215332
"Jun 29, 2020",37.72999954223633,37.81999969482422,38.15999984741211,37.29999923706055
"Jun 30, 2020",36.790000915527344,37.689998626708984,37.939998626708984,36.45000076293945
"Jul 01, 2020",37.13999938964844,36.790000915527344,37.25,36.13999938964844
"Jul 02, 2020",36.81999969482422,37.20000076293945,37.47999954223633,36.68000030517578
"Jul 03, 2020",37.27000045776367,36.869998931884766,37.27000045776367,36.41999816894531
"Jul 06, 2020",36.900001525878906,37.27000045776367,37.27000045776367,36.75
"Jul 07, 2020",36.189998626708984,36.02000045776367,37.2599983215332,35.900001525878906
"Jul 08, 2020",36.150001525878906,36.150001525878906,36.72999954223633,36.150001525878906
"Jul 09, 2020",36.470001220703125,36.16999816894531,36.79999923706055,35.90999984741211
"Jul 10, 2020",36.68000030517578,36.470001220703125,36.88999938964844,36.27000045776367
"Jul 13, 2020",36.060001373291016,36.7599983215332,37.02000045776367,36.0
"Jul 14, 2020",36.65999984741211,36.099998474121094,37.02000045776367,35.709999084472656
"Jul 15, 2020",38.849998474121094,37.0099983215332,39.2400016784668,36.709999084472656
"Jul 16, 2020",38.72999954223633,38.619998931884766,39.09000015258789,38.04999923706055
"Jul 17, 2020",39.849998474121094,38.75,39.900001525878906,38.349998474121094
"Jul 20, 2020",40.2400016784668,39.54999923706055,40.369998931884766,39.349998474121094
"Jul 21, 2020",40.5,40.20000076293945,40.599998474121094,39.900001525878906
"Jul 22, 2020",39.5,40.25,40.79999923706055,38.91999816894531
"Jul 23, 2020",40.7400016784668,39.720001220703125,41.20000076293945,39.36000061035156
"Jul 24, 2020",42.29999923706055,40.52000045776367,43.06999969482422,40.189998626708984
"Jul 27, 2020",41.66999816894531,41.70000076293945,42.13999938964844,40.90999984741211
"Jul 28, 2020",42.0,41.599998474121094,42.119998931884766,40.900001525878906
"Jul 29, 2020",41.4900016784668,42.0099983215332,42.0099983215332,40.97999954223633
"Jul 30, 2020",42.220001220703125,41.33000183105469,42.959999084472656,41.31999969482422
"Jul 31, 2020",42.0,42.400001525878906,42.650001525878906,41.5099983215332
"Aug 03, 2020",43.09000015258789,42.400001525878906,43.689998626708984,41.81999969482422
"Aug 04, 2020",42.08000183105469,43.400001525878906,43.40999984741211,41.41999816894531
"Aug 05, 2020",45.279998779296875,42.5,45.959999084472656,42.349998474121094
"Aug 06, 2020",46.31999969482422,46.25,46.9900016784668,45.599998474121094
"Aug 07, 2020",46.18000030517578,45.810001373291016,47.439998626708984,45.810001373291016
"Aug 10, 2020",47.36000061035156,46.0,47.5,46.0
"Aug 11, 2020",46.900001525878906,47.29999923706055,47.790000915527344,46.560001373291016
"Aug 12, 2020",47.22999954223633,47.290000915527344,47.52000045776367,46.11000061035156
"Aug 13, 2020",47.66999816894531,47.08000183105469,48.59000015258789,46.83000183105469
"Aug 14, 2020",50.4900016784668,48.77000045776367,52.20000076293945,48.22999954223633
"Aug 17, 2020",50.97999954223633,50.0,51.849998474121094,50.0
"Aug 18, 2020",52.0,50.97999954223633,52.40999984741211,50.599998474121094
"Aug 19, 2020",50.630001068115234,52.290000915527344,53.75,50.630001068115234
"Aug 20, 2020",52.25,51.5,53.58000183105469,51.2400016784668
"Aug 21, 2020",52.150001525878906,51.93000030517578,52.400001525878906,50.90999984741211
"Aug 24, 2020",52.150001525878906,52.20000076293945,52.380001068115234,51.209999084472656
"Aug 25, 2020",51.099998474121094,52.18000030517578,52.34000015258789,50.54999923706055
"Aug 26, 2020",51.7599983215332,50.689998626708984,51.97999954223633,49.81999969482422
"Aug 27, 2020",51.41999816894531,51.599998474121094,51.7400016784668,50.52000045776367
"Aug 28, 2020",50.9900016784668,51.5,51.5,50.2599983215332
"Aug 31, 2020",50.20000076293945,50.54999923706055,50.790000915527344,50.130001068115234
