Date,Price,Open,High,Low
"Jun 03, 2019",52.09000015258789,52.220001220703125,52.54999923706055,51.650001525878906
"Jun 04, 2019",52.939998626708984,52.29999923706055,52.939998626708984,52.02000045776367
"Jun 05, 2019",51.47999954223633,52.86000061035156,52.939998626708984,51.189998626708984
"Jun 06, 2019",52.790000915527344,52.06999969482422,52.86000061035156,51.45000076293945
"Jun 07, 2019",52.36000061035156,52.90999984741211,53.119998931884766,52.36000061035156
"Jun 10, 2019",51.869998931884766,52.04999923706055,52.20000076293945,50.970001220703125
"Jun 11, 2019",52.900001525878906,52.400001525878906,52.900001525878906,51.84000015258789
"Jun 12, 2019",52.2599983215332,52.880001068115234,53.0,51.91999816894531
"Jun 13, 2019",51.43000030517578,52.25,52.66999816894531,51.27000045776367
"Jun 14, 2019",50.52000045776367,51.34000015258789,51.5,49.939998626708984
"Jun 17, 2019",50.470001220703125,50.380001068115234,51.04999923706055,50.13999938964844
"Jun 18, 2019",51.650001525878906,50.849998474121094,52.04999923706055,50.779998779296875
"Jun 19, 2019",52.5,51.5,52.5,51.11000061035156
"Jun 21, 2019",52.90999984741211,52.599998474121094,53.5,52.599998474121094
"Jun 24, 2019",53.040000915527344,52.9900016784668,53.900001525878906,52.63999938964844
"Jun 25, 2019",52.54999923706055,52.79999923706055,53.599998474121094,52.25
"Jun 26, 2019",53.689998626708984,52.97999954223633,53.72999954223633,52.70000076293945
"Jun 27, 2019",53.79999923706055,53.20000076293945,54.16999816894531,52.939998626708984
"Jun 28, 2019",53.939998626708984,54.279998779296875,54.279998779296875,53.349998474121094
"Jul 01, 2019",53.880001068115234,54.560001373291016,54.66999816894531,53.5099983215332
"Jul 02, 2019",53.189998626708984,53.720001220703125,54.25,52.77000045776367
"Jul 03, 2019",54.29999923706055,53.400001525878906,54.29999923706055,52.529998779296875
"Jul 04, 2019",55.18000030517578,54.790000915527344,55.18000030517578,54.68000030517578
"Jul 05, 2019",55.0,55.0,55.369998931884766,54.31999969482422
"Jul 08, 2019",54.95000076293945,55.189998626708984,55.349998474121094,54.81999969482422
"Jul 10, 2019",54.2599983215332,55.599998474121094,55.70000076293945,53.790000915527344
"Jul 11, 2019",53.20000076293945,54.130001068115234,54.130001068115234,52.810001373291016
"Jul 12, 2019",52.0,53.52000045776367,53.619998931884766,51.79999923706055
"Jul 15, 2019",51.689998626708984,52.209999084472656,52.38999938964844,51.060001373291016
"Jul 16, 2019",51.77000045776367,52.0,52.189998626708984,51.5099983215332
"Jul 17, 2019",51.779998779296875,51.79999923706055,52.16999816894531,51.5099983215332
"Jul 18, 2019",52.65999984741211,51.970001220703125,53.25,51.869998931884766
"Jul 19, 2019",52.0,52.25,52.95000076293945,52.0
"Jul 22, 2019",52.0099983215332,52.47999954223633,52.65999984741211,51.970001220703125
"Jul 23, 2019",51.400001525878906,52.27000045776367,52.380001068115234,51.400001525878906
"Jul 24, 2019",52.33000183105469,51.560001373291016,52.650001525878906,51.470001220703125
"Jul 25, 2019",50.119998931884766,52.380001068115234,52.52000045776367,50.060001373291016
"Jul 26, 2019",50.0,50.79999923706055,50.810001373291016,49.93000030517578
"Jul 29, 2019",50.45000076293945,50.150001525878906,50.63999938964844,49.81999969482422
"Jul 30, 2019",49.939998626708984,50.220001220703125,50.70000076293945,49.11000061035156
"Jul 31, 2019",49.220001220703125,50.099998474121094,50.20000076293945,49.20000076293945
"Aug 01, 2019",48.75,49.79999923706055,50.470001220703125,48.689998626708984
"Aug 02, 2019",48.7599983215332,48.75,49.349998474121094,48.0
"Aug 05, 2019",47.849998474121094,47.7400016784668,48.7599983215332,47.41999816894531
"Aug 06, 2019",48.5,48.4900016784668,49.06999969482422,48.209999084472656
"Aug 07, 2019",48.45000076293945,48.29999923706055,48.779998779296875,47.54999923706055
"Aug 08, 2019",48.79999923706055,49.63999938964844,49.68000030517578,48.470001220703125
"Aug 09, 2019",48.650001525878906,48.86000061035156,49.18000030517578,48.29999923706055
"Aug 12, 2019",47.0,47.709999084472656,47.79999923706055,46.959999084472656
"Aug 13, 2019",47.54999923706055,46.939998626708984,48.25,46.790000915527344
"Aug 14, 2019",45.88999938964844,46.95000076293945,47.06999969482422,45.689998626708984
"Aug 15, 2019",45.849998474121094,46.150001525878906,46.63999938964844,45.25
"Aug 16, 2019",45.72999954223633,46.349998474121094,46.54999923706055,45.349998474121094
"Aug 19, 2019",44.83000183105469,46.0,46.689998626708984,44.72999954223633
"Aug 20, 2019",44.790000915527344,45.02000045776367,45.18000030517578,44.06999969482422
"Aug 21, 2019",47.349998474121094,45.869998931884766,47.459999084472656,45.7400016784668
"Aug 22, 2019",46.650001525878906,47.400001525878906,47.560001373291016,46.380001068115234
"Aug 23, 2019",44.95000076293945,46.099998474121094,46.540000915527344,44.720001220703125
"Aug 26, 2019",44.7400016784668,45.380001068115234,45.70000076293945,43.7599983215332
"Aug 27, 2019",44.380001068115234,45.349998474121094,45.599998474121094,43.439998626708984
"Aug 28, 2019",44.0099983215332,43.959999084472656,44.29999923706055,43.63999938964844
"Aug 29, 2019",45.08000183105469,44.209999084472656,45.220001220703125,44.029998779296875
"Aug 30, 2019",46.2400016784668,45.18000030517578,46.560001373291016,45.09000015258789
"Sep 02, 2019",45.650001525878906,46.2400016784668,46.790000915527344,45.400001525878906
"Sep 03, 2019",44.79999923706055,45.400001525878906,46.31999969482422,44.619998931884766
"Sep 04, 2019",45.86000061035156,45.380001068115234,45.93000030517578,44.97999954223633
"Sep 05, 2019",47.459999084472656,46.099998474121094,47.779998779296875,46.09000015258789
"Sep 06, 2019",49.38999938964844,47.900001525878906,49.38999938964844,47.900001525878906
"Sep 09, 2019",50.0,49.54999923706055,50.529998779296875,49.27000045776367
"Sep 10, 2019",49.15999984741211,50.349998474121094,50.5,48.880001068115234
"Sep 11, 2019",47.9900016784668,49.5,49.970001220703125,47.9900016784668
"Sep 12, 2019",48.0,48.31999969482422,48.369998931884766,47.400001525878906
"Sep 13, 2019",47.13999938964844,48.06999969482422,48.5,46.900001525878906
"Sep 16, 2019",46.650001525878906,47.040000915527344,47.560001373291016,46.29999923706055
"Sep 17, 2019",47.29999923706055,46.38999938964844,47.45000076293945,46.119998931884766
"Sep 18, 2019",48.02000045776367,47.459999084472656,48.25,47.15999984741211
"Sep 19, 2019",46.77000045776367,48.40999984741211,48.70000076293945,46.77000045776367
"Sep 20, 2019",47.5099983215332,47.0,47.97999954223633,46.900001525878906
"Sep 23, 2019",47.279998779296875,47.439998626708984,47.7400016784668,46.86000061035156
"Sep 24, 2019",45.84000015258789,47.38999938964844,47.560001373291016,45.599998474121094
"Sep 25, 2019",45.540000915527344,45.84000015258789,45.84000015258789,44.79999923706055
"Sep 26, 2019",45.709999084472656,45.790000915527344,46.209999084472656,45.209999084472656
"Sep 27, 2019",45.34000015258789,45.5,46.08000183105469,45.25
"Sep 30, 2019",45.4900016784668,45.5,45.900001525878906,45.47999954223633
"Oct 01, 2019",44.95000076293945,45.709999084472656,45.709999084472656,44.810001373291016
"Oct 02, 2019",43.41999816894531,44.61000061035156,44.61000061035156,43.36000061035156
"Oct 03, 2019",45.290000915527344,43.77000045776367,45.290000915527344,43.619998931884766
"Oct 04, 2019",45.599998474121094,45.369998931884766,45.599998474121094,44.619998931884766
"Oct 07, 2019",43.79999923706055,45.099998474121094,45.22999954223633,43.7599983215332
"Oct 08, 2019",43.0099983215332,44.20000076293945,44.33000183105469,43.0099983215332
"Oct 09, 2019",44.20000076293945,43.56999969482422,44.34000015258789,43.099998474121094
"Oct 10, 2019",44.400001525878906,44.290000915527344,44.81999969482422,44.02000045776367
"Oct 11, 2019",45.22999954223633,44.79999923706055,45.38999938964844,44.75
"Oct 14, 2019",45.0,45.2400016784668,45.560001373291016,44.83000183105469
"Oct 15, 2019",44.380001068115234,44.970001220703125,45.18000030517578,44.27000045776367
"Oct 16, 2019",45.0,44.400001525878906,45.36000061035156,43.900001525878906
"Oct 17, 2019",44.90999984741211,45.33000183105469,45.70000076293945,44.58000183105469
"Oct 18, 2019",46.060001373291016,46.0,46.54999923706055,45.5
"Oct 21, 2019",46.400001525878906,46.29999923706055,46.75,45.77000045776367
"Oct 22, 2019",47.400001525878906,46.5,47.66999816894531,46.439998626708984
"Oct 23, 2019",47.599998474121094,47.349998474121094,48.36000061035156,46.880001068115234
"Oct 24, 2019",47.29999923706055,47.7400016784668,48.08000183105469,46.709999084472656
"Oct 25, 2019",47.72999954223633,47.279998779296875,48.04999923706055,47.11000061035156
"Oct 28, 2019",48.790000915527344,47.849998474121094,48.790000915527344,47.70000076293945
"Oct 29, 2019",48.65999984741211,48.59000015258789,49.11000061035156,48.459999084472656
"Oct 30, 2019",49.41999816894531,48.61000061035156,49.41999816894531,47.529998779296875
"Oct 31, 2019",48.150001525878906,48.900001525878906,49.0,47.95000076293945
"Nov 01, 2019",47.959999084472656,48.439998626708984,48.79999923706055,47.45000076293945
"Nov 04, 2019",47.689998626708984,48.150001525878906,48.54999923706055,47.400001525878906
"Nov 05, 2019",47.9900016784668,47.79999923706055,48.45000076293945,47.630001068115234
"Nov 06, 2019",47.66999816894531,48.0,48.47999954223633,47.349998474121094
"Nov 07, 2019",47.66999816894531,48.04999923706055,48.47999954223633,47.459999084472656
"Nov 08, 2019",47.0,47.36000061035156,47.75,46.560001373291016
"Nov 11, 2019",47.2400016784668,46.7400016784668,47.43000030517578,46.40999984741211
"Nov 12, 2019",46.720001220703125,47.029998779296875,47.540000915527344,46.349998474121094
"Nov 13, 2019",45.95000076293945,46.43000030517578,46.689998626708984,45.810001373291016
"Nov 14, 2019",46.5099983215332,46.130001068115234,46.75,45.7599983215332
"Nov 18, 2019",46.529998779296875,47.0,47.150001525878906,46.0
"Nov 19, 2019",45.790000915527344,46.349998474121094,46.470001220703125,45.709999084472656
"Nov 21, 2019",46.380001068115234,45.75,46.4900016784668,45.650001525878906
"Nov 22, 2019",46.75,46.09000015258789,46.900001525878906,45.91999816894531
"Nov 25, 2019",46.599998474121094,46.7599983215332,46.939998626708984,46.27000045776367
"Nov 26, 2019",46.0,46.349998474121094,46.380001068115234,45.560001373291016
"Nov 27, 2019",47.34000015258789,46.20000076293945,47.380001068115234,45.4900016784668
"Nov 28, 2019",47.599998474121094,46.939998626708984,47.66999816894531,46.560001373291016
"Nov 29, 2019",47.810001373291016,47.63999938964844,47.9900016784668,47.40999984741211
"Dec 02, 2019",47.43000030517578,47.810001373291016,48.33000183105469,47.43000030517578
"Dec 03, 2019",48.38999938964844,48.13999938964844,48.689998626708984,47.95000076293945
"Dec 04, 2019",49.09000015258789,48.38999938964844,49.130001068115234,48.29999923706055
"Dec 05, 2019",48.66999816894531,49.15999984741211,49.27000045776367,48.310001373291016
"Dec 06, 2019",48.470001220703125,48.58000183105469,48.9900016784668,48.27000045776367
"Dec 09, 2019",48.619998931884766,48.349998474121094,48.95000076293945,48.310001373291016
"Dec 10, 2019",47.91999816894531,48.54999923706055,48.7400016784668,47.65999984741211
"Dec 11, 2019",47.849998474121094,48.04999923706055,48.369998931884766,47.560001373291016
"Dec 12, 2019",48.90999984741211,48.0,48.90999984741211,47.86000061035156
"Dec 13, 2019",48.529998779296875,48.86000061035156,49.5,48.36000061035156
"Dec 16, 2019",47.869998931884766,48.7599983215332,49.25,47.869998931884766
"Dec 17, 2019",48.95000076293945,48.13999938964844,48.95000076293945,47.91999816894531
"Dec 18, 2019",50.63999938964844,48.75,50.709999084472656,48.630001068115234
"Dec 19, 2019",51.15999984741211,50.29999923706055,51.15999984741211,50.08000183105469
"Dec 20, 2019",51.060001373291016,50.95000076293945,51.099998474121094,50.2400016784668
"Dec 23, 2019",52.599998474121094,50.959999084472656,52.599998474121094,50.7400016784668
"Dec 26, 2019",53.20000076293945,52.47999954223633,53.2599983215332,52.349998474121094
"Dec 27, 2019",52.970001220703125,53.349998474121094,53.66999816894531,52.2599983215332
"Dec 30, 2019",52.81999969482422,53.099998474121094,53.34000015258789,52.81999969482422
"Jan 02, 2020",53.79999923706055,53.349998474121094,53.970001220703125,53.16999816894531
"Jan 03, 2020",53.709999084472656,53.099998474121094,53.90999984741211,52.849998474121094
"Jan 06, 2020",53.0,53.400001525878906,53.400001525878906,52.45000076293945
"Jan 07, 2020",52.599998474121094,53.0,53.029998779296875,52.290000915527344
"Jan 08, 2020",52.119998931884766,52.7599983215332,52.9900016784668,52.040000915527344
"Jan 09, 2020",51.060001373291016,52.20000076293945,52.33000183105469,50.72999954223633
"Jan 10, 2020",49.86000061035156,51.15999984741211,51.439998626708984,49.560001373291016
"Jan 13, 2020",50.41999816894531,49.97999954223633,50.5,49.61000061035156
"Jan 14, 2020",50.150001525878906,50.279998779296875,50.4900016784668,49.75
"Jan 15, 2020",49.22999954223633,49.93000030517578,50.02000045776367,48.849998474121094
"Jan 16, 2020",49.45000076293945,49.470001220703125,49.779998779296875,48.97999954223633
"Jan 17, 2020",50.119998931884766,49.86000061035156,50.27000045776367,49.72999954223633
"Jan 20, 2020",49.79999923706055,50.0,50.349998474121094,49.27000045776367
"Jan 21, 2020",48.36000061035156,49.54999923706055,49.650001525878906,48.04999923706055
"Jan 22, 2020",48.7400016784668,48.810001373291016,48.9900016784668,48.290000915527344
"Jan 23, 2020",51.47999954223633,48.540000915527344,51.47999954223633,48.380001068115234
"Jan 24, 2020",50.79999923706055,51.400001525878906,51.47999954223633,50.79999923706055
"Jan 27, 2020",50.29999923706055,50.060001373291016,51.06999969482422,49.72999954223633
"Jan 28, 2020",50.709999084472656,50.79999923706055,51.150001525878906,50.08000183105469
"Jan 29, 2020",49.459999084472656,51.0,51.380001068115234,49.36000061035156
"Jan 30, 2020",49.79999923706055,48.70000076293945,49.9900016784668,48.369998931884766
"Jan 31, 2020",48.540000915527344,49.11000061035156,49.119998931884766,48.220001220703125
"Feb 03, 2020",48.779998779296875,48.54999923706055,49.13999938964844,48.0099983215332
"Feb 04, 2020",48.25,49.290000915527344,49.599998474121094,48.25
"Feb 05, 2020",50.400001525878906,49.20000076293945,51.290000915527344,49.099998474121094
"Feb 06, 2020",49.54999923706055,51.0,51.04999923706055,49.25
"Feb 07, 2020",49.599998474121094,49.54999923706055,50.31999969482422,49.2599983215332
"Feb 10, 2020",49.11000061035156,49.709999084472656,49.9900016784668,48.880001068115234
"Feb 11, 2020",51.31999969482422,49.91999816894531,51.650001525878906,49.68000030517578
"Feb 12, 2020",51.619998931884766,51.869998931884766,52.36000061035156,50.66999816894531
"Feb 13, 2020",50.81999969482422,51.349998474121094,51.540000915527344,50.45000076293945
"Feb 14, 2020",49.849998474121094,50.880001068115234,50.959999084472656,49.56999969482422
"Feb 17, 2020",49.099998474121094,50.08000183105469,50.2400016784668,49.099998474121094
"Feb 18, 2020",49.56999969482422,48.959999084472656,49.900001525878906,48.70000076293945
"Feb 19, 2020",49.689998626708984,49.5,50.33000183105469,49.150001525878906
"Feb 20, 2020",49.18000030517578,50.0,50.04999923706055,48.68000030517578
"Feb 21, 2020",49.220001220703125,48.810001373291016,49.220001220703125,48.33000183105469
"Feb 26, 2020",,,,
"Feb 27, 2020",45.790000915527344,44.79999923706055,47.59000015258789,44.380001068115234
"Feb 28, 2020",46.86000061035156,46.150001525878906,46.86000061035156,44.56999969482422
"Mar 02, 2020",47.150001525878906,46.81999969482422,47.4900016784668,46.29999923706055
"Mar 03, 2020",45.77000045776367,46.709999084472656,47.36000061035156,45.11000061035156
"Mar 04, 2020",45.81999969482422,46.45000076293945,46.689998626708984,45.0
"Mar 05, 2020",43.11000061035156,45.2599983215332,45.56999969482422,42.29999923706055
"Mar 06, 2020",42.29999923706055,41.79999923706055,42.720001220703125,41.2400016784668
"Mar 09, 2020",37.630001068115234,38.45000076293945,40.189998626708984,36.29999923706055
"Mar 10, 2020",39.61000061035156,39.52000045776367,40.689998626708984,37.630001068115234
"Mar 11, 2020",36.189998626708984,38.599998474121094,38.81999969482422,34.22999954223633
"Mar 12, 2020",31.25,29.200000762939453,31.950000762939453,26.559999465942383
"Mar 13, 2020",36.4900016784668,36.2400016784668,37.66999816894531,31.709999084472656
"Mar 16, 2020",30.399999618530273,30.5,32.79999923706055,29.549999237060547
"Mar 17, 2020",31.8700008392334,31.399999618530273,33.290000915527344,30.059999465942383
"Mar 18, 2020",26.610000610351562,29.170000076293945,30.15999984741211,25.31999969482422
"Mar 19, 2020",25.56999969482422,25.5,27.690000534057617,23.34000015258789
"Mar 20, 2020",24.600000381469727,27.0,27.899999618530273,24.329999923706055
"Mar 23, 2020",22.1299991607666,25.0,25.0,21.90999984741211
"Mar 24, 2020",25.920000076293945,24.200000762939453,26.479999542236328,23.799999237060547
"Mar 25, 2020",29.030000686645508,25.93000030517578,30.56999969482422,25.729999542236328
"Mar 26, 2020",30.489999771118164,29.34000015258789,31.670000076293945,29.280000686645508
"Mar 27, 2020",28.239999771118164,28.780000686645508,29.5,28.020000457763672
"Mar 30, 2020",28.989999771118164,28.899999618530273,29.459999084472656,28.309999465942383
"Mar 31, 2020",27.889999389648438,29.200000762939453,29.5,27.43000030517578
"Apr 01, 2020",26.709999084472656,26.899999618530273,27.280000686645508,26.049999237060547
"Apr 02, 2020",27.020000457763672,26.950000762939453,27.799999237060547,26.309999465942383
"Apr 03, 2020",25.5,26.850000381469727,26.889999389648438,25.0
"Apr 06, 2020",27.860000610351562,27.149999618530273,28.299999237060547,26.739999771118164
"Apr 07, 2020",29.170000076293945,29.450000762939453,30.5,29.170000076293945
"Apr 08, 2020",29.729999542236328,29.299999237060547,30.549999237060547,28.579999923706055
"Apr 09, 2020",29.649999618530273,30.34000015258789,30.8799991607666,29.459999084472656
"Apr 13, 2020",30.239999771118164,29.760000228881836,30.299999237060547,28.700000762939453
"Apr 14, 2020",30.209999084472656,30.940000534057617,31.649999618530273,30.0
"Apr 15, 2020",29.649999618530273,29.479999542236328,30.239999771118164,29.0
"Apr 16, 2020",28.799999237060547,30.100000381469727,30.3799991607666,28.799999237060547
"Apr 17, 2020",29.579999923706055,29.549999237060547,30.059999465942383,29.030000686645508
"Apr 20, 2020",28.989999771118164,29.0,29.489999771118164,28.520000457763672
"Apr 22, 2020",28.860000610351562,28.889999389648438,29.149999618530273,28.6299991607666
"Apr 23, 2020",28.049999237060547,29.200000762939453,29.6299991607666,27.610000610351562
"Apr 24, 2020",24.299999237060547,27.6299991607666,27.700000762939453,24.0
"Apr 27, 2020",25.690000534057617,25.5,26.200000762939453,25.110000610351562
"Apr 28, 2020",29.139999389648438,27.219999313354492,29.25,27.110000610351562
"Apr 29, 2020",29.559999465942383,30.040000915527344,30.209999084472656,28.729999542236328
"Apr 30, 2020",28.5,28.309999465942383,28.780000686645508,27.850000381469727
"May 04, 2020",27.760000228881836,27.3700008392334,27.760000228881836,26.989999771118164
"May 05, 2020",27.799999237060547,28.020000457763672,28.549999237060547,27.559999465942383
"May 06, 2020",26.989999771118164,27.959999084472656,28.1299991607666,26.75
"May 07, 2020",26.260000228881836,27.440000534057617,27.450000762939453,26.06999969482422
"May 08, 2020",27.100000381469727,27.100000381469727,27.709999084472656,26.799999237060547
"May 11, 2020",27.270000457763672,26.899999618530273,28.1299991607666,26.799999237060547
"May 12, 2020",26.309999465942383,27.440000534057617,27.549999237060547,26.260000228881836
"May 13, 2020",25.549999237060547,26.649999618530273,26.850000381469727,25.229999542236328
"May 14, 2020",26.649999618530273,25.0,26.799999237060547,24.75
"May 15, 2020",26.149999618530273,26.5,27.079999923706055,25.84000015258789
"May 18, 2020",27.399999618530273,27.1299991607666,27.780000686645508,26.649999618530273
"May 19, 2020",26.65999984741211,27.260000228881836,27.780000686645508,26.65999984741211
"May 20, 2020",27.329999923706055,27.0,27.639999389648438,26.770000457763672
"May 21, 2020",29.260000228881836,27.639999389648438,29.290000915527344,27.479999542236328
"May 22, 2020",28.510000228881836,28.860000610351562,29.149999618530273,27.90999984741211
"May 25, 2020",31.5,30.0,31.5,29.799999237060547
"May 26, 2020",30.790000915527344,32.5,32.93000030517578,30.229999542236328
"May 27, 2020",30.899999618530273,31.6299991607666,31.6299991607666,30.5
"May 28, 2020",30.790000915527344,30.610000610351562,31.459999084472656,30.209999084472656
"May 29, 2020",30.84000015258789,30.5,30.850000381469727,29.75
"Jun 01, 2020",31.799999237060547,30.770000457763672,32.150001525878906,30.559999465942383
"Jun 02, 2020",32.81999969482422,32.599998474121094,32.900001525878906,32.279998779296875
"Jun 03, 2020",34.75,34.470001220703125,35.0,33.84000015258789
"Jun 04, 2020",34.939998626708984,34.43000030517578,35.56999969482422,33.52000045776367
"Jun 05, 2020",35.20000076293945,37.40999984741211,38.16999816894531,35.0099983215332
"Jun 08, 2020",36.38999938964844,35.81999969482422,36.810001373291016,35.5
"Jun 09, 2020",35.790000915527344,35.540000915527344,37.08000183105469,35.119998931884766
"Jun 10, 2020",34.209999084472656,36.36000061035156,36.40999984741211,34.209999084472656
"Jun 12, 2020",33.349998474121094,33.0,33.880001068115234,32.810001373291016
"Jun 15, 2020",33.06999969482422,32.0,33.31999969482422,31.700000762939453
"Jun 16, 2020",33.5,34.5,34.66999816894531,33.099998474121094
"Jun 17, 2020",34.5,33.439998626708984,34.77000045776367,33.36000061035156
"Jun 18, 2020",34.400001525878906,34.18000030517578,35.130001068115234,33.79999923706055
"Jun 19, 2020",33.939998626708984,34.900001525878906,35.119998931884766,33.900001525878906
"Jun 22, 2020",33.2400016784668,34.209999084472656,34.41999816894531,33.0
"Jun 23, 2020",33.529998779296875,33.79999923706055,34.040000915527344,33.099998474121094
"Jun 24, 2020",32.220001220703125,33.34000015258789,33.599998474121094,31.90999984741211
"Jun 25, 2020",33.0099983215332,32.34000015258789,33.04999923706055,32.08000183105469
"Jun 26, 2020",31.81999969482422,32.650001525878906,32.880001068115234,31.81999969482422
"Jun 29, 2020",33.439998626708984,32.16999816894531,33.439998626708984,31.940000534057617
"Jun 30, 2020",32.150001525878906,33.209999084472656,33.220001220703125,32.02000045776367
"Jul 01, 2020",33.06999969482422,32.41999816894531,33.27000045776367,32.18000030517578
"Jul 02, 2020",33.15999984741211,33.630001068115234,34.2400016784668,33.0
"Jul 03, 2020",33.5,33.119998931884766,33.5,32.68000030517578
"Jul 06, 2020",34.66999816894531,34.36000061035156,34.9900016784668,34.06999969482422
"Jul 07, 2020",33.279998779296875,34.29999923706055,34.36000061035156,33.279998779296875
"Jul 08, 2020",34.09000015258789,33.709999084472656,34.20000076293945,33.52000045776367
"Jul 09, 2020",33.959999084472656,34.18000030517578,34.31999969482422,33.810001373291016
"Jul 10, 2020",34.13999938964844,33.88999938964844,34.34000015258789,33.54999923706055
"Jul 13, 2020",33.79999923706055,34.45000076293945,34.790000915527344,33.79999923706055
"Jul 14, 2020",34.349998474121094,33.83000183105469,34.40999984741211,33.5
"Jul 15, 2020",34.689998626708984,34.70000076293945,35.06999969482422,34.38999938964844
"Jul 16, 2020",34.400001525878906,34.40999984741211,34.560001373291016,34.08000183105469
"Jul 17, 2020",35.459999084472656,34.5,35.459999084472656,34.470001220703125
"Jul 20, 2020",35.31999969482422,35.4900016784668,35.68000030517578,34.869998931884766
"Jul 21, 2020",35.4900016784668,35.75,36.20000076293945,35.27000045776367
"Jul 22, 2020",35.20000076293945,35.650001525878906,35.689998626708984,34.709999084472656
"Jul 23, 2020",34.349998474121094,35.2599983215332,35.2599983215332,34.209999084472656
"Jul 24, 2020",33.95000076293945,34.0,34.619998931884766,33.650001525878906
"Jul 27, 2020",34.90999984741211,33.70000076293945,35.06999969482422,33.540000915527344
"Jul 28, 2020",35.029998779296875,34.70000076293945,35.779998779296875,34.54999923706055
"Jul 29, 2020",35.95000076293945,35.380001068115234,35.95000076293945,35.150001525878906
"Jul 30, 2020",34.79999923706055,35.119998931884766,35.540000915527344,34.52000045776367
"Jul 31, 2020",33.58000183105469,34.900001525878906,34.970001220703125,33.56999969482422
"Aug 03, 2020",34.349998474121094,34.2400016784668,35.040000915527344,33.779998779296875
"Aug 04, 2020",33.29999923706055,33.880001068115234,34.599998474121094,33.0099983215332
"Aug 05, 2020",33.33000183105469,33.810001373291016,33.970001220703125,32.900001525878906
"Aug 06, 2020",34.349998474121094,33.7599983215332,34.43000030517578,33.13999938964844
"Aug 07, 2020",34.11000061035156,34.0,34.939998626708984,33.599998474121094
"Aug 10, 2020",34.43000030517578,34.119998931884766,34.599998474121094,33.75
"Aug 11, 2020",33.93000030517578,34.599998474121094,34.88999938964844,33.900001525878906
"Aug 12, 2020",33.75,34.0,34.41999816894531,33.20000076293945
"Aug 13, 2020",33.06999969482422,33.88999938964844,34.400001525878906,33.04999923706055
"Aug 14, 2020",33.18000030517578,33.099998474121094,33.5,32.790000915527344
"Aug 17, 2020",32.33000183105469,33.16999816894531,33.349998474121094,31.889999389648438
"Aug 18, 2020",32.77000045776367,32.900001525878906,32.970001220703125,32.400001525878906
"Aug 19, 2020",32.619998931884766,32.849998474121094,32.970001220703125,32.52000045776367
"Aug 20, 2020",32.650001525878906,32.099998474121094,32.72999954223633,31.899999618530273
"Aug 21, 2020",32.95000076293945,32.5,33.08000183105469,32.33000183105469
"Aug 24, 2020",33.45000076293945,32.88999938964844,34.0,32.79999923706055
"Aug 25, 2020",33.25,33.779998779296875,33.95000076293945,33.04999923706055
"Aug 26, 2020",32.45000076293945,33.13999938964844,33.439998626708984,32.060001373291016
"Aug 27, 2020",32.75,32.5099983215332,33.439998626708984,32.36000061035156
"Aug 28, 2020",33.38999938964844,33.02000045776367,33.5099983215332,32.97999954223633
"Aug 31, 2020",32.650001525878906,33.38999938964844,33.38999938964844,32.650001525878906
