Date,Price,Open,High,Low,Change %
"Jan 01, 2020",1179.3,1179.3,1179.3,1179.3,"-3,95%"
"Jan 02, 2020",1182.57,1182.57,1182.57,1182.57,"0,28%"
"Jan 03, 2020",1181.09,1181.09,1181.09,1181.09,"-0,13%"
"Jan 05, 2020",1181.39,1181.39,1181.39,1181.39,"0,03%"
"Jan 06, 2020",1182.87,1182.87,1182.87,1182.87,"0,13%"
"Jan 07, 2020",1177.84,1177.84,1177.84,1177.84,"-0,43%"
"Jan 08, 2020",1181.69,1181.69,1181.69,1181.69,"0,33%"
"Jan 09, 2020",1180.81,1180.81,1180.81,1180.81,"-0,07%"
"Jan 10, 2020",1183.48,1183.48,1183.48,1183.48,"0,23%"
"Jan 12, 2020",1183.78,1183.78,1183.78,1183.78,"0,03%"
"Jan 13, 2020",1182.01,1182.01,1182.01,1182.01,"-0,15%"
"Jan 14, 2020",1184.09,1184.09,1184.09,1184.09,"0,18%"
"Jan 15, 2020",1187.35,1187.35,1187.35,1187.35,"0,28%"
"Jan 16, 2020",1187.06,1187.06,1187.06,1187.06,"-0,02%"
"Jan 17, 2020",1184.4,1184.4,1184.4,1184.4,"-0,22%"
"Jan 19, 2020",1184.7,1184.7,1184.7,1184.7,"0,03%"
"Jan 20, 2020",1185.29,1185.29,1185.29,1185.29,"0,05%"
"Jan 21, 2020",1186.18,1186.18,1186.18,1186.18,"0,08%"
"Jan 22, 2020",1187.67,1187.67,1187.67,1187.67,"0,13%"
"Jan 23, 2020",1185.61,1185.61,1185.61,1185.61,"-0,17%"
"Jan 24, 2020",1190.05,1190.05,1190.05,1190.05,"0,37%"
"Jan 26, 2020",1190.35,1190.35,1190.35,1190.35,"0,03%"
"Jan 27, 2020",1192.72,1192.72,1192.72,1192.72,"0,20%"
"Jan 28, 2020",1194.21,1194.21,1194.21,1194.21,"0,12%"
"Jan 29, 2020",1198.08,1198.08,1198.08,1198.08,"0,32%"
"Jan 30, 2020",1196,1196,1196,1196,"-0,17%"
"Jan 31, 2020",1195.7,1195.7,1195.7,1195.7,"-0,03%"
"Feb 02, 2020",1196,1196,1196,1196,"0,02%"
"Feb 03, 2020",1198.97,1198.97,1198.97,1198.97,"0,25%"
"Feb 04, 2020",1204.65,1204.65,1204.65,1204.65,"0,47%"
"Feb 05, 2020",1206.14,1206.14,1206.14,1206.14,"0,12%"
"Feb 06, 2020",1209.44,1209.44,1209.44,1209.44,"0,27%"
"Feb 07, 2020",1201.35,1201.35,1201.35,1201.35,"-0,67%"
"Feb 09, 2020",1201.65,1201.65,1201.65,1201.65,"0,02%"
"Feb 10, 2020",1204.03,1204.03,1204.03,1204.03,"0,20%"
"Feb 11, 2020",1208.52,1208.52,1208.52,1208.52,"0,37%"
"Feb 12, 2020",1210.01,1210.01,1210.01,1210.01,"0,12%"
"Feb 13, 2020",1206.71,1206.71,1206.71,1206.71,"-0,27%"
"Feb 14, 2020",1208.8,1208.8,1208.8,1208.8,"0,17%"
"Feb 16, 2020",1209.09,1209.09,1209.09,1209.09,"0,02%"
"Feb 17, 2020",1215.09,1215.09,1215.09,1215.09,"0,50%"
"Feb 18, 2020",1212.38,1212.38,1212.38,1212.38,"-0,22%"
"Feb 19, 2020",1211.47,1211.47,1211.47,1211.47,"-0,08%"
"Feb 20, 2020",1212.37,1212.37,1212.37,1212.37,"0,07%"
"Feb 21, 2020",1207.89,1207.89,1207.89,1207.89,"-0,37%"
"Feb 23, 2020",1208.18,1208.18,1208.18,1208.18,"0,02%"
"Feb 24, 2020",1208.18,1208.18,1208.18,1208.18,"0,00%"
"Feb 25, 2020",1208.18,1208.18,1208.18,1208.18,"0,00%"
"Feb 26, 2020",1211.16,1211.16,1211.16,1211.16,"0,25%"
"Feb 27, 2020",1200.19,1200.19,1200.19,1200.19,"-0,91%"
"Feb 28, 2020",1201.67,1201.67,1201.67,1201.67,"0,12%"
"Mar 01, 2020",1201.97,1201.97,1201.97,1201.97,"0,03%"
"Mar 02, 2020",1206.1,1206.1,1206.1,1206.1,"0,34%"
"Mar 03, 2020",1211.74,1211.74,1211.74,1211.74,"0,47%"
"Mar 04, 2020",1219.8,1219.8,1219.8,1219.8,"0,67%"
"Mar 05, 2020",1205.82,1205.82,1205.82,1205.82,"-1,15%"
"Mar 06, 2020",1207.29,1207.29,1207.29,1207.29,"0,12%"
"Mar 08, 2020",1207.59,1207.59,1207.59,1207.59,"0,02%"
"Mar 09, 2020",1195.86,1195.86,1195.86,1195.86,"-0,97%"
"Mar 10, 2020",1193.26,1193.26,1193.26,1193.26,"-0,22%"
"Mar 11, 2020",1176.34,1176.34,1176.34,1176.34,"-1,42%"
"Mar 12, 2020",1111.12,1111.12,1111.12,1111.12,"-5,54%"
"Mar 13, 2020",1132.19,1132.19,1132.19,1132.19,"1,90%"
"Mar 15, 2020",1132.52,1132.52,1132.52,1132.52,"0,03%"
"Mar 16, 2020",1099.84,1099.84,1099.84,1099.84,"-2,89%"
"Mar 17, 2020",1151.35,1151.35,1151.35,1151.35,"4,68%"
"Mar 18, 2020",1108.32,1151.68,1164.41,1108.32,"-3,74%"
"Mar 19, 2020",1072.4,1108.67,1108.67,1072.03,"-3,24%"
"Mar 20, 2020",1102.28,1072.4,1102.28,1072.4,"2,79%"
"Mar 22, 2020",1102.63,1102.63,1102.63,1102.63,"0,03%"
"Mar 23, 2020",1057.41,1102.63,1102.63,1057.04,"-4,10%"
"Mar 24, 2020",1061.8,1057.41,1062.17,1046.31,"0,42%"
"Mar 25, 2020",1088.02,1062.17,1088.38,1062.17,"2,47%"
"Mar 26, 2020",1130.94,1088.38,1131.28,1088.38,"3,95%"
"Mar 27, 2020",1135.55,1131.28,1145.79,1131.28,"0,41%"
"Mar 29, 2020",1135.89,1135.89,1135.89,1135.89,"0,03%"
"Mar 30, 2020",1157.04,1135.89,1157.37,1135.89,"1,86%"
"Mar 31, 2020",1162.32,1157.37,1162.65,1156.82,"0,46%"
"Apr 01, 2020",1151.68,1162.65,1162.65,1151.68,"-0,92%"
"Apr 02, 2020",1150.38,1152.01,1152.01,1147.67,"-0,11%"
"Apr 03, 2020",1145.3,1150.71,1150.71,1145.3,"-0,44%"
"Apr 05, 2020",1145.63,1145.63,1145.63,1145.63,"0,03%"
"Apr 06, 2020",1152.67,1133.85,1153,1133.85,"0,61%"
"Apr 07, 2020",1153.55,1153,1153.88,1142.73,"0,08%"
"Apr 08, 2020",1138.25,1153.88,1153.88,1138.25,"-1,33%"
"Apr 09, 2020",1165.7,1138.59,1166.02,1138.59,"2,41%"
"Apr 10, 2020",1164.92,1166.02,1166.02,1164.92,"-0,07%"
"Apr 13, 2020",1161.63,1164.92,1164.92,1161.63,"-0,28%"
"Apr 14, 2020",1171.87,1161.96,1172.19,1161.96,"0,88%"
"Apr 15, 2020",1181.66,1172.19,1181.98,1172.19,"0,84%"
"Apr 16, 2020",1192.11,1181.98,1192.43,1181.98,"0,88%"
"Apr 17, 2020",1197.54,1192.43,1197.54,1192.43,"0,45%"
"Apr 19, 2020",1197.85,1197.85,1197.85,1197.85,"0,03%"
"Apr 20, 2020",1195.57,1197.85,1199.56,1195.57,"-0,19%"
"Apr 21, 2020",1204.44,1195.88,1204.44,1195.88,"0,74%"
"Apr 22, 2020",1209.03,1204.44,1209.34,1204.44,"0,38%"
"Apr 23, 2020",1193.93,1209.34,1209.34,1193.93,"-1,25%"
"Apr 24, 2020",1185.8,1194.24,1194.24,1184.13,"-0,68%"
"Apr 26, 2020",1186.12,1186.12,1186.12,1186.12,"0,03%"
"Apr 27, 2020",1128.3,1186.12,1186.12,1111.26,"-4,87%"
"Apr 28, 2020",1144.44,1128.64,1144.78,1119.31,"1,43%"
"Apr 29, 2020",1159.8,1144.78,1160.13,1144.78,"1,34%"
"Apr 30, 2020",1173.77,1160.13,1179.84,1160.13,"1,20%"
"May 01, 2020",1177.95,1174.09,1177.95,1174.09,"0,36%"
"May 04, 2020",1162.08,1177.95,1177.95,1162.08,"-1,35%"
"May 05, 2020",1182.7,1162.42,1183.02,1162.42,"1,77%"
"May 06, 2020",1166,1183.02,1183.02,1166,"-1,41%"
"May 07, 2020",1175.06,1166.33,1182.23,1166.33,"0,78%"
"May 08, 2020",1172.1,1175.39,1175.39,1171.01,"-0,25%"
"May 10, 2020",1172.43,1172.43,1172.43,1172.43,"0,03%"
"May 11, 2020",1177.36,1172.43,1179.56,1172.43,"0,42%"
"May 12, 2020",1181.53,1177.68,1181.86,1177.68,"0,35%"
"May 13, 2020",1159.55,1181.86,1181.86,1159.55,"-1,86%"
"May 14, 2020",1148.17,1159.89,1159.89,1148.17,"-0,98%"
"May 15, 2020",1161.29,1148.51,1161.29,1148.51,"1,14%"
"May 17, 2020",1161.63,1161.63,1161.63,1161.63,"0,03%"
"May 18, 2020",1170.8,1161.63,1171.13,1161.63,"0,79%"
"May 19, 2020",1174.93,1171.13,1175.26,1171.13,"0,35%"
"May 20, 2020",1174.71,1175.26,1175.26,1173.63,"-0,02%"
"May 21, 2020",1173.41,1175.04,1178.31,1173.41,"-0,11%"
"May 22, 2020",1185.21,1173.74,1188.51,1173.74,"1,01%"
"May 24, 2020",1185.53,1185.53,1185.53,1185.53,"0,03%"
"May 25, 2020",1188.28,1185.53,1188.6,1185.53,"0,23%"
"May 26, 2020",1215.48,1188.6,1215.48,1188.6,"2,29%"
"May 27, 2020",1206.74,1211.25,1211.25,1206.74,"-0,72%"
"May 28, 2020",1210.99,1207.05,1213.82,1207.05,"0,35%"
"May 29, 2020",1210.74,1211.3,1211.3,1210.17,"-0,02%"
