result,data,num_ativos,lista_ativos,oper_ativos,volatilidade
1.1533915021170182,"Jul 01, 2011","13","['ITUB4', 'LREN3', 'TRPL4', 'SBSP3', 'RDCD3', 'BBDC4', 'LIGT3', 'CIEL3', 'SANB11', 'DTEX3', 'TIMP3', 'CSAN3', 'CMIG4']","[3.5, 2.0, 1.75, 1.5, 1.5, 1.25, 0.75, 0.75, 0.5, 0.375, 0.25, 0.25, 0.25]","0.001599245931128142"
1.015703795446838,"Mar 01, 2011","13","['JBSS3', 'PETR3', 'CCRO3', 'CPLE6', 'LIGT3', 'DTEX3', 'EMBR3', 'TRPL4', 'SBSP3', 'LREN3', 'BRKM5', 'MRFG3', 'SANB11']","[1.75, 1.375, 1.25, 1.0, 0.5, 0.5, 0.25, 0.0, 0.0, 0.0, 0.0, 0.0, 0.0]","0.001516183738715338"
0.9660099564497877,"Apr 04, 2011","13","['TRPL4', 'BRAP4', 'CSNA3', 'MMXM3', 'DTEX3', 'LREN3', 'TIMP3', 'CCRO3', 'USIM3', 'LIGT3', 'ELET6', 'CMIG4', 'RDCD3']","[2.0, 1.125, 1.0, 1.0, 0.375, 0.25, 0.25, 0.25, 0.25, 0.25, 0.25, 0.25, 0.25]","0.0017919994180672736"
0.9259527627011516,"Jan 03, 2011","13","['TRPL4', 'CCRO3', 'PETR3', 'ELET6', 'GOAU4', 'GFSA3', 'ITUB4', 'PDGR3', 'GGBR4', 'ITSA4', 'BRFS3', 'SBSP3', 'ABEV3']","[2.0, 2.0, 2.0, 1.75, 1.75, 1.75, 1.5, 1.5, 1.25, 1.0, 0.375, 0.25, 0.25]","0.0017742655974069125"
1.015026750964556,"Feb 01, 2011","13","['MMXM3', 'SBSP3', 'GOAU4', 'CMIG4', 'TIMP3', 'CESP6', 'EMBR3', 'ELET6', 'RDCD3', 'MRVE3', 'CYRE3', 'GGBR4', 'PDGR3']","[2.5, 1.0, 1.0, 0.5, 0.25, 0.25, 0.25, 0.0, 0.0, 0.0, 0.0, -0.125, -0.125]","9.563925249565866e-05"
0.9878436540210921,"May 02, 2011","13","['BBAS3', 'GOLL4', 'TIMP3', 'CCRO3', 'BRKM5', 'MRFG3', 'RSID3', 'PDGR3', 'BRAP4', 'ELET6', 'MRVE3', 'KLBN4', 'GFSA3']","[2.25, 0.5, 0.25, 0.25, 0.25, 0.25, 0.25, 0.25, 0.0, 0.0, 0.0, 0.0, 0.0]","0.0001704585291943338"
0.9797687350471398,"Jun 01, 2011","13","['LREN3', 'GOAU4', 'JBSS3', 'RDCD3', 'KLBN4', 'BRAP4', 'TRPL4', 'CPFE3', 'CSAN3', 'EMBR3', 'TIMP3', 'MRVE3', 'CIEL3']","[1.75, 1.75, 1.75, 1.5, 1.5, 1.125, 1.0, 1.0, 1.0, 1.0, 0.25, 0.25, 0.25]","0.001556042369108372"