result,data,num_ativos,lista_ativos,oper_ativos,volatilidade
0.9350430842534624,"Jan 04, 2010","9","['MMXM3', 'LAME4', 'VALE3', 'JBSS3', 'MRVE3', 'ITSA4', 'LREN3', 'GOLL4', 'DTEX3']","[2.0, 2.0, 1.75, 1.75, 1.75, 1.25, 1.25, 1.0, 0.5]","nan"
0.9937114639486095,"Feb 01, 2010","9","['USIM5', 'USIM3', 'BTOW3', 'ELET3', 'EMBR3', 'CSAN3', 'DTEX3', 'LREN3', 'BRKM5']","[1.75, 1.0, 0.375, 0.25, 0.25, 0.0, 0.0, -0.125, -0.125]","0.0007635776089333339"
1.0213164587374686,"Mar 01, 2010","9","['BBAS3', 'CSAN3', 'RDCD3', 'MMXM3', 'EMBR3', 'CPFE3', 'LIGT3', 'PETR4', 'GGBR4']","[2.0, 2.0, 1.5, 0.25, 0.25, 0.25, 0.25, 0.0, 0.0]","0.0004194722862215669"
0.9351568032403423,"Apr 01, 2010","9","['GGBR4', 'VALE3', 'USIM5', 'CSNA3', 'BRAP4', 'EMBR3', 'BRKM5', 'MMXM3', 'LAME4']","[1.75, 0.25, 0.25, 0.25, 0.25, 0.25, 0.25, 0.0, 0.0]","0.0006399096621649939"
0.9262420965643163,"May 03, 2010","9","['GGBR4', 'RDCD3', 'GOAU4', 'ABEV3', 'KLBN4', 'VALE3', 'PETR4', 'PETR3', 'ITSA4']","[0.0, 0.0, 0.0, 0.0, 0.0, -0.125, -0.25, -0.25, -0.25]","nan"
1.0655569790358514,"Jun 01, 2010","9","['RSID3', 'CSAN3', 'PDGR3', 'TRPL4', 'TIMP3', 'DTEX3', 'LIGT3', 'LREN3', 'CPFE3']","[1.75, 1.75, 1.75, 1.75, 1.75, 1.0, 0.75, 0.25, 0.25]","0.0033445067318018354"
1.093446591119169,"Jul 01, 2010","9","['KLBN4', 'PETR4', 'TRPL4', 'CPFE3', 'TIMP3', 'LAME4', 'CYRE3', 'JBSS3', 'PDGR3']","[2.0, 1.5, 0.25, 0.25, 0.25, 0.25, 0.25, 0.25, 0.25]","0.0037298424412698225"
0.9873424224085473,"Aug 02, 2010","9","['ELET3', 'CMIG4', 'DTEX3', 'GFSA3', 'ABEV3', 'CPFE3', 'BRKM5', 'RSID3', 'ITSA4']","[1.75, 1.25, 0.5, 0.375, 0.25, 0.25, 0.25, 0.25, 0.25]","0.0002788305565052034"
1.0875476821357997,"Sep 01, 2010","9","['BBDC4', 'PDGR3', 'BRAP4', 'GOLL4', 'VALE3', 'EMBR3', 'GGBR4', 'CSNA3', 'RDCD3']","[1.5, 0.25, 0.0, 0.0, 0.0, 0.0, 0.0, -0.125, -0.25]","0.000899848282343224"
1.0279277232176882,"Oct 01, 2010","9","['USIM3', 'BBAS3', 'CSNA3', 'PETR4', 'BRAP4', 'BBDC4', 'ITSA4', 'LREN3', 'CSAN3']","[2.0, 2.0, 2.0, 1.75, 1.25, 1.25, 1.25, 0.5, 0.25]","0.00018660176285611448"
0.9862523233214183,"Nov 01, 2010","9","['CCRO3', 'CPFE3', 'MRVE3', 'ABEV3', 'BRAP4', 'ELET6', 'DTEX3', 'ELET3', 'GOLL4']","[2.0, 1.25, 1.0, 0.25, 0.25, 0.25, 0.25, 0.25, 0.25]","nan"
1.036758481410903,"Dec 01, 2010","9","['USIM5', 'ABEV3', 'BTOW3', 'TIMP3', 'BRKM5', 'TRPL4', 'PETR3', 'LAME4', 'PETR4']","[0.5, 0.25, 0.25, 0.25, 0.25, 0.0, 0.0, 0.0, 0.0]","0.0030013071272118603"
0.9342629354096482,"Jan 03, 2011","9","['TRPL4', 'CCRO3', 'PETR3', 'PETR4', 'ELET6', 'GOAU4', 'GFSA3', 'ITUB4', 'PDGR3']","[2.0, 2.0, 2.0, 2.0, 1.75, 1.75, 1.75, 1.5, 1.5]","0.003375908526192698"
1.0181047288111882,"Feb 01, 2011","9","['MMXM3', 'SANB11', 'SBSP3', 'GOAU4', 'CMIG4', 'LREN3', 'BTOW3', 'TIMP3', 'CESP6']","[2.5, 1.625, 1.0, 1.0, 0.5, 0.375, 0.375, 0.25, 0.25]","0.00012085275926271292"
1.0044345308407927,"Mar 01, 2011","9","['JBSS3', 'PETR3', 'CCRO3', 'PETR4', 'CPLE6', 'LIGT3', 'DTEX3', 'EMBR3', 'TRPL4']","[1.75, 1.375, 1.25, 1.25, 1.0, 0.5, 0.5, 0.25, 0.0]","0.0029974223699234604"
0.9766736133283692,"Apr 04, 2011","9","['TRPL4', 'BRAP4', 'CSNA3', 'MMXM3', 'DTEX3', 'LREN3', 'TIMP3', 'CCRO3', 'USIM3']","[2.0, 1.125, 1.0, 1.0, 0.375, 0.25, 0.25, 0.25, 0.25]","0.0036550107093663454"
0.9823143923675522,"May 02, 2011","9","['BBAS3', 'JBSS3', 'GOLL4', 'USIM5', 'TIMP3', 'CCRO3', 'BRKM5', 'MRFG3', 'RSID3']","[2.25, 0.625, 0.5, 0.375, 0.25, 0.25, 0.25, 0.25, 0.25]","8.486949162727316e-05"
0.9872267527619384,"Jun 01, 2011","9","['LREN3', 'GOAU4', 'BBDC4', 'JBSS3', 'RDCD3', 'KLBN4', 'BRAP4', 'TRPL4', 'CPFE3']","[1.75, 1.75, 1.75, 1.75, 1.5, 1.5, 1.125, 1.0, 1.0]","0.003261359035022265"
1.2749110878487644,"Jul 01, 2011","9","['ITUB4', 'ITSA4', 'LREN3', 'TRPL4', 'SBSP3', 'RDCD3', 'BBDC4', 'LIGT3', 'CIEL3']","[3.5, 3.25, 2.0, 1.75, 1.5, 1.5, 1.25, 0.75, 0.75]","0.0034591720686340008"
0.9552424827190884,"Aug 01, 2011","9","['PETR4', 'CPFE3', 'PETR3', 'JBSS3', 'CPLE6', 'BRKM5', 'BRFS3', 'LREN3', 'GOAU4']","[3.5, 1.0, 1.0, 1.0, 0.625, 0.25, 0.25, -0.25, -0.25]","0.00013116686800948137"
0.9857186278908496,"Sep 01, 2016","9","['CESP6', 'BRFS3', 'VIVT4', 'KLBN11', 'BRKM5', 'GGBR4', 'QUAL3', 'GOAU4', 'CCRO3']","[1.0, 0.25, 0.25, 0.25, 0.25, 0.25, 0.25, 0.25, 0.0]","0.00024451853345845595"
1.0536635156429859,"Oct 03, 2016","9","['ABEV3', 'MULT3', 'CSNA3', 'BBDC4', 'BBSE3', 'SBSP3', 'LAME4', 'WEGE3', 'KLBN11']","[1.25, 1.25, 1.0, 0.25, 0.25, 0.25, 0.25, 0.25, 0.25]","0.0003150900923689336"
0.980893311991165,"Nov 01, 2016","9","['QUAL3', 'RENT3', 'CCRO3', 'CESP6', 'PETR4', 'VALE3', 'GGBR4', 'BRAP4', 'ECOR3']","[2.0, 1.5, 1.25, 1.25, 0.75, 0.375, 0.375, 0.375, 0.375]","0.0008092306055188239"
0.9647552122511156,"Dec 01, 2016","9","['VIVT4', 'HYPE3', 'UGPA3', 'BBAS3', 'SANB11', 'GGBR4', 'CSNA3', 'BRAP4', 'GOAU4']","[1.5, 1.0, 0.25, 0.25, 0.25, 0.25, 0.25, 0.25, 0.25]","0.0008973634932113439"
1.1274953930569462,"Jan 02, 2017","9","['QUAL3', 'ITUB4', 'BBDC4', 'BBDC3', 'LREN3', 'CYRE3', 'MRFG3', 'USIM5', 'BBAS3']","[2.0, 1.75, 1.75, 1.75, 1.75, 1.75, 1.75, 1.75, 1.5]","0.0005493908215127445"
1.0107250750028016,"Feb 01, 2017","9","['MRFG3', 'ITUB4', 'BBDC4', 'ABEV3', 'VALE3', 'BBAS3', 'VIVT4', 'JBSS3', 'BBDC3']","[1.0, 0.25, 0.25, 0.25, 0.25, 0.25, 0.25, 0.25, 0.25]","0.00032806124886412575"
0.9746265379746918,"Mar 01, 2017","9","['BBSE3', 'ABEV3', 'BBAS3', 'CMIG4', 'ITSA4', 'ITUB4', 'BBDC4', 'BBDC3', 'CCRO3']","[1.75, 0.5, 0.5, 0.5, 0.375, 0.25, 0.25, 0.25, 0.25]","0.00037822236706914385"
0.9874852088577553,"Apr 03, 2017","9","['BBAS3', 'BBDC4', 'PETR4', 'PETR3', 'SBSP3', 'PCAR4', 'EQTL3', 'CSAN3', 'ENBR3']","[2.0, 1.75, 1.75, 1.75, 1.75, 1.75, 1.5, 1.5, 1.5]","0.00045426721915540824"
0.9540970558685274,"May 02, 2017","9","['BBDC4', 'BBDC3', 'KLBN11', 'USIM5', 'ITSA4', 'BRFS3', 'BRKM5', 'WEGE3', 'JBSS3']","[3.25, 1.75, 1.75, 1.75, 1.5, 1.25, 1.25, 1.25, 1.0]","0.00023137103068675527"
1.0070643362672804,"Jun 01, 2017","9","['BRKM5', 'ENBR3', 'CPLE6', 'GOAU4', 'PETR3', 'KLBN11', 'UGPA3', 'CPFE3', 'QUAL3']","[1.75, 1.5, 1.5, 1.25, 1.0, 0.75, 0.25, 0.25, 0.25]","0.00016702017608198768"
1.0598237774956192,"Jul 03, 2017","9","['ECOR3', 'BBDC4', 'BRKM5', 'ITSA4', 'CCRO3', 'BBDC3', 'GOAU4', 'CSAN3', 'CYRE3']","[2.25, 2.0, 2.0, 1.75, 1.75, 1.75, 1.75, 1.5, 1.5]","0.0003171547113078859"
1.0453342217852968,"Aug 01, 2017","9","['PETR3', 'PCAR4', 'BBSE3', 'ITUB4', 'BBDC4', 'ABEV3', 'PETR4', 'ITSA4', 'BBAS3']","[1.75, 1.25, 0.75, 0.25, 0.25, 0.25, 0.25, 0.25, 0.25]","0.00015752130579681814"
1.009313300139894,"Sep 01, 2017","9","['ECOR3', 'RADL3', 'VALE3', 'RENT3', 'PETR4', 'CCRO3', 'BRAP4', 'BBDC4', 'ABEV3']","[1.75, 1.25, 0.75, 0.75, 0.5, 0.5, 0.375, 0.25, 0.25]","0.00018533074769935394"
1.00763066571584,"Oct 02, 2017","9","['BBAS3', 'JBSS3', 'ITUB4', 'BBDC4', 'PETR4', 'PETR3', 'BRFS3', 'UGPA3', 'VIVT4']","[0.75, 0.75, 0.25, 0.25, 0.25, 0.25, 0.25, 0.25, 0.25]","0.00011794735123188803"
0.918609383305372,"Nov 01, 2017","9","['ABEV3', 'WEGE3', 'PETR4', 'CPFE3', 'PETR3', 'UGPA3', 'BRML3', 'ELET3', 'ECOR3']","[1.0, 1.0, 0.5, 0.375, 0.25, 0.25, 0.25, 0.25, 0.25]","0.00012525328812396417"
1.0492889058390453,"Dec 01, 2017","9","['QUAL3', 'RADL3', 'ITSA4', 'BRFS3', 'MRFG3', 'CYRE3', 'GGBR4', 'ITUB4', 'ABEV3']","[0.625, 0.375, 0.25, 0.25, 0.25, 0.25, 0.125, 0.0, 0.0]","0.00012340205994019497"
1.0706791893830516,"Jan 02, 2018","9","['UGPA3', 'BRML3', 'CSNA3', 'IGTA3', 'CPFE3', 'EQTL3', 'FLRY3', 'QUAL3', 'ENBR3']","[2.0, 2.0, 2.0, 2.0, 2.0, 1.75, 1.75, 1.75, 1.75]","0.00011896786060522276"
0.9887619809769033,"Feb 01, 2018","9","['PCAR4', 'CPLE6', 'PETR4', 'PETR3', 'LREN3', 'LAME4', 'BRKM5', 'MULT3', 'CSAN3']","[1.25, 1.25, 0.25, 0.25, 0.25, 0.25, 0.25, 0.25, 0.25]","0.00015781517608453807"
0.9873094939439796,"Mar 01, 2018","9","['WEGE3', 'EQTL3', 'ABEV3', 'PETR4', 'PETR3', 'ITSA4', 'JBSS3', 'RAIL3', 'GGBR4']","[1.5, 0.75, 0.25, 0.25, 0.25, 0.25, 0.25, 0.25, 0.25]","0.0002823933519323129"
0.9802478518237814,"Apr 02, 2018","9","['EMBR3', 'CPFE3', 'BBSE3', 'EQTL3', 'TAEE11', 'IGTA3', 'ABEV3', 'PETR3', 'RENT3']","[1.75, 1.75, 1.5, 1.25, 1.25, 1.0, 0.25, 0.25, 0.25]","8.65429535182951e-05"
0.9084502102408067,"Sep 01, 2011","9","['CESP6', 'BRAP4', 'VALE3', 'BBDC4', 'ITUB4', 'ITSA4', 'PDGR3', 'PCAR4', 'LIGT3']","[1.75, 1.75, 1.75, 1.75, 1.75, 1.75, 1.75, 1.5, 1.5]","0.00017762298979227034"
1.0827766090021316,"Oct 03, 2011","9","['ITUB4', 'EMBR3', 'TRPL4', 'SBSP3', 'PCAR4', 'CESP6', 'LIGT3', 'LREN3', 'BRAP4']","[2.0, 0.25, 0.0, 0.0, 0.0, 0.0, 0.0, 0.0, 0.0]","0.003712972885154622"
0.9719397235592617,"Nov 01, 2011","9","['BBDC4', 'SBSP3', 'CPLE6', 'CCRO3', 'BRAP4', 'BTOW3', 'CSNA3', 'MMXM3', 'GGBR4']","[2.5, 2.0, 1.75, 1.75, 1.75, 1.5, 1.5, 1.5, 1.5]","0.0002701966357160135"
1.0017266937878997,"Dec 01, 2011","7","['TRPL4', 'USIM5', 'CPFE3', 'MRVE3', 'HYPE3', 'BRAP4', 'USIM3']","[1.0, 1.0, 0.25, 0.0, -0.25, -0.5, -1.625]","0.006295409921406225"
1.091647140179828,"Jan 02, 2012","9","['DTEX3', 'MMXM3', 'BBDC4', 'BBAS3', 'USIM5', 'ELET6', 'GFSA3', 'SBSP3', 'CPFE3']","[2.0, 1.75, 1.25, 1.0, 1.0, 0.75, 0.625, 0.25, 0.25]","0.00026804123305326354"
1.0950739045230289,"Feb 01, 2012","9","['CCRO3', 'BRKM5', 'BTOW3', 'HGTX3', 'BRML3', 'JBSS3', 'PCAR4', 'LREN3', 'CIEL3']","[2.0, 1.875, 1.75, 0.5, 0.5, 0.5, 0.25, 0.25, 0.25]","0.00012064998313740124"
1.0207918749179088,"Mar 01, 2012","9","['BBAS3', 'ITUB4', 'PCAR4', 'CPFE3', 'HGTX3', 'ABEV3', 'TRPL4', 'UGPA3', 'CPLE6']","[2.0, 0.75, 0.5, 0.5, 0.375, 0.375, 0.25, 0.25, 0.25]","0.003997613301609461"
1.0085634953039004,"Apr 02, 2012","9","['LAME4', 'SANB11', 'PETR4', 'CCRO3', 'SBSP3', 'PCAR4', 'UGPA3', 'VIVT4', 'ABEV3']","[1.5, 1.0, 0.75, 0.5, 0.25, 0.25, 0.25, 0.25, 0.25]","0.00030926051705953945"
0.8203001847274191,"May 02, 2012","9","['ELET6', 'BRML3', 'LAME4', 'RSID3', 'GGBR4', 'MRVE3', 'PDGR3', 'GFSA3', 'SBSP3']","[1.75, 1.75, 1.75, 1.75, 1.75, 0.75, 0.75, 0.625, 0.5]","0.0002603776968957773"
1.0287618633409703,"Jun 01, 2012","9","['GOLL4', 'RSID3', 'MRVE3', 'GFSA3', 'SANB11', 'CSNA3', 'SBSP3', 'LREN3', 'CCRO3']","[0.75, 0.625, 0.625, 0.625, 0.25, 0.25, 0.0, 0.0, 0.0]","0.0003538662855610891"
1.007617095794227,"Jul 02, 2012","9","['HYPE3', 'BRAP4', 'UGPA3', 'RDCD3', 'KLBN4', 'CCRO3', 'VALE3', 'VIVT4', 'ABEV3']","[1.75, 1.25, 0.25, 0.25, 0.25, 0.25, 0.25, 0.0, 0.0]","0.00019812987794754072"
1.0777291086112835,"Aug 01, 2012","8","['RENT3', 'GOAU4', 'KLBN4', 'USIM3', 'ABEV3', 'BTOW3', 'MRFG3', 'BBAS3']","[2.0, 2.0, 2.0, 1.75, 1.75, 1.75, 1.75, 1.75]","0.00012788542487487785"
1.098612060313323,"Sep 03, 2012","9","['PCAR4', 'USIM3', 'LREN3', 'RENT3', 'BRML3', 'BRFS3', 'BTOW3', 'MRFG3', 'BBAS3']","[0.75, 0.25, 0.25, 0.25, 0.25, 0.25, 0.25, 0.25, 0.25]","0.0001674946073100613"
1.0087612026003205,"Oct 01, 2012","8","['VALE3', 'UGPA3', 'HYPE3', 'CSAN3', 'DTEX3', 'BRKM5', 'LAME4', 'GOLL4']","[2.0, 1.25, 1.25, 0.25, 0.25, 0.25, 0.25, 0.25]","0.00017672939409256225"
1.044767119054368,"Nov 01, 2012","9","['CPFE3', 'BBDC4', 'ITSA4', 'VALE3', 'CYRE3', 'CPLE6', 'USIM3', 'EMBR3', 'BRFS3']","[2.0, 1.75, 1.75, 1.5, 1.0, 0.75, 0.75, 0.25, 0.25]","0.00012775684901642542"
1.0465935445257137,"Dec 03, 2012","9","['RENT3', 'BRML3', 'KLBN4', 'SANB11', 'VALE3', 'CYRE3', 'BRKM5', 'GOLL4', 'OIBR4']","[0.25, 0.0, 0.0, 0.0, 0.0, 0.0, -0.25, -0.25, -0.25]","0.00018522960841347048"
1.0098026953432329,"Dec 28, 2012","9","['SBSP3', 'CYRE3', 'TRPL4', 'OIBR3', 'UGPA3', 'CSNA3', 'USIM5', 'CPLE6', 'BRFS3']","[2.0, 2.0, 1.75, 1.5, 1.25, 1.25, 1.25, 0.75, 0.5]","0.002421655353924392"
0.9949201258078311,"Feb 01, 2013","9","['LREN3', 'TRPL4', 'SBSP3', 'UGPA3', 'ABEV3', 'ELET3', 'BRFS3', 'BRKM5', 'MRFG3']","[1.75, 0.25, 0.25, 0.25, 0.25, 0.25, 0.25, 0.25, 0.25]","0.0017988116211172"
0.9541081038799312,"Mar 01, 2013","9","['RENT3', 'ELET6', 'BRKM5', 'TIMP3', 'BRFS3', 'PDGR3', 'VIVT4', 'CIEL3', 'MRVE3']","[2.0, 2.0, 2.0, 2.0, 1.75, 1.75, 1.5, 1.375, 0.5]","0.00015064141823698522"
0.9788368554218508,"Mar 28, 2013","9","['USIM3', 'TIMP3', 'CESP6', 'BRFS3', 'PETR3', 'ELET3', 'PCAR4', 'VIVT4', 'BTOW3']","[2.25, 2.0, 1.75, 1.75, 1.75, 1.25, 0.25, 0.25, 0.25]","0.00011461226105008199"
0.9399038140145628,"Jan 02, 2015","9","['CPFE3', 'ECOR3', 'BBSE3', 'BRML3', 'UGPA3', 'HYPE3', 'ELET3', 'GOLL4', 'VALE3']","[2.0, 2.0, 1.75, 1.75, 1.5, 1.5, 1.5, 1.25, 1.0]","0.00023772827378849091"
1.1090462445207885,"Feb 02, 2015","9","['CIEL3', 'EMBR3', 'UGPA3', 'USIM5', 'ITSA4', 'VALE3', 'JBSS3', 'BRAP4', 'CYRE3']","[1.5, 1.5, 0.75, 0.625, 0.0, 0.0, 0.0, 0.0, 0.0]","6.542872171162967e-05"
0.9877245528639356,"Mar 02, 2015","9","['CMIG4', 'QUAL3', 'EVEN3', 'OIBR4', 'DTEX3', 'LREN3', 'PETR4', 'PETR3', 'VIVT4']","[1.75, 1.75, 1.5, 1.25, 1.25, 0.375, 0.25, 0.25, 0.25]","0.00023665882175428096"
1.1457287971926946,"Apr 01, 2015","9","['BRFS3', 'ELET3', 'BRPR3', 'GFSA3', 'ABEV3', 'PETR4', 'CIEL3', 'PETR3', 'UGPA3']","[1.75, 0.75, 0.5, 0.5, 0.25, 0.25, 0.25, 0.25, 0.25]","0.00025997188461034717"
0.919878505591377,"May 04, 2015","9","['BRKM5', 'PCAR4', 'TIMP3', 'BRFS3', 'BBAS3', 'ENBR3', 'ITUB4', 'BBDC4', 'PETR4']","[1.75, 1.25, 0.625, 0.5, 0.5, 0.375, 0.25, 0.25, 0.25]","0.00023512757818025252"
1.0471152399509207,"Jun 01, 2015","9","['EMBR3', 'TIMP3', 'MRFG3', 'HYPE3', 'ABEV3', 'VALE3', 'PETR3', 'BBAS3', 'CMIG4']","[1.75, 1.5, 1.5, 0.25, 0.0, 0.0, 0.0, 0.0, 0.0]","0.00022545514791641743"
0.9663754817805091,"Jul 01, 2015","9","['VIVT4', 'MRVE3', 'UGPA3', 'TIMP3', 'MRFG3', 'ITUB4', 'BBDC4', 'ABEV3', 'PETR3']","[1.75, 1.75, 0.625, 0.25, 0.25, 0.0, 0.0, 0.0, 0.0]","0.0001632090972775828"
0.9158394264210638,"Aug 03, 2015","9","['VALE3', 'PCAR4', 'KLBN11', 'BRPR3', 'ENBR3', 'CIEL3', 'VIVT4', 'BBDC3', 'LAME4']","[1.75, 1.5, 0.25, 0.25, 0.25, 0.0, 0.0, 0.0, 0.0]","7.111731575341802e-05"
1.0569623685229526,"Sep 01, 2015","9","['CMIG4', 'MRFG3', 'OIBR4', 'BRFS3', 'KLBN11', 'CIEL3', 'JBSS3', 'EMBR3', 'VIVT4']","[0.75, 0.25, 0.25, 0.0, 0.0, -0.25, -0.25, -0.25, -0.25]","4.6543239416394504e-05"
1.0286871728249096,"Oct 01, 2015","9","['BRFS3', 'CPLE6', 'BBDC4', 'ITSA4', 'BBSE3', 'BBDC3', 'SANB11', 'BRML3', 'GFSA3']","[1.0, 1.0, 0.75, 0.75, 0.75, 0.75, 0.75, 0.75, 0.625]","0.0002836579895135543"
1.024780740375573,"Nov 03, 2015","9","['CESP6', 'ENBR3', 'POMO4', 'ITSA4', 'BBAS3', 'HYPE3', 'BRKM5', 'BRPR3', 'ITUB4']","[1.75, 1.5, 1.25, 1.0, 0.25, 0.25, 0.25, 0.25, 0.0]","0.00021778785880524076"
0.9434566159938891,"Dec 01, 2015","9","['ITUB4', 'GOAU4', 'SBSP3', 'PCAR4', 'HYPE3', 'KLBN11', 'SANB11', 'BRML3', 'CPFE3']","[1.75, 0.75, 0.5, 0.25, 0.25, 0.25, 0.25, 0.25, 0.25]","0.00023791043574394682"
0.926208514296692,"Jan 04, 2016","9","['JBSS3', 'VALE3', 'CSAN3', 'MRFG3', 'USIM5', 'SBSP3', 'MRVE3', 'SANB11', 'ABEV3']","[1.75, 1.75, 1.75, 1.0, 0.75, 0.5, 0.5, 0.25, -0.25]","0.00013530342158542616"
1.1229087728234033,"Feb 01, 2016","9","['VIVT4', 'CESP6', 'CSAN3', 'HYPE3', 'SBSP3', 'USIM5', 'BBDC3', 'CSNA3', 'MRFG3']","[1.75, 1.75, 1.5, 1.0, 0.75, 0.375, -0.25, -0.25, -0.25]","0.0002471787561895226"
1.1877254025597885,"Mar 01, 2016","9","['LAME4', 'TIMP3', 'ECOR3', 'BRAP4', 'BRFS3', 'BBAS3', 'ITUB4', 'BBSE3', 'KLBN11']","[2.25, 2.0, 2.0, 1.75, 1.5, 1.5, 1.25, 1.25, 1.25]","0.00028769584505565043"
1.0196999519637855,"Apr 01, 2016","9","['WEGE3', 'OIBR3', 'ABEV3', 'UGPA3', 'RADL3', 'CSAN3', 'MULT3', 'ITUB4', 'BBDC4']","[2.0, 0.75, 0.375, 0.375, 0.375, 0.375, 0.375, 0.25, 0.25]","0.0002505712243847193"
0.8297367135949439,"May 02, 2016","9","['ENBR3', 'CPFE3', 'PCAR4', 'BBDC4', 'PETR4', 'PETR3', 'VALE3', 'BBAS3', 'BBDC3']","[1.5, 1.25, 0.5, 0.25, 0.25, 0.25, 0.25, 0.25, 0.25]","0.0007073111650783036"
1.2238210645561922,"Jun 01, 2016","9","['ABEV3', 'PCAR4', 'ELET3', 'OIBR3', 'JBSS3', 'KLBN11', 'RADL3', 'EQTL3', 'CSAN3']","[2.0, 1.375, 1.25, 1.0, 0.25, 0.25, 0.25, 0.25, 0.25]","0.0001358799394852803"
1.203481537142556,"Jul 01, 2016","9","['CIEL3', 'CCRO3', 'USIM5', 'CMIG4', 'MULT3', 'LREN3', 'SBSP3', 'CPFE3', 'QUAL3']","[2.0, 2.0, 2.0, 1.875, 1.75, 0.25, 0.25, 0.25, 0.25]","0.00043417165789035153"
0.9853444294840729,"Aug 01, 2016","9","['WEGE3', 'EQTL3', 'VIVT4', 'BBAS3', 'LREN3', 'BRML3', 'CPFE3', 'CMIG4', 'TIMP3']","[0.5, 0.375, 0.25, 0.25, 0.25, 0.25, 0.25, 0.25, 0.25]","0.0003601594242222309"
0.9397110791200672,"May 02, 2013","9","['VALE3', 'BRAP4', 'UGPA3', 'RENT3', 'BRML3', 'KLBN4', 'GOLL4', 'RSID3', 'PETR3']","[1.75, 1.0, 0.5, 0.0, 0.0, 0.0, 0.0, 0.0, 0.0]","9.676396040450352e-05"
0.917588980876768,"Jun 03, 2013","9","['CIEL3', 'CSNA3', 'BBDC4', 'ITUB4', 'ELET6', 'TIMP3', 'USIM5', 'GGBR4', 'UGPA3']","[1.25, 0.625, 0.25, 0.25, 0.0, 0.0, 0.0, -0.25, -1.75]","4.210930913235414e-05"
1.0125060113356246,"Jul 01, 2013","9","['BRKM5', 'MMXM3', 'LREN3', 'EMBR3', 'MRFG3', 'CPLE6', 'RENT3', 'LIGT3', 'CPFE3']","[1.75, 1.75, 0.75, 0.25, 0.0, -0.25, -0.25, -0.25, -0.25]","7.584818438673423e-05"
1.0655867097306442,"Aug 01, 2013","9","['KLBN4', 'MMXM3', 'BBDC3', 'CESP6', 'LIGT3', 'CPFE3', 'BRAP4', 'VALE3', 'HYPE3']","[3.5, 2.125, 2.0, 1.75, 1.25, 1.25, 1.25, 1.25, 1.25]","0.00014657649292341732"
1.061805098181322,"Sep 02, 2013","9","['BTOW3', 'BRAP4', 'CIEL3', 'ELET3', 'MRVE3', 'USIM5', 'ITUB4', 'ITSA4', 'LREN3']","[1.25, 0.25, 0.25, 0.25, 0.25, 0.25, 0.0, 0.0, -0.25]","0.0002283974564810924"
1.0448887790014671,"Oct 01, 2013","9","['TRPL4', 'LIGT3', 'CPLE6', 'CSAN3', 'USIM3', 'DTEX3', 'ENBR3', 'GOLL4', 'ELET3']","[1.75, 1.75, 0.25, 0.25, 0.25, 0.25, 0.25, 0.25, 0.25]","0.00021674755786201002"
0.9780058059603833,"Nov 01, 2013","9","['LREN3', 'USIM5', 'CSAN3', 'UGPA3', 'RENT3', 'LIGT3', 'BTOW3', 'DTEX3', 'BRKM5']","[1.75, 1.0, 0.25, 0.25, 0.25, 0.25, 0.25, 0.25, 0.25]","0.00015090029028212698"
1.0127005755545264,"Dec 02, 2013","9","['CMIG4', 'CPFE3', 'CCRO3', 'ABEV3', 'LIGT3', 'CIEL3', 'BRKM5', 'JBSS3', 'USIM5']","[1.75, 1.0, 0.75, 0.25, 0.25, 0.25, 0.25, 0.25, 0.25]","7.39143640471815e-05"
0.9424005243773896,"Jan 02, 2014","9","['BRPR3', 'GOAU4', 'GGBR4', 'BRKM5', 'RENT3', 'ABEV3', 'ELET6', 'OIBR4', 'LREN3']","[2.0, 2.0, 1.75, 1.75, 1.75, 1.5, 1.5, 1.25, 1.0]","0.0001836385264726117"
0.9550730945431704,"Feb 03, 2014","9","['USIM5', 'BRML3', 'HYPE3', 'LIGT3', 'KLBN4', 'DASA3', 'BTOW3', 'OIBR3', 'PDGR3']","[0.75, 0.625, 0.625, 0.5, 0.25, 0.25, 0.25, 0.25, 0.0]","0.0003042969327589858"
1.057215749518548,"Mar 05, 2014","9","['GFSA3', 'MRFG3', 'ITSA4', 'BRAP4', 'GGBR4', 'GOAU4', 'DASA3', 'CESP6', 'BTOW3']","[1.75, 1.75, 1.0, 1.0, 0.75, 0.75, 0.25, 0.25, 0.25]","0.00017235387175058977"
0.9636272390992462,"Apr 01, 2014","9","['VIVT4', 'MRVE3', 'LIGT3', 'CPFE3', 'CYRE3', 'DASA3', 'CSAN3', 'USIM3', 'CPLE6']","[1.875, 1.75, 1.75, 1.75, 1.5, 1.5, 1.5, 1.5, 1.375]","0.00014516987426800446"
0.9707796158920577,"May 02, 2014","9","['TIMP3', 'OIBR4', 'PETR4', 'BBDC4', 'BBAS3', 'ITSA4', 'PETR3', 'CCRO3', 'BRFS3']","[3.0, 0.625, 0.25, 0.25, 0.25, 0.25, 0.25, 0.25, 0.25]","0.00020426958699072226"
1.021332477424211,"Jun 02, 2014","9","['BBDC3', 'USIM5', 'LREN3', 'DTEX3', 'USIM3', 'CIEL3', 'HYPE3', 'SANB11', 'SBSP3']","[1.0, 0.75, 0.75, 0.75, 0.625, 0.25, 0.25, 0.25, 0.25]","0.00017586866591785586"
1.005861244105241,"Jul 01, 2014","9","['VALE3', 'RSID3', 'ELET6', 'CIEL3', 'BBSE3', 'BBAS3', 'CCRO3', 'CMIG4', 'TIMP3']","[1.75, 1.5, 1.25, 0.375, 0.25, 0.25, 0.25, 0.25, 0.25]","0.00010824842087346638"
1.0467460937912372,"Aug 01, 2014","9","['EGIE3', 'ECOR3', 'MMXM3', 'VIVT4', 'RSID3', 'BBDC4', 'BBDC3', 'ELET6', 'MRFG3']","[1.75, 0.75, 0.75, 0.5, 0.375, 0.25, 0.25, 0.25, 0.25]","0.0002450284296435618"
0.9187377160123023,"Sep 01, 2014","9","['TIMP3', 'RSID3', 'CPFE3', 'BRPR3', 'MRVE3', 'BRML3', 'PCAR4', 'EMBR3', 'SANB11']","[1.0, 1.0, 0.5, 0.5, 0.5, 0.375, 0.25, 0.25, 0.25]","9.489972631966634e-05"
0.9715782940952469,"Oct 01, 2014","9","['EVEN3', 'EMBR3', 'SANB11', 'TIMP3', 'OIBR4', 'BRKM5', 'PETR4', 'PETR3', 'JBSS3']","[1.0, 0.25, 0.25, 0.25, 0.25, 0.25, 0.0, 0.0, 0.0]","8.970501376520302e-05"
1.0930167670372681,"Nov 03, 2014","9","['BBSE3', 'QUAL3', 'MMXM3', 'ITUB4', 'PETR4', 'BBDC4', 'PETR3', 'ITSA4', 'BBAS3']","[1.75, 1.75, 0.75, -0.25, -0.25, -0.25, -0.25, -0.25, -0.25]","0.00025067641669864203"
0.9240711785844663,"Dec 01, 2014","9","['EVEN3', 'EGIE3', 'LIGT3', 'PCAR4', 'BBDC3', 'SBSP3', 'MRVE3', 'CMIG4', 'BRAP4']","[2.5, 2.0, 2.0, 1.75, 1.75, 1.75, 1.75, 1.5, 1.5]","0.00015444133267551797"
0.9207218154807932,"May 02, 2018","9","['TAEE11', 'ITSA4', 'CSAN3', 'CPLE6', 'SMLS3', 'VALE3', 'PETR3', 'PCAR4', 'GGBR4']","[2.0, 1.75, 1.75, 1.5, 1.0, 0.375, 0.25, 0.25, 0.25]","0.0001324689810148765"
1.0085086928184612,"Jun 01, 2018","9","['BBDC3', 'WEGE3', 'SUZB3', 'MGLU3', 'JBSS3', 'RAIL3', 'GGBR4', 'BRKM5', 'ITSA4']","[0.375, 0.25, 0.25, 0.25, 0.0, 0.0, 0.0, 0.0, -0.25]","0.000424875597943004"
1.0860276751030307,"Jul 02, 2018","9","['PETR4', 'PETR3', 'BBAS3', 'CIEL3', 'RAIL3', 'BRML3', 'QUAL3', 'IGTA3', 'CMIG4']","[1.75, 1.75, 1.75, 1.75, 1.75, 1.75, 1.75, 1.75, 1.5]","0.00013781801054838313"
0.9362446404690299,"Aug 01, 2018","9","['CVCB3', 'MRFG3', 'VALE3', 'EQTL3', 'BRAP4', 'CSNA3', 'GGBR4', 'BBDC4', 'PETR4']","[2.0, 1.75, 1.25, 1.25, 1.25, 1.25, 0.75, 0.25, 0.25]","0.0002608192905619893"
0.9974609145548732,"Sep 03, 2018","9","['UGPA3', 'ELET3', 'EMBR3', 'KLBN11', 'VALE3', 'BRKM5', 'PCAR4', 'GOAU4', 'ABEV3']","[1.25, 0.75, 0.5, 0.5, 0.25, 0.25, 0.25, 0.25, 0.0]","7.639794310152863e-05"
1.1811638952018453,"Oct 01, 2018","9","['JBSS3', 'RAIL3', 'GGBR4', 'EQTL3', 'BBSE3', 'MGLU3', 'ELET3', 'CYRE3', 'VALE3']","[2.0, 1.875, 1.75, 1.75, 1.5, 1.5, 1.5, 1.5, 0.25]","0.00013269375140930983"
1.017591521313286,"Nov 01, 2018","9","['BBSE3', 'EQTL3', 'QUAL3', 'CYRE3', 'PETR4', 'PETR3', 'B3SA3', 'RAIL3', 'JBSS3']","[0.5, 0.5, 0.5, 0.375, 0.25, 0.25, 0.25, 0.25, 0.25]","0.00019373250623403484"
0.9297342150498991,"Dec 03, 2018","9","['BRKM5', 'TIMP3', 'SANB11', 'FLRY3', 'PCAR4', 'SBSP3', 'GGBR4', 'GOAU4', 'RADL3']","[2.0, 2.0, 1.75, 1.75, 1.375, 1.25, 1.0, 1.0, 0.75]","7.618279579321916e-05"
1.1194934336492586,"Dec 28, 2018","9","['BBAS3', 'LREN3', 'BRKM5', 'MGLU3', 'SBSP3', 'CVCB3', 'TAEE11', 'CYRE3', 'SMLS3']","[2.0, 1.25, 0.875, 0.375, 0.25, 0.25, 0.25, 0.25, 0.25]","0.00018142639126007265"
0.9848567927656962,"Feb 01, 2019","9","['BRKM5', 'MRFG3', 'RADL3', 'VIVT4', 'CPLE6', 'EGIE3', 'UGPA3', 'BRML3', 'PETR4']","[2.0, 2.0, 1.75, 1.25, 1.25, 0.75, 0.375, 0.375, 0.25]","6.754011072417041e-05"
0.9666777322598495,"Mar 01, 2019","9","['CIEL3', 'BTOW3', 'MGLU3', 'RADL3', 'CVCB3', 'USIM5', 'RENT3', 'CSAN3', 'VALE3']","[2.0, 1.75, 1.5, 1.5, 1.0, 1.0, 0.25, 0.25, 0.0]","0.00011176295087473985"
1.017829934088457,"Apr 01, 2019","9","['MRFG3', 'BBDC4', 'BBDC3', 'SANB11', 'EGIE3', 'UGPA3', 'WEGE3', 'QUAL3', 'PETR4']","[2.0, 0.75, 0.75, 0.75, 0.75, 0.5, 0.5, 0.5, 0.25]","0.0001632972427410931"
1.0490033350441956,"May 02, 2019","9","['ITUB4', 'KLBN11', 'IGTA3', 'CPLE6', 'HYPE3', 'TAEE11', 'ITSA4', 'BBDC3', 'RENT3']","[1.75, 1.75, 1.75, 1.75, 1.5, 1.25, 1.0, 0.5, 0.5]","0.00021666038617336968"
1.0684470524186873,"Jun 03, 2019","9","['MGLU3', 'RADL3', 'CSNA3', 'CYRE3', 'VVAR3', 'SANB11', 'EMBR3', 'GOLL4', 'CMIG4']","[1.75, 1.75, 1.75, 1.75, 1.75, 1.5, 1.5, 1.25, 1.0]","0.0001734828531560773"
0.9548789236007417,"Jul 01, 2019","9","['UGPA3', 'PCAR4', 'QUAL3', 'ECOR3', 'ITUB4', 'VALE3', 'BBDC4', 'PETR4', 'PETR3']","[1.75, 0.75, 0.75, 0.5, 0.25, 0.25, 0.25, 0.25, 0.25]","0.00019003376446975816"
0.9912457157952922,"Aug 01, 2019","9","['PCAR4', 'MRVE3', 'UGPA3', 'BBSE3', 'ABEV3', 'JBSS3', 'VIVT4', 'RADL3', 'SBSP3']","[2.0, 2.0, 1.0, 1.0, 0.25, 0.25, 0.25, 0.25, 0.25]","0.0002119727994656178"
1.0229834850719355,"Sep 02, 2019","9","['FLRY3', 'BBSE3', 'HYPE3', 'JBSS3', 'RADL3', 'CCRO3', 'ELET3', 'ELET6', 'BTOW3']","[2.0, 1.75, 1.0, 0.25, 0.25, 0.25, 0.25, 0.25, 0.25]","0.000339848937067529"
1.0035480496754343,"Oct 01, 2019","9","['VVAR3', 'MULT3', 'CYRE3', 'IGTA3', 'TIMP3', 'ITUB4', 'ABEV3', 'WEGE3', 'LREN3']","[2.0, 1.75, 1.75, 1.75, 1.5, 1.25, 1.25, 1.25, 1.0]","0.0002711139921763465"
1.0085853992897396,"Nov 01, 2019","9","['PETR3', 'EQTL3', 'CCRO3', 'RADL3', 'ELET6', 'B3SA3', 'UGPA3', 'SBSP3', 'IRBR3']","[2.0, 1.5, 1.0, 0.75, 0.5, 0.25, 0.25, 0.25, 0.25]","0.00024144044529180066"