﻿"Date","Price","Open","High","Low","Vol.","Change %"
"Apr 20, 2015","4.00","4.19","4.19","3.97","2.42M","-2.44%"
"Apr 22, 2015","4.10","4.01","4.16","4.01","1.61M","2.50%"
"Apr 23, 2015","4.25","4.10","4.25","4.08","1.39M","3.66%"
"Apr 24, 2015","4.19","4.26","4.31","4.16","2.01M","-1.41%"
"Apr 27, 2015","4.15","4.20","4.22","4.09","1.13M","-0.95%"
"Apr 28, 2015","4.10","4.19","4.19","4.05","1.19M","-1.20%"
"Apr 29, 2015","4.07","4.06","4.11","4.05","760.60K","-0.73%"
"Apr 30, 2015","4.24","4.05","4.24","4.05","1.45M","4.18%"
"May 04, 2015","4.31","4.21","4.35","4.19","1.30M","1.65%"
"May 05, 2015","4.74","4.30","4.81","4.25","3.11M","9.98%"
"May 06, 2015","4.50","4.73","5.09","4.50","4.16M","-5.06%"
"May 07, 2015","4.36","4.53","4.73","4.36","3.57M","-3.11%"
"May 08, 2015","4.40","4.36","4.49","4.24","4.03M","0.92%"
"May 11, 2015","4.38","4.38","4.47","4.25","2.19M","-0.45%"
"May 12, 2015","4.25","4.40","4.42","4.24","1.94M","-2.97%"
"May 13, 2015","4.07","4.27","4.28","4.07","2.17M","-4.24%"
"May 14, 2015","4.07","4.10","4.26","4.07","2.65M","0.00%"
"May 15, 2015","4.08","4.10","4.14","4.08","1.50M","0.25%"
"May 18, 2015","4.04","4.10","4.11","4.01","1.73M","-0.98%"
"May 19, 2015","4.17","4.07","4.20","4.04","3.44M","3.22%"
"May 20, 2015","4.20","4.31","4.38","4.12","7.21M","0.72%"
"May 21, 2015","4.30","4.22","4.30","4.06","6.71M","2.38%"
"May 22, 2015","4.24","4.29","4.31","4.18","3.02M","-1.40%"
"May 25, 2015","4.14","4.26","4.26","4.14","1.24M","-2.36%"
"May 26, 2015","4.20","4.15","4.26","4.06","3.16M","1.45%"
"May 27, 2015","4.21","4.24","4.24","4.09","3.27M","0.24%"
"May 28, 2015","4.19","4.16","4.25","4.12","1.80M","-0.48%"
"May 29, 2015","4.07","4.20","4.22","4.07","2.39M","-2.86%"
"Jun 01, 2015","4.06","4.07","4.13","4.04","2.44M","-0.25%"
"Jun 02, 2015","4.05","4.06","4.08","4.02","4.20M","-0.25%"
"Jun 03, 2015","4.01","4.05","4.07","3.98","1.96M","-0.99%"
"Jun 05, 2015","4.01","3.98","4.03","3.98","1.66M","0.00%"
"Jun 08, 2015","3.86","4.04","4.05","3.85","3.43M","-3.74%"
"Jun 09, 2015","3.90","3.86","3.92","3.79","4.52M","1.04%"
"Jun 10, 2015","3.90","3.94","3.97","3.82","2.65M","0.00%"
"Jun 11, 2015","4.05","3.95","4.18","3.90","7.93M","3.85%"
"Jun 12, 2015","4.09","4.07","4.10","3.98","2.64M","0.99%"
"Jun 15, 2015","4.25","4.06","4.26","4.02","3.52M","3.91%"
"Jun 16, 2015","4.50","4.25","4.57","4.18","3.67M","5.88%"
"Jun 17, 2015","4.50","4.55","4.63","4.35","4.34M","0.00%"
"Jun 18, 2015","4.70","4.62","4.74","4.50","4.37M","4.44%"
"Jun 19, 2015","4.83","4.65","4.83","4.60","2.99M","2.77%"
"Jun 22, 2015","5.30","5.42","5.54","5.05","17.93M","9.73%"
"Jun 23, 2015","5.70","5.34","5.78","5.23","7.95M","7.55%"
"Jun 24, 2015","5.50","5.75","5.90","5.44","10.76M","-3.51%"
"Jun 25, 2015","5.38","5.40","5.48","5.25","10.16M","-2.18%"
"Jun 26, 2015","5.60","5.35","5.62","5.28","5.53M","4.09%"
"Jun 29, 2015","5.64","5.50","5.75","5.45","2.92M","0.71%"
"Jun 30, 2015","5.69","5.81","5.84","5.55","3.55M","0.89%"
"Jul 01, 2015","5.65","5.70","5.76","5.46","3.17M","-0.70%"
"Jul 02, 2015","5.47","5.66","5.72","5.38","4.04M","-3.19%"
"Jul 03, 2015","5.32","5.40","5.44","5.28","2.08M","-2.74%"
"Jul 06, 2015","5.46","5.19","5.55","5.16","1.99M","2.63%"
"Jul 07, 2015","5.43","5.42","5.54","5.25","2.59M","-0.55%"
"Jul 08, 2015","5.55","5.34","5.65","5.33","2.23M","2.21%"
"Jul 10, 2015","5.59","5.65","5.75","5.58","3.55M","0.72%"
"Jul 13, 2015","5.59","5.65","5.67","5.46","1.13M","0.00%"
"Jul 14, 2015","5.49","5.57","5.62","5.49","1.29M","-1.79%"
"Jul 15, 2015","5.55","5.52","5.59","5.42","1.01M","1.09%"
"Jul 16, 2015","5.60","5.60","5.70","5.56","2.06M","0.90%"
"Jul 17, 2015","5.55","5.62","5.67","5.50","1.15M","-0.89%"
"Jul 20, 2015","5.40","5.52","5.56","5.31","3.04M","-2.70%"
"Jul 21, 2015","5.36","5.40","5.46","5.36","1.44M","-0.74%"
"Jul 22, 2015","5.31","5.30","5.38","5.18","1.12M","-0.93%"
"Jul 23, 2015","5.18","5.24","5.26","5.05","4.49M","-2.45%"
"Jul 24, 2015","5.02","5.12","5.16","4.96","1.55M","-3.09%"
"Jul 27, 2015","4.99","4.98","5.08","4.86","1.72M","-0.60%"
"Jul 28, 2015","5.16","4.95","5.16","4.94","1.72M","3.41%"
"Jul 29, 2015","5.18","5.23","5.24","5.08","1.12M","0.39%"
"Jul 30, 2015","5.39","5.17","5.39","5.06","1.80M","4.05%"
"Jul 31, 2015","5.31","5.47","5.47","5.30","2.04M","-1.48%"
"Aug 03, 2015","5.19","5.34","5.44","5.02","3.85M","-2.26%"
"Aug 04, 2015","5.39","5.17","5.39","5.13","1.59M","3.85%"
"Aug 05, 2015","5.33","5.44","5.48","5.23","1.69M","-1.11%"
"Aug 06, 2015","5.20","5.22","5.31","5.13","1.94M","-2.44%"
"Aug 07, 2015","5.27","5.20","5.35","5.20","1.89M","1.35%"
"Aug 10, 2015","5.61","5.32","5.70","5.21","1.97M","6.45%"
"Aug 11, 2015","5.75","5.62","5.80","5.55","3.55M","2.50%"
"Aug 12, 2015","6.02","5.87","6.05","5.72","6.47M","4.70%"
"Aug 13, 2015","6.10","6.09","6.20","6.05","6.84M","1.33%"
"Aug 14, 2015","6.26","6.03","6.34","5.96","4.28M","2.62%"
"Aug 17, 2015","6.25","6.27","6.40","6.15","2.86M","-0.16%"
"Aug 18, 2015","6.30","6.19","6.35","6.19","3.14M","0.80%"
"Aug 19, 2015","6.15","6.24","6.30","5.94","3.46M","-2.38%"
"Aug 20, 2015","6.25","6.06","6.25","5.90","3.05M","1.63%"
"Aug 21, 2015","6.26","6.17","6.35","6.12","2.66M","0.16%"
"Aug 24, 2015","6.15","5.99","6.16","5.75","3.12M","-1.76%"
"Aug 25, 2015","6.14","6.21","6.34","6.06","1.85M","-0.16%"
"Aug 26, 2015","6.42","6.14","6.68","6.08","4.43M","4.56%"
"Aug 27, 2015","6.43","6.53","6.70","6.43","4.17M","0.16%"
"Aug 28, 2015","6.41","6.39","6.53","6.27","3.18M","-0.31%"
"Aug 31, 2015","6.40","6.40","6.48","6.17","3.06M","-0.16%"
"Sep 01, 2015","6.41","6.30","6.61","6.26","3.00M","0.16%"
"Sep 02, 2015","6.54","6.50","6.70","6.45","3.99M","2.03%"
"Sep 03, 2015","6.64","6.59","6.79","6.54","2.90M","1.53%"
"Sep 04, 2015","6.65","6.65","6.80","6.55","2.14M","0.15%"
"Sep 08, 2015","6.78","6.75","6.89","6.65","1.96M","1.95%"
"Sep 09, 2015","6.46","6.86","6.92","6.45","4.34M","-4.72%"
"Sep 10, 2015","6.44","6.20","6.54","6.17","3.61M","-0.31%"
"Sep 11, 2015","6.63","6.38","6.70","6.38","1.71M","2.95%"
"Sep 14, 2015","6.81","6.69","6.92","6.64","2.67M","2.71%"
"Sep 15, 2015","6.72","6.80","7.12","6.70","3.30M","-1.32%"
"Sep 16, 2015","6.90","6.79","7.03","6.76","2.78M","2.68%"
"Sep 17, 2015","7.01","6.82","7.05","6.82","3.16M","1.59%"
"Sep 18, 2015","6.81","6.92","7.02","6.78","1.64M","-2.85%"
"Sep 21, 2015","6.72","6.76","6.91","6.58","1.61M","-1.32%"
"Sep 22, 2015","6.69","6.53","6.78","6.53","2.04M","-0.45%"
"Sep 23, 2015","6.71","6.75","6.94","6.57","2.96M","0.30%"
"Sep 24, 2015","6.86","6.71","7.01","6.51","2.46M","2.24%"
"Sep 25, 2015","6.68","6.94","6.99","6.61","1.86M","-2.62%"
"Sep 28, 2015","6.70","6.70","6.83","6.63","4.05M","0.30%"
"Sep 29, 2015","6.80","6.84","6.84","6.67","4.04M","1.49%"
"Sep 30, 2015","7.17","6.90","7.25","6.88","5.59M","5.44%"
"Oct 01, 2015","6.45","6.80","6.97","6.16","10.28M","-10.04%"
"Oct 02, 2015","6.83","6.50","6.83","6.22","4.80M","5.89%"
"Oct 05, 2015","6.86","6.87","7.12","6.71","3.26M","0.44%"
"Oct 06, 2015","6.98","6.88","7.03","6.82","2.17M","1.75%"
"Oct 07, 2015","6.81","6.98","7.05","6.58","2.84M","-2.44%"
"Oct 08, 2015","6.88","6.82","6.98","6.82","2.36M","1.03%"
"Oct 09, 2015","6.66","6.83","6.86","6.37","4.95M","-3.20%"
"Oct 13, 2015","6.49","6.65","6.77","6.46","3.08M","-2.55%"
"Oct 14, 2015","6.24","6.55","6.57","6.24","5.16M","-3.85%"
"Oct 15, 2015","6.43","6.30","6.48","6.21","2.65M","3.04%"
"Oct 16, 2015","6.48","6.39","6.58","6.33","1.71M","0.78%"
"Oct 19, 2015","6.41","6.46","6.56","6.35","1.70M","-1.08%"
"Oct 20, 2015","6.30","6.41","6.47","6.23","1.55M","-1.72%"
"Oct 21, 2015","6.25","6.29","6.37","6.17","1.47M","-0.79%"
"Oct 22, 2015","6.40","6.30","6.41","6.28","1.59M","2.40%"
"Oct 23, 2015","6.46","6.47","6.59","6.36","1.76M","0.94%"
"Oct 26, 2015","6.47","6.46","6.57","6.40","1.09M","0.15%"
"Oct 27, 2015","6.57","6.47","6.68","6.42","1.63M","1.55%"
"Oct 28, 2015","6.49","6.53","6.68","6.48","2.42M","-1.22%"
"Oct 29, 2015","6.53","6.48","6.68","6.38","1.49M","0.62%"
"Oct 30, 2015","6.37","6.50","6.59","6.34","2.53M","-2.45%"
"Nov 03, 2015","6.48","6.37","6.58","6.35","5.58M","1.73%"
"Nov 04, 2015","6.40","6.50","6.66","6.33","2.35M","-1.23%"
"Nov 05, 2015","6.36","6.41","6.50","6.35","2.03M","-0.62%"
"Nov 06, 2015","6.44","6.45","6.55","6.40","3.28M","1.26%"
"Nov 09, 2015","6.42","6.46","6.50","6.18","2.98M","-0.31%"
"Nov 10, 2015","6.35","6.45","6.49","6.20","1.82M","-1.09%"
"Nov 11, 2015","6.48","6.36","6.50","6.36","1.49M","2.05%"
"Nov 12, 2015","6.44","6.48","6.58","6.44","1.13M","-0.62%"
"Nov 13, 2015","6.25","6.35","6.42","6.25","1.55M","-2.95%"
"Nov 16, 2015","6.39","6.27","6.43","6.27","1.25M","2.24%"
"Nov 17, 2015","6.56","6.42","6.60","6.42","1.46M","2.66%"
"Nov 18, 2015","6.50","6.60","6.63","6.50","1.59M","-0.91%"
"Nov 19, 2015","6.35","6.59","6.59","6.31","1.61M","-2.31%"
"Nov 23, 2015","6.59","6.55","6.59","6.43","1.72M","3.78%"
"Nov 24, 2015","6.73","6.51","6.78","6.50","1.96M","2.12%"
"Nov 25, 2015","6.49","6.72","6.74","6.23","3.94M","-3.57%"
"Nov 26, 2015","6.33","6.46","6.61","6.33","2.19M","-2.47%"
"Nov 27, 2015","6.33","6.37","6.45","6.13","2.14M","0.00%"
"Nov 30, 2015","5.88","6.29","6.29","5.88","3.18M","-7.11%"
"Dec 01, 2015","5.84","5.91","5.99","5.48","6.79M","-0.68%"
"Dec 02, 2015","6.14","5.80","6.24","5.75","2.38M","5.14%"
"Dec 03, 2015","6.19","6.24","6.36","6.16","1.82M","0.81%"
"Dec 04, 2015","6.09","6.13","6.22","6.00","1.65M","-1.62%"
"Dec 07, 2015","6.25","6.12","6.40","6.11","2.03M","2.63%"
"Dec 08, 2015","6.23","6.26","6.33","6.00","1.73M","-0.32%"
"Dec 09, 2015","6.34","6.31","6.45","6.23","1.72M","1.77%"
"Dec 10, 2015","6.35","6.36","6.45","6.23","1.15M","0.16%"
"Dec 11, 2015","6.42","6.26","6.52","6.26","2.75M","1.10%"
"Dec 14, 2015","6.26","6.39","6.49","6.26","1.25M","-2.49%"
"Dec 15, 2015","6.31","6.30","6.40","6.19","1.20M","0.80%"
"Dec 16, 2015","6.22","6.27","6.33","6.14","1.85M","-1.43%"
"Dec 17, 2015","6.22","6.27","6.45","6.21","2.01M","0.00%"
"Dec 18, 2015","6.25","6.18","6.45","6.04","2.69M","0.48%"
"Dec 21, 2015","6.14","6.29","6.39","6.02","2.00M","-1.76%"
"Dec 22, 2015","6.20","6.18","6.22","6.10","1.15M","0.98%"
"Dec 23, 2015","6.35","6.24","6.45","6.22","2.32M","2.42%"
"Dec 28, 2015","6.35","6.36","6.52","6.34","771.00K","0.00%"
"Dec 29, 2015","6.23","6.39","6.45","6.15","1.07M","-1.89%"
"Dec 30, 2015","6.35","6.27","6.42","6.20","2.33M","1.93%"
"Jan 04, 2016","6.23","6.31","6.35","6.12","1.53M","-1.89%"
"Jan 05, 2016","5.95","6.25","6.32","5.95","1.75M","-4.49%"
"Jan 06, 2016","5.92","5.95","6.03","5.82","2.10M","-0.50%"
"Jan 07, 2016","5.67","5.89","5.89","5.61","2.49M","-4.22%"
"Jan 08, 2016","5.90","5.68","6.02","5.65","8.06M","4.06%"
"Jan 11, 2016","6.00","5.86","6.09","5.86","4.16M","1.69%"
"Jan 12, 2016","5.84","6.03","6.13","5.75","3.21M","-2.67%"
"Jan 13, 2016","5.73","5.92","6.03","5.72","2.21M","-1.88%"
"Jan 14, 2016","5.77","5.70","5.91","5.56","1.96M","0.70%"
"Jan 15, 2016","5.60","5.69","5.79","5.49","2.78M","-2.95%"
"Jan 18, 2016","5.60","5.66","5.69","5.41","1.76M","0.00%"
"Jan 19, 2016","5.60","5.66","5.90","5.57","4.60M","0.00%"
"Jan 20, 2016","5.48","5.50","5.63","5.32","3.45M","-2.14%"
"Jan 21, 2016","5.62","5.49","5.62","5.42","2.31M","2.55%"
"Jan 22, 2016","5.85","5.66","5.85","5.56","3.23M","4.09%"
"Jan 26, 2016","5.72","5.81","5.94","5.47","4.49M","-2.22%"
"Jan 27, 2016","5.60","5.71","5.78","5.53","4.48M","-2.10%"
"Jan 28, 2016","5.95","5.59","5.95","5.51","2.05M","6.25%"
"Jan 29, 2016","6.10","5.98","6.24","5.94","3.82M","2.52%"
"Feb 01, 2016","6.12","6.10","6.22","5.97","3.38M","0.33%"
"Feb 02, 2016","5.96","6.08","6.22","5.90","4.01M","-2.61%"
"Feb 03, 2016","6.01","6.00","6.14","5.97","1.93M","0.84%"
"Feb 04, 2016","5.93","6.10","6.19","5.91","2.98M","-1.33%"
"Feb 05, 2016","6.05","5.90","6.21","5.90","4.53M","2.02%"
"Feb 10, 2016","6.00","6.00","6.23","5.93","1.57M","-0.83%"
"Feb 11, 2016","5.90","5.96","6.01","5.68","4.25M","-1.67%"
"Feb 12, 2016","5.93","5.93","6.04","5.78","1.80M","0.51%"
"Feb 15, 2016","5.86","5.97","6.11","5.86","1.37M","-1.18%"
"Feb 16, 2016","6.02","5.86","6.14","5.81","3.42M","2.73%"
"Feb 17, 2016","6.00","6.07","6.14","5.96","2.54M","-0.33%"
"Feb 18, 2016","5.92","6.00","6.11","5.92","3.25M","-1.33%"
"Feb 19, 2016","6.13","5.90","6.18","5.82","4.24M","3.55%"
"Feb 22, 2016","6.48","6.24","6.59","6.18","2.64M","5.71%"
"Feb 23, 2016","6.11","6.48","6.65","6.04","2.92M","-5.71%"
"Feb 24, 2016","6.10","6.00","6.14","5.87","2.48M","-0.16%"
"Feb 25, 2016","6.23","6.09","6.25","6.00","2.87M","2.13%"
"Feb 26, 2016","5.97","6.25","6.34","5.97","2.80M","-4.17%"
"Feb 29, 2016","6.25","6.03","6.34","5.98","2.59M","4.69%"
"Mar 01, 2016","6.29","6.29","6.43","6.17","2.84M","0.64%"
"Mar 02, 2016","6.38","6.34","6.49","6.25","3.85M","1.43%"
"Mar 03, 2016","6.41","6.43","6.67","6.34","9.12M","0.47%"
"Mar 04, 2016","6.47","6.51","6.60","5.93","3.76M","0.94%"
"Mar 07, 2016","6.45","6.60","6.65","6.35","1.62M","-0.31%"
"Mar 08, 2016","6.29","6.48","6.59","6.27","4.54M","-2.48%"
"Mar 09, 2016","6.25","6.37","6.45","6.25","3.16M","-0.64%"
"Mar 10, 2016","6.41","6.30","6.51","6.29","3.72M","2.56%"
"Mar 11, 2016","6.56","6.42","6.73","6.37","3.13M","2.34%"
"Mar 14, 2016","6.68","6.60","6.76","6.46","1.84M","1.83%"
"Mar 15, 2016","6.50","6.58","6.58","6.07","6.48M","-2.69%"
"Mar 16, 2016","6.75","6.45","6.80","6.25","4.30M","3.85%"
"Mar 17, 2016","6.90","6.87","7.15","6.75","4.16M","2.22%"
"Mar 18, 2016","6.72","6.95","6.97","6.72","4.63M","-2.61%"
"Mar 21, 2016","6.84","6.74","7.02","6.73","3.55M","1.79%"
"Mar 22, 2016","6.79","6.85","6.95","6.78","3.25M","-0.73%"
"Mar 23, 2016","6.72","6.74","6.86","6.70","6.10M","-1.03%"
"Mar 24, 2016","6.75","6.66","6.82","6.64","1.72M","0.45%"
"Mar 28, 2016","6.85","6.82","6.94","6.77","6.45M","1.48%"
"Mar 29, 2016","6.83","6.88","7.00","6.79","2.36M","-0.29%"
"Mar 30, 2016","6.80","6.92","6.92","6.80","2.49M","-0.44%"
"Mar 31, 2016","6.49","6.76","6.83","6.49","3.58M","-4.56%"
"Apr 01, 2016","6.77","6.40","6.77","6.30","2.83M","4.31%"
"Apr 04, 2016","6.42","6.70","6.70","6.38","2.34M","-5.17%"
"Apr 05, 2016","6.36","6.33","6.53","6.33","1.12M","-0.93%"
"Apr 06, 2016","6.55","6.41","6.62","6.41","4.45M","2.99%"
"Apr 07, 2016","6.64","6.63","6.68","6.47","3.71M","1.37%"
"Apr 08, 2016","6.43","6.84","6.84","6.42","4.88M","-3.16%"
"Apr 11, 2016","6.37","6.48","6.52","6.32","2.09M","-0.93%"
"Apr 12, 2016","6.38","6.42","6.54","6.22","1.99M","0.16%"
"Apr 13, 2016","6.49","6.52","6.60","6.43","2.29M","1.72%"
"Apr 14, 2016","6.50","6.50","6.61","6.44","1.95M","0.15%"
"Apr 15, 2016","6.46","6.56","6.65","6.43","2.18M","-0.62%"
"Apr 18, 2016","6.29","6.48","6.48","6.29","1.66M","-2.63%"
"Apr 19, 2016","6.52","6.33","6.52","6.28","1.67M","3.66%"
"Apr 20, 2016","6.49","6.45","6.51","6.36","1.04M","-0.46%"
"Apr 22, 2016","6.39","6.35","6.45","6.32","1.18M","-1.54%"
"Apr 25, 2016","6.31","6.42","6.46","6.31","7.03M","-1.25%"
"Apr 26, 2016","6.30","6.34","6.40","6.09","5.72M","-0.16%"
"Apr 27, 2016","6.55","6.36","6.62","6.30","1.71M","3.97%"
"Apr 28, 2016","6.52","6.57","6.66","6.48","3.31M","-0.46%"
"Apr 29, 2016","6.49","6.53","6.69","6.42","2.05M","-0.46%"
"May 02, 2016","6.30","6.48","6.52","6.27","2.78M","-2.93%"
"May 03, 2016","6.30","6.25","6.32","6.08","6.56M","0.00%"
"May 04, 2016","6.37","6.30","6.37","6.11","3.29M","1.11%"
"May 05, 2016","6.40","6.35","6.43","6.26","2.74M","0.47%"
"May 06, 2016","6.25","6.38","6.45","6.25","2.89M","-2.34%"
"May 09, 2016","6.15","6.20","6.29","6.01","3.85M","-1.60%"
"May 10, 2016","6.15","6.22","6.25","6.10","3.39M","0.00%"
"May 11, 2016","6.19","6.22","6.25","6.16","2.27M","0.65%"
"May 12, 2016","6.37","6.25","6.47","6.23","4.56M","2.91%"
"May 13, 2016","6.30","6.30","6.39","6.22","2.09M","-1.10%"
"May 16, 2016","6.50","6.20","6.55","6.19","5.23M","3.17%"
"May 17, 2016","6.47","6.56","6.57","6.40","2.26M","-0.46%"
"May 18, 2016","6.33","6.45","6.48","6.25","3.81M","-2.16%"
"May 19, 2016","6.48","6.32","6.53","6.29","5.00M","2.37%"
"May 20, 2016","6.27","6.55","6.56","6.27","1.76M","-3.24%"
"May 23, 2016","6.31","6.14","6.39","6.14","3.00M","0.64%"
"May 24, 2016","6.40","6.28","6.46","6.27","3.07M","1.43%"
"May 25, 2016","6.46","6.47","6.56","6.38","3.82M","0.94%"
"May 27, 2016","6.39","6.48","6.64","6.39","2.47M","-1.08%"
"May 30, 2016","6.18","6.42","6.45","6.18","648.70K","-3.29%"
"May 31, 2016","6.29","6.15","6.30","6.05","4.22M","1.78%"
"Jun 01, 2016","6.25","6.31","6.37","6.20","2.67M","-0.64%"
"Jun 02, 2016","6.20","6.26","6.29","6.15","2.16M","-0.80%"
"Jun 03, 2016","6.11","6.23","6.29","6.11","2.79M","-1.45%"
"Jun 06, 2016","6.07","6.15","6.18","6.07","1.39M","-0.65%"
"Jun 07, 2016","6.16","6.08","6.18","6.04","2.09M","1.48%"
"Jun 08, 2016","6.14","6.17","6.21","6.06","2.34M","-0.32%"
"Jun 09, 2016","6.14","6.14","6.23","6.12","2.38M","0.00%"
"Jun 10, 2016","6.00","6.09","6.15","5.97","1.13M","-2.28%"
"Jun 13, 2016","6.00","5.91","6.05","5.90","1.21M","0.00%"
"Jun 14, 2016","5.81","5.94","5.99","5.76","1.79M","-3.17%"
"Jun 15, 2016","5.81","5.85","5.85","5.48","2.57M","0.00%"
"Jun 16, 2016","5.86","5.72","5.87","5.66","2.00M","0.86%"
"Jun 17, 2016","5.72","5.88","5.90","5.69","1.97M","-2.39%"
"Jun 20, 2016","5.70","5.82","5.82","5.58","1.70M","-0.35%"
"Jun 21, 2016","5.88","5.64","5.89","5.63","1.77M","3.16%"
"Jun 22, 2016","5.78","5.85","5.86","5.65","2.76M","-1.70%"
"Jun 23, 2016","5.90","5.84","5.92","5.74","1.29M","2.08%"
"Jun 24, 2016","5.75","5.79","5.79","5.66","1.35M","-2.54%"
"Jun 27, 2016","5.73","5.73","5.77","5.66","1.44M","-0.35%"
"Jun 28, 2016","5.67","5.80","5.80","5.62","1.89M","-1.05%"
"Jun 29, 2016","5.67","5.72","5.74","5.58","1.88M","0.00%"
"Jun 30, 2016","5.62","5.65","5.67","5.53","2.14M","-0.88%"
"Jul 01, 2016","5.61","5.60","5.61","5.52","3.04M","-0.18%"
"Jul 04, 2016","5.78","5.62","5.86","5.55","2.31M","3.03%"
"Jul 05, 2016","5.62","5.72","5.78","5.59","1.22M","-2.77%"
"Jul 06, 2016","5.55","5.59","5.63","5.44","2.16M","-1.25%"
"Jul 07, 2016","5.63","5.54","5.64","5.50","1.52M","1.44%"
"Jul 08, 2016","5.60","5.67","5.68","5.54","2.01M","-0.53%"
"Jul 11, 2016","5.56","5.66","5.66","5.43","2.74M","-0.71%"
"Jul 12, 2016","5.44","5.55","5.60","5.44","2.24M","-2.16%"
"Jul 13, 2016","5.40","5.45","5.51","5.40","2.37M","-0.74%"
"Jul 14, 2016","5.38","5.44","5.46","5.36","1.16M","-0.37%"
"Jul 15, 2016","5.42","5.37","5.42","5.31","1.32M","0.74%"
"Jul 18, 2016","5.40","5.42","5.45","5.34","1.05M","-0.37%"
"Jul 19, 2016","5.47","5.42","5.50","5.40","1.29M","1.30%"
"Jul 20, 2016","5.48","5.45","5.52","5.42","1.55M","0.18%"
"Jul 21, 2016","5.71","5.45","5.73","5.45","2.76M","4.20%"
"Jul 22, 2016","5.65","5.70","5.78","5.63","1.68M","-1.05%"
"Jul 25, 2016","5.51","5.66","5.68","5.51","1.30M","-2.48%"
"Jul 26, 2016","5.53","5.54","5.54","5.34","3.00M","0.36%"
"Jul 27, 2016","5.41","5.52","5.60","5.41","2.31M","-2.17%"
"Jul 28, 2016","5.56","5.43","5.57","5.41","2.26M","2.77%"
"Jul 29, 2016","5.68","5.55","5.70","5.45","2.50M","2.16%"
"Aug 01, 2016","5.56","5.73","5.74","5.56","1.16M","-2.11%"
"Aug 02, 2016","5.44","5.54","5.59","5.44","1.11M","-2.16%"
"Aug 03, 2016","5.54","5.42","5.56","5.42","1.07M","1.84%"
"Aug 04, 2016","5.56","5.56","5.64","5.51","1.41M","0.36%"
"Aug 05, 2016","5.55","5.60","5.64","5.53","1.49M","-0.18%"
"Aug 08, 2016","5.60","5.52","5.69","5.52","1.78M","0.90%"
"Aug 09, 2016","5.60","5.59","5.67","5.55","824.50K","0.00%"
"Aug 10, 2016","5.49","5.62","5.64","5.49","942.70K","-1.96%"
"Aug 11, 2016","5.45","5.45","5.47","5.18","11.29M","-0.73%"
"Aug 12, 2016","5.34","5.46","5.46","5.21","6.16M","-2.02%"
"Aug 15, 2016","5.33","5.34","5.36","5.21","4.97M","-0.19%"
"Aug 16, 2016","5.27","5.31","5.33","5.23","2.10M","-1.13%"
"Aug 17, 2016","5.27","5.26","5.27","5.16","2.80M","0.00%"
"Aug 18, 2016","5.25","5.25","5.28","5.20","2.01M","-0.38%"
"Aug 19, 2016","5.21","5.25","5.25","5.16","1.84M","-0.76%"
"Aug 22, 2016","5.12","5.21","5.22","5.09","2.66M","-1.73%"
"Aug 23, 2016","5.20","5.11","5.29","5.05","4.68M","1.56%"
"Aug 24, 2016","5.17","5.16","5.21","5.13","2.56M","-0.58%"
"Aug 25, 2016","5.17","5.14","5.21","5.11","2.38M","0.00%"
"Aug 26, 2016","5.14","5.16","5.20","5.08","2.04M","-0.58%"
"Aug 29, 2016","5.12","5.13","5.15","5.08","2.51M","-0.39%"
"Aug 30, 2016","5.10","5.14","5.14","5.05","1.91M","-0.39%"
"Aug 31, 2016","5.11","5.12","5.13","5.03","1.87M","0.20%"
"Sep 01, 2016","5.13","5.11","5.16","5.07","1.92M","0.39%"
"Sep 02, 2016","5.22","5.17","5.22","5.09","2.43M","1.75%"
"Sep 05, 2016","5.28","5.23","5.32","5.18","1.13M","1.15%"
"Sep 06, 2016","5.17","5.31","5.31","5.16","2.22M","-2.08%"
"Sep 08, 2016","5.07","5.18","5.20","5.07","2.15M","-1.93%"
"Sep 09, 2016","5.03","5.05","5.10","4.98","2.33M","-0.79%"
"Sep 12, 2016","4.96","5.00","5.03","4.89","1.97M","-1.39%"
"Sep 13, 2016","4.96","4.96","5.02","4.90","3.05M","0.00%"
"Sep 14, 2016","5.00","4.96","5.04","4.95","2.03M","0.81%"
"Sep 15, 2016","5.12","5.01","5.15","5.01","2.07M","2.40%"
"Sep 16, 2016","5.10","5.10","5.14","5.04","3.97M","-0.39%"
"Sep 19, 2016","5.26","5.10","5.26","4.96","4.96M","3.14%"
"Sep 20, 2016","5.19","5.30","5.30","5.11","5.38M","-1.33%"
"Sep 21, 2016","5.19","5.19","5.21","5.07","2.50M","0.00%"
"Sep 22, 2016","5.16","5.20","5.25","5.11","2.53M","-0.58%"
"Sep 23, 2016","5.19","5.13","5.21","5.13","2.03M","0.58%"
"Sep 26, 2016","5.11","5.15","5.17","5.10","1.68M","-1.54%"
"Sep 27, 2016","5.15","5.12","5.15","5.00","2.24M","0.78%"
"Sep 28, 2016","5.19","5.18","5.21","5.09","2.07M","0.78%"
"Sep 29, 2016","5.20","5.18","5.21","5.11","2.80M","0.19%"
"Sep 30, 2016","5.22","5.21","5.26","5.15","2.53M","0.38%"
"Oct 03, 2016","5.36","5.22","5.38","5.20","2.63M","2.68%"
"Oct 04, 2016","5.36","5.40","5.43","5.27","3.81M","0.00%"
"Oct 05, 2016","5.40","5.39","5.47","5.36","2.06M","0.75%"
"Oct 06, 2016","5.46","5.42","5.48","5.34","3.32M","1.11%"
"Oct 07, 2016","5.63","5.46","5.66","5.46","9.51M","3.11%"
"Oct 10, 2016","5.66","5.67","5.69","5.59","1.94M","0.53%"
"Oct 11, 2016","5.68","5.61","5.71","5.61","1.49M","0.35%"
"Oct 13, 2016","5.99","5.63","6.10","5.63","5.12M","5.46%"
"Oct 14, 2016","6.06","5.97","6.09","5.89","2.80M","1.17%"
"Oct 17, 2016","5.93","6.03","6.10","5.86","2.47M","-2.15%"
"Oct 18, 2016","5.96","5.90","6.08","5.90","1.98M","0.51%"
"Oct 19, 2016","5.81","5.95","5.95","5.76","2.35M","-2.52%"
"Oct 20, 2016","5.81","5.80","5.87","5.72","1.67M","0.00%"
"Oct 21, 2016","5.92","5.81","5.94","5.81","1.33M","1.89%"
"Oct 24, 2016","5.98","5.93","6.00","5.91","2.11M","1.01%"
"Oct 25, 2016","6.00","5.95","6.01","5.92","1.81M","0.33%"
"Oct 26, 2016","5.75","5.99","5.99","5.56","4.57M","-4.17%"
"Oct 27, 2016","5.64","5.77","5.82","5.59","2.32M","-1.91%"
"Oct 28, 2016","5.64","5.60","5.66","5.53","1.71M","0.00%"
"Oct 31, 2016","5.69","5.69","5.70","5.55","1.76M","0.89%"
"Nov 01, 2016","5.63","5.68","5.80","5.56","1.96M","-1.05%"
"Nov 03, 2016","5.38","5.64","5.67","5.37","2.61M","-4.44%"
"Nov 04, 2016","5.39","5.41","5.49","5.27","2.66M","0.19%"
"Nov 07, 2016","5.62","5.42","5.67","5.35","1.98M","4.27%"
"Nov 08, 2016","5.65","5.57","5.70","5.51","1.86M","0.53%"
"Nov 09, 2016","5.59","5.40","5.63","5.37","3.01M","-1.06%"
"Nov 10, 2016","5.26","5.74","5.86","5.26","4.16M","-5.90%"
"Nov 11, 2016","5.78","5.17","5.95","5.08","6.18M","9.89%"
"Nov 14, 2016","5.94","5.78","6.00","5.63","4.59M","2.77%"
"Nov 16, 2016","5.76","5.99","6.03","5.66","3.53M","-3.03%"
"Nov 17, 2016","5.85","5.81","5.92","5.75","2.63M","1.56%"
"Nov 18, 2016","6.16","5.80","6.16","5.77","3.99M","5.30%"
"Nov 21, 2016","6.18","6.18","6.28","6.08","2.35M","0.32%"
"Nov 22, 2016","6.09","6.19","6.32","6.00","2.89M","-1.46%"
"Nov 23, 2016","6.12","6.09","6.27","6.03","1.79M","0.49%"
"Nov 24, 2016","6.36","6.16","6.38","6.14","1.21M","3.92%"
"Nov 25, 2016","6.47","6.27","6.47","6.20","2.25M","1.73%"
"Nov 28, 2016","6.51","6.47","6.57","6.37","1.36M","0.62%"
"Nov 29, 2016","6.35","6.51","6.58","6.35","3.34M","-2.46%"
"Nov 30, 2016","6.51","6.35","6.55","6.19","2.03M","2.52%"
"Dec 01, 2016","6.36","6.38","6.48","6.11","4.30M","-2.30%"
"Dec 02, 2016","6.41","6.26","6.44","6.20","2.26M","0.79%"
"Dec 05, 2016","6.17","6.43","6.50","6.17","1.48M","-3.74%"
"Dec 06, 2016","6.59","6.16","6.69","6.14","1.83M","6.81%"
"Dec 07, 2016","6.45","6.66","6.75","6.37","2.64M","-2.12%"
"Dec 08, 2016","6.45","6.51","6.70","6.28","1.83M","0.00%"
"Dec 09, 2016","6.43","6.48","6.49","6.30","4.86M","-0.31%"
"Dec 12, 2016","6.36","6.35","6.47","6.31","2.23M","-1.09%"
"Dec 13, 2016","6.32","6.31","6.44","6.21","5.64M","-0.63%"
"Dec 14, 2016","6.32","6.31","6.42","6.18","1.89M","0.00%"
"Dec 15, 2016","6.35","6.32","6.35","6.19","1.97M","0.47%"
"Dec 16, 2016","6.31","6.36","6.40","6.26","1.65M","-0.63%"
"Dec 19, 2016","6.26","6.31","6.36","6.07","2.64M","-0.79%"
"Dec 20, 2016","6.28","6.26","6.30","6.15","1.87M","0.32%"
"Dec 21, 2016","6.30","6.31","6.35","6.23","1.45M","0.32%"
"Dec 22, 2016","6.30","6.28","6.37","6.22","1.78M","0.00%"
"Dec 23, 2016","6.26","6.28","6.36","6.26","2.33M","-0.63%"
"Dec 26, 2016","6.36","6.26","6.40","6.25","1.08M","1.60%"
"Dec 27, 2016","6.48","6.42","6.50","6.30","2.31M","1.89%"
"Dec 28, 2016","6.59","6.46","6.66","6.46","1.56M","1.70%"
"Dec 29, 2016","6.61","6.64","6.70","6.48","2.01M","0.30%"
"Jan 02, 2017","6.40","6.52","6.59","6.40","615.10K","-3.18%"
"Jan 03, 2017","6.46","6.45","6.67","6.40","1.58M","0.94%"
"Jan 04, 2017","6.60","6.39","6.63","6.39","1.26M","2.17%"
"Jan 05, 2017","6.58","6.57","6.76","6.57","1.17M","-0.30%"
"Jan 06, 2017","6.33","6.58","6.63","6.30","2.08M","-3.80%"
"Jan 09, 2017","6.06","6.30","6.30","5.94","2.86M","-4.27%"
"Jan 10, 2017","6.16","6.10","6.23","6.08","4.56M","1.65%"
"Jan 11, 2017","6.13","6.20","6.25","6.03","2.82M","-0.49%"
"Jan 12, 2017","6.13","6.20","6.28","6.05","2.84M","0.00%"
"Jan 13, 2017","6.19","6.12","6.20","5.98","7.23M","0.98%"
"Jan 16, 2017","6.28","6.13","6.28","6.13","1.46M","1.45%"
"Jan 17, 2017","6.24","6.24","6.28","6.09","2.37M","-0.64%"
"Jan 18, 2017","6.16","6.24","6.26","6.16","1.25M","-1.28%"
"Jan 19, 2017","6.19","6.19","6.22","6.07","3.04M","0.49%"
"Jan 20, 2017","6.14","6.18","6.24","6.12","10.71M","-0.81%"
"Jan 23, 2017","6.20","6.17","6.23","6.13","1.09M","0.98%"
"Jan 24, 2017","6.28","6.23","6.28","6.15","2.35M","1.29%"
"Jan 26, 2017","6.60","6.40","6.60","6.29","4.23M","5.10%"
"Jan 27, 2017","6.62","6.60","6.70","6.49","2.41M","0.30%"
"Jan 30, 2017","6.40","6.50","6.52","6.34","3.93M","-3.32%"
"Jan 31, 2017","6.46","6.35","6.53","6.31","1.39M","0.94%"
"Feb 01, 2017","6.59","6.47","6.64","6.45","3.19M","2.01%"
"Feb 02, 2017","6.66","6.57","6.72","6.52","4.65M","1.06%"
"Feb 03, 2017","6.76","6.65","6.85","6.62","4.24M","1.50%"
"Feb 06, 2017","6.75","6.76","6.95","6.51","3.55M","-0.15%"
"Feb 07, 2017","6.86","6.75","6.86","6.67","2.16M","1.63%"
"Feb 08, 2017","6.75","6.86","7.10","6.74","5.63M","-1.60%"
"Feb 09, 2017","6.88","6.72","6.90","6.70","1.34M","1.93%"
"Feb 10, 2017","7.20","6.86","7.20","6.83","3.24M","4.65%"
"Feb 13, 2017","7.38","7.19","7.38","7.11","1.19M","2.50%"
"Feb 14, 2017","7.34","7.36","7.48","7.28","1.83M","-0.54%"
"Feb 15, 2017","7.35","7.37","7.40","7.21","2.85M","0.14%"
"Feb 16, 2017","7.22","7.30","7.34","7.19","1.97M","-1.77%"
"Feb 17, 2017","7.00","7.19","7.24","7.00","1.41M","-3.05%"
"Feb 20, 2017","6.92","7.02","7.09","6.92","1.01M","-1.14%"
"Feb 21, 2017","6.86","6.99","6.99","6.86","2.20M","-0.87%"
"Feb 22, 2017","6.37","6.82","6.89","6.37","3.05M","-7.14%"
"Feb 23, 2017","6.11","6.43","6.51","6.00","4.65M","-4.08%"
"Feb 24, 2017","6.25","6.05","6.34","5.91","4.24M","2.29%"
"Mar 01, 2017","6.29","6.31","6.37","6.12","3.34M","0.64%"
"Mar 02, 2017","6.24","6.25","6.42","6.21","3.69M","-0.79%"
"Mar 03, 2017","6.11","6.27","6.32","5.96","3.04M","-2.08%"
"Mar 06, 2017","6.09","6.04","6.14","6.03","2.74M","-0.33%"
"Mar 07, 2017","6.07","6.10","6.16","6.02","1.91M","-0.33%"
"Mar 08, 2017","6.00","6.07","6.09","5.93","2.58M","-1.15%"
"Mar 09, 2017","6.12","6.03","6.12","6.02","1.30M","2.00%"
"Mar 10, 2017","6.09","6.13","6.13","6.01","1.14M","-0.49%"
"Mar 13, 2017","6.00","6.12","6.13","6.00","1.33M","-1.48%"
"Mar 14, 2017","5.80","6.03","6.04","5.80","1.41M","-3.33%"
"Mar 15, 2017","5.79","5.80","5.86","5.77","2.74M","-0.17%"
"Mar 16, 2017","5.72","5.83","5.92","5.72","1.68M","-1.21%"
"Mar 17, 2017","5.60","5.73","5.78","5.56","3.52M","-2.10%"
"Mar 20, 2017","5.36","5.35","5.48","5.27","3.18M","-4.29%"
"Mar 21, 2017","5.42","5.43","5.60","5.38","2.00M","1.12%"
"Mar 22, 2017","5.55","5.42","5.62","5.28","2.16M","2.40%"
"Mar 23, 2017","5.84","5.50","5.93","5.45","2.19M","5.23%"
"Mar 24, 2017","5.90","5.85","5.90","5.80","1.22M","1.03%"
"Mar 27, 2017","6.01","5.97","6.14","5.96","2.65M","1.86%"
"Mar 28, 2017","5.92","5.97","6.06","5.91","1.55M","-1.50%"
"Mar 29, 2017","5.90","5.95","6.00","5.87","2.45M","-0.34%"
"Mar 30, 2017","5.77","5.94","5.94","5.77","460.40K","-2.20%"
"Mar 31, 2017","5.71","5.79","5.86","5.71","973.40K","-1.04%"
"Apr 03, 2017","5.70","5.78","5.78","5.58","704.40K","-0.18%"
"Apr 04, 2017","5.77","5.73","5.77","5.63","754.70K","1.23%"
"Apr 05, 2017","5.70","5.81","5.85","5.66","2.37M","-1.21%"
"Apr 06, 2017","5.68","5.66","5.77","5.61","846.30K","-0.35%"
"Apr 07, 2017","5.67","5.69","5.76","5.59","1.81M","-0.18%"
"Apr 10, 2017","5.66","5.71","5.71","5.55","722.50K","-0.18%"
"Apr 11, 2017","5.58","5.69","5.72","5.57","1.06M","-1.41%"
"Apr 12, 2017","5.74","5.55","5.74","5.55","1.55M","2.87%"
"Apr 13, 2017","5.67","5.75","5.75","5.61","771.00K","-1.22%"
"Apr 17, 2017","5.84","5.64","5.90","5.64","1.03M","3.00%"
"Apr 18, 2017","6.07","5.91","6.07","5.89","2.43M","3.94%"
"Apr 19, 2017","6.00","6.12","6.12","5.87","2.75M","-1.15%"
"Apr 20, 2017","6.36","5.98","6.57","5.98","3.16M","6.00%"
"Apr 24, 2017","6.41","6.33","6.47","6.33","2.70M","0.79%"
"Apr 25, 2017","6.83","6.41","6.83","6.36","4.59M","6.55%"
"Apr 26, 2017","6.89","6.82","7.12","6.65","5.06M","0.88%"
"Apr 27, 2017","6.88","6.86","6.95","6.74","1.61M","-0.15%"
"Apr 28, 2017","7.22","6.87","7.22","6.82","2.76M","4.94%"
"May 02, 2017","7.38","7.24","7.49","7.04","3.38M","2.22%"
"May 03, 2017","7.29","7.32","7.44","7.22","3.80M","-1.22%"
"May 04, 2017","7.14","7.20","7.29","7.01","2.47M","-2.06%"
"May 05, 2017","7.41","7.04","7.46","7.04","2.27M","3.78%"
"May 08, 2017","7.25","7.37","7.64","7.23","1.91M","-2.16%"
"May 09, 2017","7.50","7.19","7.56","7.19","2.02M","3.45%"
"May 10, 2017","7.90","7.54","7.98","7.50","2.27M","5.33%"
"May 11, 2017","7.62","7.92","7.95","7.62","1.23M","-3.54%"
"May 12, 2017","7.69","7.54","7.73","7.52","1.88M","0.92%"
"May 15, 2017","7.36","7.75","7.78","7.34","1.89M","-4.29%"
"May 16, 2017","7.17","7.34","7.45","7.03","3.40M","-2.58%"
"May 17, 2017","6.88","7.15","7.20","6.83","3.20M","-4.04%"
"May 18, 2017","6.50","6.00","6.99","5.75","4.87M","-5.52%"
"May 19, 2017","6.48","6.44","6.71","6.31","3.89M","-0.31%"
"May 22, 2017","6.57","6.33","6.59","6.11","3.09M","1.39%"
"May 23, 2017","6.52","6.58","6.65","6.41","3.43M","-0.76%"
"May 24, 2017","6.26","6.61","6.72","6.25","3.90M","-3.99%"
"May 25, 2017","6.29","6.32","6.44","6.13","3.80M","0.48%"
"May 26, 2017","6.33","6.36","6.52","6.26","2.83M","0.64%"
"May 29, 2017","6.32","6.33","6.39","6.28","948.90K","-0.16%"
"May 30, 2017","6.31","6.35","6.37","6.30","1.60M","-0.16%"
"May 31, 2017","6.30","6.35","6.46","6.18","2.99M","-0.16%"
"Jun 01, 2017","6.24","6.31","6.52","6.09","2.54M","-0.95%"
"Jun 02, 2017","6.24","6.22","6.37","6.20","1.34M","0.00%"
"Jun 05, 2017","6.38","6.21","6.42","6.21","1.63M","2.24%"
"Jun 06, 2017","6.63","6.36","6.76","6.36","3.34M","3.92%"
"Jun 07, 2017","6.56","6.73","6.73","6.50","1.63M","-1.06%"
"Jun 08, 2017","6.44","6.56","6.56","6.44","905.10K","-1.83%"
"Jun 09, 2017","6.38","6.44","6.49","6.32","1.15M","-0.93%"
"Jun 12, 2017","6.43","6.39","6.59","6.34","1.13M","0.78%"
"Jun 13, 2017","6.46","6.44","6.51","6.27","1.54M","0.47%"
"Jun 14, 2017","6.64","6.48","6.66","6.45","4.30M","2.79%"
"Jun 16, 2017","6.63","6.61","6.83","6.54","4.28M","-0.15%"
"Jun 19, 2017","6.65","6.62","6.74","6.58","920.70K","0.30%"
"Jun 20, 2017","6.65","6.69","6.74","6.43","2.56M","0.00%"
"Jun 21, 2017","6.70","6.59","6.70","6.55","1.63M","0.75%"
"Jun 22, 2017","6.70","6.65","6.81","6.63","2.10M","0.00%"
"Jun 23, 2017","6.66","6.58","6.68","6.51","2.26M","-0.60%"
"Jun 26, 2017","6.66","6.68","6.81","6.65","936.10K","0.00%"
"Jun 27, 2017","6.63","6.68","6.68","6.53","1.21M","-0.45%"
"Jun 28, 2017","6.69","6.71","6.73","6.56","914.50K","0.90%"
"Jun 29, 2017","6.72","6.65","6.79","6.62","1.29M","0.45%"
"Jun 30, 2017","6.76","6.77","6.79","6.71","1.25M","0.60%"
"Jul 03, 2017","6.80","6.81","6.96","6.72","1.38M","0.59%"
"Jul 04, 2017","6.87","6.80","6.94","6.80","941.30K","1.03%"
"Jul 05, 2017","6.88","6.94","6.97","6.85","649.00K","0.15%"
"Jul 06, 2017","6.80","6.83","6.87","6.75","1.18M","-1.16%"
"Jul 07, 2017","6.80","6.85","6.90","6.75","2.47M","0.00%"
"Jul 10, 2017","6.80","6.80","6.82","6.78","2.54M","0.00%"
"Jul 11, 2017","6.78","6.80","6.83","6.73","1.61M","-0.29%"
"Jul 12, 2017","6.80","6.81","6.85","6.73","2.07M","0.29%"
"Jul 13, 2017","6.87","6.80","6.94","6.78","916.90K","1.03%"
"Jul 14, 2017","6.75","6.89","6.92","6.72","1.01M","-1.75%"
"Jul 17, 2017","6.70","6.75","6.77","6.65","1.59M","-0.74%"
"Jul 18, 2017","6.70","6.73","6.82","6.65","1.22M","0.00%"
"Jul 19, 2017","6.64","6.69","6.69","6.50","1.59M","-0.90%"
"Jul 20, 2017","6.60","6.60","6.67","6.52","1.61M","-0.60%"
"Jul 21, 2017","6.46","6.55","6.59","6.45","1.14M","-2.12%"
"Jul 24, 2017","6.55","6.46","6.62","6.45","915.90K","1.39%"
"Jul 25, 2017","6.48","6.62","6.63","6.41","1.08M","-1.07%"
"Jul 26, 2017","6.44","6.46","6.51","6.25","2.45M","-0.62%"
"Jul 27, 2017","6.43","6.48","6.48","6.33","1.64M","-0.16%"
"Jul 28, 2017","6.45","6.40","6.54","6.34","1.13M","0.31%"
"Jul 31, 2017","6.42","6.49","6.50","6.41","771.00K","-0.47%"
"Aug 01, 2017","6.47","6.42","6.48","6.39","777.60K","0.78%"
"Aug 02, 2017","6.49","6.46","6.56","6.38","1.44M","0.31%"
"Aug 03, 2017","6.55","6.51","6.55","6.44","901.30K","0.92%"
"Aug 04, 2017","6.55","6.55","6.56","6.45","698.80K","0.00%"
"Aug 07, 2017","6.92","6.56","6.92","6.53","2.59M","5.65%"
"Aug 08, 2017","6.86","6.88","6.95","6.71","1.24M","-0.87%"
"Aug 09, 2017","6.83","6.85","6.91","6.79","750.20K","-0.44%"
"Aug 10, 2017","6.66","6.84","6.90","6.61","720.80K","-2.49%"
"Aug 11, 2017","6.88","6.68","6.88","6.60","1.09M","3.30%"
"Aug 14, 2017","7.09","6.85","7.10","6.76","2.22M","3.05%"
"Aug 15, 2017","7.14","7.18","7.27","6.96","3.38M","0.71%"
"Aug 16, 2017","7.18","7.20","7.25","7.00","1.98M","0.56%"
"Aug 17, 2017","7.12","7.16","7.16","7.02","1.01M","-0.84%"
"Aug 18, 2017","7.09","7.09","7.24","6.93","4.81M","-0.42%"
"Aug 21, 2017","7.18","7.10","7.20","7.00","1.66M","1.27%"
"Aug 22, 2017","7.10","7.21","7.29","7.07","4.87M","-1.11%"
"Aug 23, 2017","7.10","7.10","7.18","7.04","1.16M","0.00%"
"Aug 24, 2017","7.16","7.10","7.19","7.05","1.14M","0.85%"
"Aug 25, 2017","7.07","7.16","7.21","6.97","1.79M","-1.26%"
"Aug 28, 2017","7.20","7.10","7.33","7.08","2.57M","1.84%"
"Aug 29, 2017","7.32","7.20","7.41","7.18","1.87M","1.67%"
"Aug 30, 2017","7.24","7.38","7.38","7.21","1.15M","-1.09%"
"Aug 31, 2017","7.13","7.25","7.28","7.04","2.13M","-1.52%"
"Sep 01, 2017","7.18","7.12","7.24","7.11","1.98M","0.70%"
"Sep 04, 2017","7.26","7.18","7.37","7.14","3.36M","1.11%"
"Sep 05, 2017","7.22","7.32","7.40","7.17","2.20M","-0.55%"
"Sep 06, 2017","7.24","7.27","7.33","7.22","1.44M","0.28%"
"Sep 08, 2017","7.25","7.28","7.35","7.22","2.21M","0.14%"
"Sep 11, 2017","7.25","7.30","7.32","7.22","1.42M","0.00%"
"Sep 12, 2017","7.19","7.27","7.29","7.13","2.59M","-0.83%"
"Sep 13, 2017","7.18","7.18","7.20","7.07","1.01M","-0.14%"
"Sep 14, 2017","7.10","7.09","7.11","6.84","3.28M","-1.11%"
"Sep 15, 2017","7.17","7.17","7.17","7.04","1.64M","0.99%"
"Sep 18, 2017","7.10","7.15","7.22","7.07","1.30M","-0.98%"
"Sep 19, 2017","6.97","7.10","7.13","6.97","1.21M","-1.83%"
"Sep 20, 2017","6.92","6.99","7.05","6.88","1.27M","-0.72%"
"Sep 21, 2017","6.82","6.93","6.97","6.72","1.73M","-1.45%"
"Sep 22, 2017","6.75","6.85","6.85","6.67","1.54M","-1.03%"
"Sep 25, 2017","6.67","6.75","6.83","6.55","2.88M","-1.19%"
"Sep 26, 2017","6.66","6.71","6.76","6.60","1.47M","-0.15%"
"Sep 27, 2017","6.59","6.67","6.71","6.52","994.70K","-1.05%"
"Sep 28, 2017","6.39","6.64","6.64","6.38","1.40M","-3.03%"
"Sep 29, 2017","6.47","6.46","6.53","6.39","1.68M","1.25%"
"Oct 02, 2017","6.42","6.49","6.56","6.31","3.59M","-0.77%"
"Oct 03, 2017","6.67","6.46","6.73","6.42","2.40M","3.89%"
"Oct 04, 2017","6.72","6.72","6.78","6.61","1.31M","0.75%"
"Oct 05, 2017","6.63","6.75","6.85","6.63","1.51M","-1.34%"
"Oct 06, 2017","6.70","6.57","6.76","6.52","1.53M","1.06%"
"Oct 09, 2017","6.39","6.74","6.74","6.39","2.32M","-4.63%"
"Oct 10, 2017","6.44","6.45","6.56","6.38","1.47M","0.78%"
"Oct 11, 2017","6.63","6.50","6.63","6.44","1.36M","2.95%"
"Oct 13, 2017","6.61","6.62","6.65","6.52","978.00K","-0.30%"
"Oct 16, 2017","6.56","6.65","6.65","6.43","998.00K","-0.76%"
"Oct 17, 2017","6.50","6.59","6.60","6.46","1.28M","-0.91%"
"Oct 18, 2017","6.52","6.52","6.57","6.46","1.77M","0.31%"
"Oct 19, 2017","6.37","6.48","6.48","6.35","1.22M","-2.30%"
"Oct 20, 2017","6.39","6.37","6.44","6.28","1.05M","0.31%"
"Oct 23, 2017","6.35","6.50","6.55","6.35","2.13M","-0.63%"
"Oct 24, 2017","6.46","6.40","6.46","6.32","1.36M","1.73%"
"Oct 25, 2017","6.56","6.46","6.56","6.40","1.08M","1.55%"
"Oct 26, 2017","6.38","6.57","6.59","6.38","1.63M","-2.74%"
"Oct 27, 2017","6.55","6.42","6.55","6.39","1.32M","2.66%"
"Oct 30, 2017","6.25","6.55","6.55","6.22","1.54M","-4.58%"
"Oct 31, 2017","6.43","6.30","6.43","6.16","1.92M","2.88%"
"Nov 01, 2017","6.30","6.42","6.48","6.30","1.12M","-2.02%"
"Nov 03, 2017","6.15","6.31","6.33","6.08","1.79M","-2.38%"
"Nov 06, 2017","6.10","6.13","6.21","6.02","1.15M","-0.81%"
"Nov 07, 2017","5.99","6.07","6.14","5.87","1.81M","-1.80%"
"Nov 08, 2017","6.65","5.97","6.65","5.97","2.73M","11.02%"
"Nov 09, 2017","6.66","6.62","6.73","6.48","2.63M","0.15%"
"Nov 10, 2017","6.60","6.66","6.74","6.53","1.86M","-0.90%"
"Nov 13, 2017","6.83","6.60","6.83","6.51","803.20K","3.48%"
"Nov 14, 2017","6.71","6.77","6.80","6.60","1.71M","-1.76%"
"Nov 16, 2017","6.85","6.69","6.98","6.69","1.29M","2.09%"
"Nov 17, 2017","6.85","6.85","6.90","6.79","1.08M","0.00%"
"Nov 21, 2017","7.09","6.90","7.09","6.86","1.91M","3.50%"
"Nov 22, 2017","7.06","7.05","7.12","7.00","1.47M","-0.42%"
"Nov 23, 2017","6.96","7.01","7.04","6.84","618.40K","-1.42%"
"Nov 24, 2017","7.05","6.95","7.05","6.94","515.20K","1.29%"
"Nov 27, 2017","6.89","6.99","7.01","6.85","720.10K","-2.27%"
"Nov 28, 2017","7.00","6.93","7.13","6.90","3.55M","1.60%"
"Nov 29, 2017","6.96","6.95","7.02","6.75","1.57M","-0.57%"
"Nov 30, 2017","6.85","6.91","6.91","6.75","1.94M","-1.58%"
"Dec 01, 2017","6.88","6.77","6.92","6.72","1.84M","0.44%"
"Dec 04, 2017","7.14","6.89","7.20","6.87","4.91M","3.78%"
"Dec 05, 2017","6.90","7.15","7.27","6.90","2.12M","-3.36%"
"Dec 06, 2017","6.95","6.88","7.04","6.80","1.30M","0.72%"
"Dec 07, 2017","6.85","6.87","6.92","6.66","1.75M","-1.44%"
"Dec 08, 2017","6.74","6.87","6.92","6.73","1.06M","-1.61%"
"Dec 11, 2017","6.78","6.76","6.85","6.71","1.30M","0.59%"
"Dec 12, 2017","7.00","6.78","7.00","6.66","1.43M","3.24%"
"Dec 13, 2017","6.84","7.00","7.21","6.80","3.31M","-2.29%"
"Dec 14, 2017","6.86","6.84","6.86","6.66","1.08M","0.29%"
"Dec 15, 2017","6.75","6.79","6.92","6.75","1.94M","-1.60%"
"Dec 18, 2017","6.73","6.80","6.85","6.67","1.73M","-0.30%"
"Dec 19, 2017","6.73","6.70","6.78","6.61","1.86M","0.00%"
"Dec 20, 2017","6.82","6.75","6.86","6.71","1.83M","1.34%"
"Dec 21, 2017","6.82","6.77","6.82","6.73","1.99M","0.00%"
"Dec 22, 2017","6.89","6.78","6.95","6.74","11.54M","1.03%"
"Dec 26, 2017","7.08","6.87","7.17","6.84","914.90K","2.76%"
"Dec 27, 2017","7.11","7.12","7.19","7.05","727.50K","0.42%"
"Dec 28, 2017","7.32","7.14","7.32","7.10","1.43M","2.95%"
"Jan 02, 2018","7.30","7.33","7.37","7.21","1.05M","-0.27%"
"Jan 03, 2018","7.22","7.26","7.42","7.21","1.05M","-1.10%"
"Jan 04, 2018","7.22","7.26","7.32","7.16","1.85M","0.00%"
"Jan 05, 2018","7.28","7.25","7.35","7.19","762.20K","0.83%"
"Jan 08, 2018","7.15","7.28","7.29","7.09","1.38M","-1.79%"
"Jan 09, 2018","7.06","7.16","7.16","7.00","1.28M","-1.26%"
"Jan 10, 2018","7.05","7.02","7.07","6.98","698.80K","-0.14%"
"Jan 11, 2018","7.06","7.05","7.10","6.95","1.03M","0.14%"
"Jan 12, 2018","6.88","7.00","7.04","6.88","1.37M","-2.55%"
"Jan 15, 2018","6.84","6.93","6.94","6.81","911.10K","-0.58%"
"Jan 16, 2018","6.71","6.87","6.89","6.71","1.04M","-1.90%"
"Jan 17, 2018","6.85","6.71","6.85","6.70","823.20K","2.09%"
"Jan 18, 2018","6.69","6.89","6.89","6.69","1.02M","-2.34%"
"Jan 19, 2018","6.70","6.73","6.77","6.69","895.60K","0.15%"
"Jan 22, 2018","6.60","6.70","6.77","6.60","1.04M","-1.49%"
"Jan 23, 2018","6.42","6.62","6.66","6.38","1.26M","-2.73%"
"Jan 24, 2018","6.87","6.45","6.87","6.44","2.29M","7.01%"
"Jan 26, 2018","6.76","6.88","6.88","6.75","1.17M","-1.60%"
"Jan 29, 2018","6.79","6.77","6.84","6.69","731.70K","0.44%"
"Jan 30, 2018","6.85","6.75","6.89","6.75","1.56M","0.88%"
"Jan 31, 2018","6.81","6.93","7.02","6.81","1.67M","-0.58%"
"Feb 01, 2018","6.80","6.80","6.97","6.70","1.34M","-0.15%"
"Feb 02, 2018","6.64","6.74","6.74","6.62","1.13M","-2.35%"
"Feb 05, 2018","6.54","6.65","6.73","6.54","1.00M","-1.51%"
"Feb 06, 2018","6.70","6.53","6.72","6.40","2.03M","2.45%"
"Feb 07, 2018","6.50","6.70","6.70","6.50","1.45M","-2.99%"
"Feb 08, 2018","6.42","6.52","6.56","6.40","1.47M","-1.23%"
"Feb 09, 2018","6.42","6.42","6.47","6.19","1.35M","0.00%"
"Feb 14, 2018","6.27","6.45","6.52","6.27","2.15M","-2.34%"
"Feb 15, 2018","6.21","6.35","6.35","6.15","1.63M","-0.96%"
"Feb 16, 2018","6.09","6.26","6.26","6.08","2.00M","-1.93%"
"Feb 19, 2018","6.18","6.14","6.19","6.09","670.60K","1.48%"
"Feb 20, 2018","6.06","6.20","6.20","6.06","1.24M","-1.94%"
"Feb 21, 2018","6.20","6.12","6.20","6.07","2.62M","2.31%"
"Feb 22, 2018","6.10","6.19","6.19","6.09","1.26M","-1.61%"
"Feb 23, 2018","6.08","6.13","6.16","6.04","1.48M","-0.33%"
"Feb 26, 2018","6.12","6.11","6.15","6.08","1.09M","0.66%"
"Feb 27, 2018","6.04","6.12","6.13","6.03","995.20K","-1.31%"
"Feb 28, 2018","5.97","6.04","6.10","5.97","1.34M","-1.16%"
"Mar 01, 2018","6.10","6.00","6.17","5.99","1.41M","2.18%"
"Mar 02, 2018","6.32","6.11","6.32","6.08","1.45M","3.61%"
"Mar 05, 2018","6.26","6.28","6.28","6.17","1.67M","-0.95%"
"Mar 06, 2018","5.99","6.22","6.25","5.93","1.61M","-4.31%"
"Mar 07, 2018","5.78","5.98","6.09","5.67","2.58M","-3.51%"
"Mar 08, 2018","5.76","5.83","5.87","5.71","634.70K","-0.35%"
"Mar 09, 2018","5.99","5.79","6.00","5.75","973.70K","3.99%"
"Mar 12, 2018","6.07","6.02","6.07","5.94","627.70K","1.34%"
"Mar 13, 2018","6.10","6.06","6.11","5.95","1.09M","0.49%"
"Mar 14, 2018","6.01","6.10","6.16","5.99","1.29M","-1.48%"
"Mar 15, 2018","5.65","5.98","5.98","5.65","2.49M","-5.99%"
"Mar 16, 2018","5.65","5.71","5.72","5.56","2.60M","0.00%"
"Mar 19, 2018","5.58","5.61","5.65","5.52","1.15M","-1.24%"
"Mar 20, 2018","5.53","5.60","5.67","5.53","1.02M","-0.90%"
"Mar 21, 2018","5.65","5.56","5.66","5.51","1.86M","2.17%"
"Mar 22, 2018","5.70","5.67","5.83","5.60","1.12M","0.88%"
"Mar 23, 2018","5.70","5.67","5.79","5.59","1.97M","0.00%"
"Mar 26, 2018","5.90","5.73","5.90","5.73","1.58M","3.51%"
"Mar 27, 2018","5.63","5.87","5.94","5.60","2.14M","-4.58%"
"Mar 28, 2018","5.83","5.63","5.94","5.61","1.97M","3.55%"
"Mar 29, 2018","5.94","5.84","5.94","5.79","903.50K","1.89%"
"Apr 02, 2018","5.83","5.91","5.98","5.78","1.42M","-1.85%"
"Apr 03, 2018","5.95","5.89","6.09","5.84","1.57M","2.06%"
"Apr 04, 2018","6.06","5.90","6.24","5.84","3.03M","1.85%"
"Apr 05, 2018","6.25","6.16","6.30","6.08","2.15M","3.14%"
"Apr 06, 2018","6.22","6.25","6.37","6.07","1.86M","-0.48%"
"Apr 09, 2018","7.39","6.55","7.47","6.55","10.61M","18.81%"
"Apr 10, 2018","8.70","7.90","8.94","7.90","16.76M","17.73%"
"Apr 11, 2018","8.20","8.76","9.43","7.98","15.00M","-5.75%"
"Apr 12, 2018","8.32","8.20","8.50","8.11","5.51M","1.46%"
"Apr 13, 2018","8.30","8.36","8.62","8.14","5.05M","-0.24%"
"Apr 16, 2018","8.20","8.31","8.40","8.12","4.90M","-1.20%"
"Apr 17, 2018","8.13","8.17","8.27","8.06","2.34M","-0.85%"
"Apr 18, 2018","8.08","7.75","8.27","7.50","5.77M","-0.62%"
"Apr 19, 2018","7.97","8.12","8.19","7.79","3.05M","-1.36%"
"Apr 20, 2018","8.16","7.88","8.25","7.80","2.73M","2.38%"
"Apr 23, 2018","8.18","8.15","8.37","8.02","2.47M","0.25%"
"Apr 24, 2018","8.08","8.25","8.27","7.95","1.61M","-1.22%"
"Apr 25, 2018","7.87","8.00","8.04","7.86","4.21M","-2.60%"
"Apr 26, 2018","8.00","7.91","8.06","7.87","5.01M","1.65%"
"Apr 27, 2018","7.98","8.06","8.09","7.94","12.22M","-0.25%"
"Apr 30, 2018","7.92","7.91","8.05","7.84","2.13M","-0.75%"
"May 02, 2018","7.80","7.84","7.95","7.70","1.95M","-1.52%"
"May 03, 2018","7.59","7.77","7.86","7.56","1.53M","-2.69%"
"May 04, 2018","7.96","7.62","7.96","7.51","2.82M","4.87%"
"May 07, 2018","7.73","7.89","7.93","7.60","1.96M","-2.89%"
"May 08, 2018","7.66","7.72","7.85","7.63","2.45M","-0.91%"
"May 09, 2018","8.17","7.96","8.36","7.96","5.67M","6.66%"
"May 10, 2018","8.07","8.26","8.50","7.92","4.66M","-1.22%"
"May 11, 2018","7.89","8.16","8.16","7.86","1.38M","-2.23%"
"May 14, 2018","7.86","7.96","7.96","7.58","2.36M","-0.38%"
"May 15, 2018","7.93","7.66","8.05","7.61","3.11M","0.89%"
"May 16, 2018","8.07","7.93","8.16","7.87","2.37M","1.77%"
"May 17, 2018","7.83","8.03","8.04","7.78","2.26M","-2.97%"
"May 18, 2018","7.88","7.77","7.93","7.39","3.53M","0.64%"
"May 21, 2018","7.67","7.89","7.99","7.61","2.25M","-2.66%"
"May 22, 2018","7.90","7.70","7.95","7.65","6.57M","3.00%"
"May 23, 2018","8.50","8.11","8.87","8.05","9.46M","7.59%"
"May 24, 2018","8.35","8.40","8.62","8.07","4.27M","-1.76%"
"May 25, 2018","8.25","8.35","8.47","8.09","1.83M","-1.20%"
"May 28, 2018","8.07","8.06","8.15","7.84","1.05M","-2.18%"
"May 29, 2018","8.09","8.16","8.25","7.86","2.79M","0.25%"
"May 30, 2018","7.91","8.02","8.21","7.79","3.15M","-2.22%"
"Jun 01, 2018","7.98","7.93","8.07","7.57","2.67M","0.88%"
"Jun 04, 2018","8.10","8.00","8.15","7.91","2.90M","1.50%"
"Jun 05, 2018","8.00","7.97","8.14","7.94","2.64M","-1.23%"
"Jun 06, 2018","8.10","8.21","8.25","7.98","2.51M","1.25%"
"Jun 07, 2018","8.04","8.10","8.15","7.55","7.52M","-0.74%"
"Jun 08, 2018","8.34","8.02","8.58","7.96","7.09M","3.73%"
"Jun 11, 2018","8.19","8.31","8.47","8.03","3.10M","-1.80%"
"Jun 12, 2018","8.45","8.10","8.51","8.10","2.58M","3.17%"
"Jun 13, 2018","8.50","8.45","8.67","8.22","5.75M","0.59%"
"Jun 14, 2018","8.41","8.38","8.54","8.25","2.34M","-1.06%"
"Jun 15, 2018","8.23","8.30","8.48","8.17","4.87M","-2.14%"
"Jun 18, 2018","8.20","8.20","8.26","8.03","1.33M","-0.36%"
"Jun 19, 2018","8.14","8.10","8.30","8.04","1.90M","-0.73%"
"Jun 20, 2018","8.00","7.96","8.24","7.86","2.91M","-1.72%"
"Jun 21, 2018","7.80","7.90","7.98","7.74","2.41M","-2.50%"
"Jun 22, 2018","7.98","7.79","8.17","7.74","2.92M","2.31%"
"Jun 25, 2018","8.09","7.98","8.24","7.85","2.67M","1.38%"
"Jun 26, 2018","7.95","8.03","8.13","7.88","1.88M","-1.73%"
"Jun 27, 2018","8.01","8.31","8.52","7.93","4.70M","0.75%"
"Jun 28, 2018","8.11","8.03","8.25","8.03","2.73M","1.25%"
"Jun 29, 2018","8.14","8.18","8.20","7.90","3.48M","0.37%"
"Jul 02, 2018","8.17","8.15","8.28","8.01","1.55M","0.37%"
"Jul 03, 2018","8.21","8.25","8.33","8.10","1.07M","0.49%"
"Jul 04, 2018","8.64","8.25","8.76","8.14","1.58M","5.24%"
"Jul 05, 2018","8.58","8.56","8.76","8.46","2.25M","-0.69%"
"Jul 06, 2018","8.33","8.65","8.65","8.25","1.60M","-2.91%"
"Jul 10, 2018","8.34","8.30","8.48","8.23","5.19M","0.12%"
"Jul 11, 2018","8.22","8.26","8.38","8.09","1.25M","-1.44%"
"Jul 12, 2018","8.18","8.19","8.32","8.08","1.78M","-0.49%"
"Jul 13, 2018","8.05","8.19","8.21","8.02","1.41M","-1.59%"
"Jul 16, 2018","7.91","8.09","8.11","7.81","1.82M","-1.74%"
"Jul 17, 2018","8.24","7.95","8.42","7.84","14.05M","4.17%"
"Jul 18, 2018","8.05","8.23","8.25","8.00","1.62M","-2.31%"
"Jul 19, 2018","8.01","8.00","8.04","7.88","1.13M","-0.50%"
"Jul 20, 2018","8.12","8.08","8.29","8.04","1.32M","1.37%"
"Jul 23, 2018","7.96","8.12","8.17","7.91","3.34M","-1.97%"
"Jul 24, 2018","8.00","8.04","8.07","7.85","2.47M","0.50%"
"Jul 25, 2018","8.16","7.98","8.20","7.98","2.76M","2.00%"
"Jul 26, 2018","7.95","8.09","8.12","7.89","1.38M","-2.57%"
"Jul 27, 2018","7.90","7.96","8.04","7.85","3.26M","-0.63%"
"Jul 30, 2018","8.14","8.05","8.39","8.04","5.45M","3.04%"
"Jul 31, 2018","8.20","8.20","8.30","8.10","3.77M","0.74%"
"Aug 01, 2018","8.13","8.21","8.41","7.94","3.70M","-0.85%"
"Aug 02, 2018","8.12","8.10","8.18","7.96","1.53M","-0.12%"
"Aug 03, 2018","8.23","8.15","8.27","8.08","1.31M","1.35%"
"Aug 06, 2018","8.10","8.27","8.27","8.07","1.60M","-1.58%"
"Aug 07, 2018","7.80","8.10","8.13","7.75","3.19M","-3.70%"
"Aug 08, 2018","7.47","7.85","7.91","7.46","3.59M","-4.23%"
"Aug 09, 2018","7.17","7.50","7.58","7.08","5.21M","-4.02%"
"Aug 10, 2018","7.17","7.17","7.27","6.80","6.48M","0.00%"
"Aug 13, 2018","7.48","7.14","7.48","7.03","2.82M","4.32%"
"Aug 14, 2018","7.16","7.50","7.53","7.08","6.33M","-4.28%"
"Aug 15, 2018","6.70","7.12","7.13","6.70","7.65M","-6.42%"
"Aug 16, 2018","6.88","6.78","6.93","6.65","3.27M","2.69%"
"Aug 17, 2018","6.24","7.38","7.45","6.17","16.12M","-9.30%"
"Aug 20, 2018","6.46","6.35","6.50","6.14","10.49M","3.53%"
"Aug 21, 2018","6.44","6.50","6.55","6.17","13.79M","-0.31%"
"Aug 22, 2018","6.46","6.38","6.46","6.21","19.07M","0.31%"
"Aug 23, 2018","6.35","6.38","6.41","6.29","7.08M","-1.70%"
"Aug 24, 2018","6.30","6.40","6.42","6.20","3.20M","-0.79%"
"Aug 27, 2018","6.19","6.24","6.25","6.10","4.08M","-1.75%"
"Aug 28, 2018","5.94","6.24","6.24","5.80","11.52M","-4.04%"
"Aug 29, 2018","6.00","5.96","6.05","5.90","3.90M","1.01%"
"Aug 30, 2018","5.81","5.97","5.99","5.81","2.34M","-3.17%"
"Aug 31, 2018","5.72","5.82","5.90","5.72","3.24M","-1.55%"
"Sep 03, 2018","5.60","5.74","5.74","5.57","3.07M","-2.10%"
"Sep 04, 2018","5.73","5.65","5.79","5.44","5.62M","2.32%"
"Sep 05, 2018","5.64","5.70","5.82","5.62","2.10M","-1.57%"
"Sep 06, 2018","5.70","5.70","5.76","5.57","2.16M","1.06%"
"Sep 10, 2018","5.67","5.75","5.79","5.63","1.56M","-0.53%"
"Sep 11, 2018","5.50","5.60","5.67","5.45","1.86M","-3.00%"
"Sep 12, 2018","5.40","5.57","5.58","5.37","1.78M","-1.82%"
"Sep 13, 2018","5.12","5.43","5.46","5.12","2.98M","-5.19%"
"Sep 14, 2018","5.11","5.16","5.25","5.02","4.00M","-0.20%"
"Sep 17, 2018","5.22","5.13","5.22","5.04","3.50M","2.15%"
"Sep 18, 2018","5.24","5.23","5.28","5.15","2.97M","0.38%"
"Sep 19, 2018","5.15","5.22","5.25","5.08","2.18M","-1.72%"
"Sep 20, 2018","5.10","5.18","5.19","5.08","2.39M","-0.97%"
"Sep 21, 2018","5.26","5.15","5.43","5.10","3.29M","3.14%"
"Sep 24, 2018","5.15","5.25","5.33","5.08","3.99M","-2.09%"
"Sep 25, 2018","5.13","5.10","5.18","5.05","1.67M","-0.39%"
"Sep 26, 2018","5.22","5.14","5.30","5.14","1.84M","1.75%"
"Sep 27, 2018","5.39","5.21","5.43","5.21","6.64M","3.26%"
"Sep 28, 2018","5.30","5.28","5.37","5.25","1.39M","-1.67%"
"Oct 01, 2018","5.20","5.25","5.28","5.15","1.97M","-1.89%"
"Oct 02, 2018","5.28","5.25","5.42","5.24","4.74M","1.54%"
"Oct 03, 2018","5.23","5.35","5.40","5.23","4.95M","-0.95%"
"Oct 04, 2018","5.18","5.21","5.25","5.13","2.51M","-0.96%"
"Oct 05, 2018","5.17","5.22","5.25","5.09","2.95M","-0.19%"
"Oct 08, 2018","5.40","5.27","5.45","5.27","5.31M","4.45%"
"Oct 09, 2018","5.81","5.41","5.87","5.41","6.00M","7.59%"
"Oct 10, 2018","5.69","5.77","5.82","5.61","3.09M","-2.07%"
"Oct 11, 2018","5.57","5.80","5.80","5.51","2.86M","-2.11%"
"Oct 15, 2018","5.63","5.66","5.70","5.56","1.99M","1.08%"
"Oct 16, 2018","5.87","5.69","5.87","5.66","19.58M","4.26%"
"Oct 17, 2018","6.15","5.90","6.23","5.90","4.71M","4.77%"
"Oct 18, 2018","6.03","6.20","6.26","6.01","2.59M","-1.95%"
"Oct 19, 2018","6.04","6.09","6.14","5.93","3.11M","0.17%"
"Oct 22, 2018","6.18","6.12","6.18","6.07","6.04M","2.32%"
"Oct 23, 2018","6.25","6.18","6.28","6.08","2.86M","1.13%"
"Oct 24, 2018","6.21","6.30","6.35","6.17","2.70M","-0.64%"
"Oct 25, 2018","6.19","6.26","6.35","6.13","3.78M","-0.32%"
"Oct 26, 2018","6.32","6.28","6.36","6.19","2.68M","2.10%"
"Oct 29, 2018","6.20","6.42","6.53","6.04","2.92M","-1.90%"
"Oct 30, 2018","6.37","6.33","6.40","6.24","2.54M","2.74%"
"Oct 31, 2018","6.41","6.40","6.48","6.31","2.48M","0.63%"
"Nov 01, 2018","6.50","6.45","6.55","6.41","1.85M","1.40%"
"Nov 05, 2018","6.58","6.56","6.58","6.50","3.35M","1.23%"
"Nov 06, 2018","6.66","6.60","6.71","6.50","3.52M","1.22%"
"Nov 07, 2018","6.50","6.57","6.77","6.44","4.83M","-2.40%"
"Nov 08, 2018","6.36","6.53","6.56","6.23","3.76M","-2.15%"
"Nov 09, 2018","6.30","6.36","6.36","6.07","3.69M","-0.94%"
"Nov 12, 2018","6.31","6.27","6.31","6.19","2.40M","0.16%"
"Nov 13, 2018","6.18","6.31","6.41","6.12","3.79M","-2.06%"
"Nov 14, 2018","6.26","6.22","6.26","6.10","3.26M","1.29%"
"Nov 16, 2018","6.33","6.26","6.33","6.19","3.00M","1.12%"
"Nov 19, 2018","6.23","6.30","6.30","6.15","2.40M","-1.58%"
"Nov 21, 2018","6.22","6.18","6.27","6.11","3.56M","-0.16%"
"Nov 22, 2018","6.38","6.28","6.44","6.21","1.83M","2.57%"
"Nov 23, 2018","6.27","6.41","6.47","6.20","2.44M","-1.72%"
"Nov 26, 2018","6.08","6.31","6.32","6.08","4.05M","-3.03%"
"Nov 27, 2018","6.13","6.14","6.20","6.01","4.00M","0.82%"
"Nov 28, 2018","6.20","6.15","6.23","6.11","1.64M","1.14%"
"Nov 29, 2018","6.20","6.15","6.27","6.14","2.14M","0.00%"
"Nov 30, 2018","6.20","6.20","6.28","6.16","1.86M","0.00%"
"Dec 03, 2018","6.36","6.33","6.54","6.33","2.65M","2.58%"
"Dec 04, 2018","6.25","6.41","6.41","6.21","4.04M","-1.73%"
"Dec 05, 2018","6.33","6.28","6.34","6.20","3.34M","1.28%"
"Dec 06, 2018","6.34","6.22","6.34","6.20","3.07M","0.16%"
"Dec 07, 2018","6.26","6.31","6.39","6.21","2.00M","-1.26%"
"Dec 10, 2018","5.92","6.25","6.25","5.92","3.16M","-5.43%"
"Dec 11, 2018","5.89","6.00","6.02","5.68","4.41M","-0.51%"
"Dec 12, 2018","5.80","5.92","6.01","5.80","2.54M","-1.53%"
"Dec 13, 2018","5.81","5.82","5.87","5.76","1.40M","0.17%"
"Dec 14, 2018","5.76","5.81","5.83","5.75","1.05M","-0.86%"
"Dec 17, 2018","5.57","5.76","5.77","5.54","1.47M","-3.30%"
"Dec 18, 2018","5.45","5.58","5.65","5.45","1.83M","-2.15%"
"Dec 19, 2018","5.36","5.49","5.55","5.36","1.79M","-1.65%"
"Dec 20, 2018","5.30","5.42","5.46","5.24","2.99M","-1.12%"
"Dec 21, 2018","5.34","5.30","5.41","5.29","2.01M","0.75%"
"Dec 26, 2018","5.56","5.37","5.75","5.31","5.04M","4.12%"
"Dec 27, 2018","5.45","5.61","5.61","5.41","1.83M","-1.98%"
"Dec 28, 2018","5.46","5.50","5.55","5.38","2.52M","0.18%"
"Jan 02, 2019","5.65","5.48","5.65","5.44","3.20M","3.48%"
"Jan 03, 2019","5.69","5.61","5.69","5.55","1.80M","0.71%"
"Jan 04, 2019","5.68","5.70","5.75","5.63","2.19M","-0.18%"
"Jan 07, 2019","5.58","5.68","5.68","5.50","2.65M","-1.76%"
"Jan 08, 2019","5.56","5.58","5.59","5.46","3.38M","-0.36%"
"Jan 09, 2019","5.59","5.58","5.72","5.54","2.30M","0.54%"
"Jan 10, 2019","5.51","5.54","5.69","5.51","2.37M","-1.43%"
"Jan 11, 2019","5.55","5.53","5.59","5.50","1.43M","0.73%"
"Jan 14, 2019","5.72","5.51","5.72","5.51","1.60M","3.06%"
"Jan 15, 2019","5.72","5.75","5.95","5.70","4.67M","0.00%"
"Jan 16, 2019","5.65","5.74","5.78","5.55","3.81M","-1.22%"
"Jan 17, 2019","5.78","5.66","5.87","5.62","6.42M","2.30%"
"Jan 18, 2019","6.03","5.82","6.06","5.80","5.27M","4.33%"
"Jan 21, 2019","6.03","6.05","6.11","5.94","2.84M","0.00%"
"Jan 22, 2019","5.70","6.06","6.10","5.70","5.20M","-5.47%"
"Jan 23, 2019","5.72","5.75","5.81","5.62","4.88M","0.35%"
"Jan 24, 2019","5.87","5.76","5.93","5.70","4.08M","2.62%"
"Jan 28, 2019","5.80","5.88","5.98","5.80","4.50M","-1.19%"
"Jan 29, 2019","5.91","5.85","5.93","5.81","2.71M","1.90%"
"Jan 30, 2019","6.25","5.95","6.25","5.94","6.52M","5.75%"
"Jan 31, 2019","6.08","6.27","6.30","6.08","5.54M","-2.72%"
"Feb 01, 2019","6.40","6.15","6.40","6.10","5.05M","5.26%"
"Feb 04, 2019","6.60","6.39","6.68","6.35","7.82M","3.12%"
"Feb 05, 2019","6.69","6.62","6.70","6.57","3.26M","1.36%"
"Feb 06, 2019","6.26","6.67","6.67","6.26","3.73M","-6.43%"
"Feb 07, 2019","6.03","6.31","6.39","6.03","5.12M","-3.67%"
"Feb 08, 2019","5.93","6.03","6.18","5.89","4.37M","-1.66%"
"Feb 11, 2019","5.71","5.99","6.00","5.68","3.65M","-3.71%"
"Feb 12, 2019","5.58","5.79","5.81","5.58","3.87M","-2.28%"
"Feb 13, 2019","5.61","5.63","5.64","5.53","4.15M","0.54%"
"Feb 14, 2019","5.58","5.60","5.65","5.48","4.27M","-0.53%"
"Feb 15, 2019","5.80","5.59","5.85","5.58","4.18M","3.94%"
"Feb 18, 2019","5.65","5.80","5.85","5.65","2.65M","-2.59%"
"Feb 19, 2019","5.68","5.67","5.75","5.63","4.29M","0.53%"
"Feb 20, 2019","5.62","5.73","5.76","5.62","3.50M","-1.06%"
"Feb 21, 2019","5.58","5.66","5.68","5.56","2.81M","-0.71%"
"Feb 22, 2019","5.48","5.64","5.66","5.39","4.09M","-1.79%"
"Feb 25, 2019","5.49","5.50","5.59","5.46","3.88M","0.18%"
"Feb 26, 2019","5.45","5.51","5.55","5.43","4.02M","-0.73%"
"Feb 27, 2019","5.38","5.47","5.47","5.36","5.41M","-1.28%"
"Feb 28, 2019","5.50","5.57","5.76","5.48","8.15M","2.23%"
"Mar 01, 2019","5.59","5.56","5.70","5.49","4.41M","1.64%"
"Mar 06, 2019","5.60","5.59","5.66","5.51","2.33M","0.18%"
"Mar 07, 2019","5.66","5.59","5.69","5.54","3.30M","1.07%"
"Mar 08, 2019","5.63","5.64","5.69","5.60","2.02M","-0.53%"
"Mar 11, 2019","5.63","5.66","5.70","5.61","2.51M","0.00%"
"Mar 12, 2019","5.99","5.68","6.03","5.68","8.64M","6.39%"
"Mar 13, 2019","5.91","6.04","6.09","5.77","6.98M","-1.34%"
"Mar 14, 2019","5.91","5.90","5.94","5.80","3.71M","0.00%"
"Mar 15, 2019","6.00","5.90","6.10","5.88","4.80M","1.52%"
"Mar 18, 2019","6.24","6.08","6.30","6.03","4.80M","4.00%"
"Mar 19, 2019","6.12","6.26","6.34","6.12","4.85M","-1.92%"
"Mar 20, 2019","6.10","6.13","6.23","6.10","3.78M","-0.33%"
"Mar 21, 2019","5.94","6.06","6.13","5.90","4.01M","-2.62%"
"Mar 22, 2019","5.72","5.81","5.85","5.72","3.55M","-3.70%"
"Mar 25, 2019","5.84","5.71","5.92","5.67","3.59M","2.10%"
"Mar 26, 2019","5.97","5.95","6.01","5.84","3.12M","2.23%"
"Mar 27, 2019","5.73","5.90","5.90","5.73","3.85M","-4.02%"
"Mar 28, 2019","5.98","5.71","5.98","5.70","3.90M","4.36%"
"Mar 29, 2019","5.98","6.02","6.17","5.93","3.68M","0.00%"
"Apr 01, 2019","6.05","6.03","6.07","5.93","2.27M","1.17%"
"Apr 02, 2019","5.91","6.05","6.06","5.91","2.20M","-2.31%"
"Apr 03, 2019","5.90","5.97","6.05","5.86","2.58M","-0.17%"
"Apr 04, 2019","6.23","5.89","6.23","5.89","5.70M","5.59%"
"Apr 05, 2019","6.66","6.28","6.66","6.25","7.19M","6.90%"
"Apr 08, 2019","6.80","6.64","6.90","6.55","4.76M","2.10%"
"Apr 09, 2019","6.77","6.75","6.90","6.66","3.75M","-0.44%"
"Apr 10, 2019","6.80","6.90","6.98","6.75","3.84M","0.44%"
"Apr 11, 2019","6.72","6.76","6.88","6.67","2.76M","-1.18%"
"Apr 12, 2019","6.51","6.67","6.77","6.50","3.66M","-3.12%"
"Apr 15, 2019","6.74","6.53","6.74","6.42","3.24M","3.53%"
"Apr 16, 2019","7.24","6.75","7.24","6.69","9.31M","7.42%"
"Apr 17, 2019","7.11","7.22","7.30","7.01","7.11M","-1.80%"
"Apr 18, 2019","6.93","7.16","7.20","6.92","3.32M","-2.53%"
"Apr 22, 2019","7.03","6.91","7.12","6.89","2.72M","1.44%"
"Apr 23, 2019","7.52","7.10","7.52","7.10","5.34M","6.97%"
"Apr 24, 2019","7.08","7.57","7.59","7.08","6.01M","-5.85%"
"Apr 25, 2019","7.45","7.10","7.47","7.08","5.15M","5.23%"
"Apr 26, 2019","7.20","7.40","7.42","7.11","4.43M","-3.36%"
"Apr 29, 2019","7.20","7.31","7.32","7.14","3.40M","0.00%"
"Apr 30, 2019","7.32","7.20","7.32","7.20","3.40M","1.67%"
"May 02, 2019","7.16","7.23","7.34","7.12","1.63M","-2.19%"
"May 03, 2019","7.11","7.22","7.30","7.11","4.14M","-0.70%"
"May 06, 2019","7.00","7.04","7.09","6.92","3.45M","-1.55%"
"May 07, 2019","6.82","7.02","7.07","6.81","2.78M","-2.57%"
"May 08, 2019","6.75","6.87","6.92","6.73","2.59M","-1.03%"
"May 09, 2019","6.50","6.71","6.76","6.43","4.48M","-3.70%"
"May 10, 2019","6.37","6.50","6.56","6.37","2.55M","-2.00%"
"May 13, 2019","6.32","6.28","6.49","6.24","6.10M","-0.78%"
"May 14, 2019","6.49","6.42","6.54","6.13","5.98M","2.69%"
"May 15, 2019","6.35","6.41","6.47","6.29","4.08M","-2.16%"
"May 16, 2019","6.85","6.52","6.95","6.47","11.61M","7.87%"
"May 17, 2019","6.75","7.01","7.22","6.67","11.29M","-1.46%"
"May 20, 2019","7.18","6.82","7.18","6.53","11.32M","6.37%"
"May 21, 2019","7.04","7.19","7.22","7.00","7.62M","-1.95%"
"May 22, 2019","6.83","7.07","7.09","6.82","4.51M","-2.98%"
"May 23, 2019","6.79","6.83","6.98","6.78","3.20M","-0.59%"
"May 24, 2019","7.01","6.91","7.05","6.88","3.96M","3.24%"
"May 27, 2019","7.08","7.08","7.12","7.02","2.62M","1.00%"
"May 28, 2019","6.94","7.09","7.13","6.94","4.82M","-1.98%"
"May 29, 2019","6.78","6.90","6.94","6.65","5.75M","-2.31%"
"May 30, 2019","6.78","6.80","7.04","6.75","6.38M","0.00%"
"May 31, 2019","6.83","7.05","7.30","6.82","26.16M","0.74%"
"Jun 03, 2019","6.54","6.96","6.99","6.54","26.50M","-4.25%"
"Jun 04, 2019","6.77","6.52","6.82","6.47","4.37M","3.52%"
"Jun 05, 2019","6.59","6.80","6.86","6.59","2.62M","-2.66%"
"Jun 06, 2019","6.59","6.68","6.71","6.53","2.67M","0.00%"
"Jun 07, 2019","6.56","6.60","6.66","6.46","4.44M","-0.46%"
"Jun 10, 2019","6.57","6.55","6.66","6.46","3.54M","0.15%"
"Jun 11, 2019","6.52","6.63","6.68","6.48","3.11M","-0.76%"
"Jun 12, 2019","6.51","6.50","6.52","6.43","2.53M","-0.15%"
"Jun 13, 2019","6.80","6.57","6.87","6.55","6.66M","4.45%"
"Jun 14, 2019","6.71","6.85","6.94","6.61","4.61M","-1.32%"
"Jun 17, 2019","6.72","6.74","6.78","6.67","2.14M","0.15%"
"Jun 18, 2019","6.61","6.76","6.77","6.60","3.33M","-1.64%"
"Jun 19, 2019","6.52","6.64","6.64","6.51","3.43M","-1.36%"
"Jun 21, 2019","6.55","6.58","6.60","6.52","4.18M","0.46%"
"Jun 24, 2019","6.62","6.57","6.67","6.56","9.93M","1.07%"
"Jun 25, 2019","6.53","6.62","6.64","6.53","3.08M","-1.36%"
"Jun 26, 2019","6.48","6.60","6.60","6.45","3.32M","-0.77%"
"Jun 27, 2019","6.35","6.46","6.47","6.32","5.86M","-2.01%"
"Jun 28, 2019","6.29","6.39","6.42","6.26","6.98M","-0.94%"
"Jul 01, 2019","6.48","6.37","6.57","6.31","6.18M","3.02%"
"Jul 02, 2019","6.45","6.54","6.60","6.35","5.58M","-0.46%"
"Jul 03, 2019","6.49","6.45","6.54","6.42","3.78M","0.62%"
"Jul 04, 2019","6.65","6.54","6.68","6.52","4.16M","2.47%"
"Jul 05, 2019","6.70","6.65","6.73","6.54","4.69M","0.75%"
"Jul 08, 2019","6.68","6.73","6.75","6.64","3.65M","-0.30%"
"Jul 10, 2019","6.88","6.71","6.90","6.71","5.34M","2.99%"
"Jul 11, 2019","6.79","6.88","6.91","6.75","4.25M","-1.31%"
"Jul 12, 2019","6.79","6.90","6.94","6.78","7.00M","0.00%"
"Jul 15, 2019","6.65","6.81","6.82","6.62","5.44M","-2.06%"
"Jul 16, 2019","6.50","6.67","6.69","6.47","4.39M","-2.26%"
"Jul 17, 2019","6.57","6.58","6.58","6.45","3.63M","1.08%"
"Jul 18, 2019","6.54","6.57","6.62","6.51","2.52M","-0.46%"
"Jul 19, 2019","6.45","6.57","6.57","6.45","3.44M","-1.38%"
"Jul 22, 2019","6.36","6.50","6.50","6.35","4.08M","-1.40%"
"Jul 23, 2019","6.42","6.41","6.47","6.36","4.32M","0.94%"
"Jul 24, 2019","6.50","6.47","6.58","6.40","4.61M","1.25%"
"Jul 25, 2019","6.55","6.55","6.58","6.45","4.36M","0.77%"
"Jul 26, 2019","6.59","6.60","6.65","6.56","4.35M","0.61%"
"Jul 29, 2019","6.57","6.66","6.66","6.53","2.18M","-0.30%"
"Jul 30, 2019","6.69","6.58","6.72","6.55","2.66M","1.83%"
"Jul 31, 2019","6.63","6.67","6.74","6.55","2.41M","-0.90%"
"Aug 01, 2019","6.69","6.67","6.85","6.65","5.05M","0.90%"
"Aug 02, 2019","6.81","6.66","6.86","6.48","5.36M","1.79%"
"Aug 05, 2019","6.88","6.71","6.88","6.65","7.13M","1.03%"
"Aug 06, 2019","7.39","7.04","7.42","7.00","14.52M","7.41%"
"Aug 07, 2019","7.51","7.37","7.55","7.22","9.28M","1.62%"
"Aug 08, 2019","7.68","7.55","7.85","7.52","7.20M","2.26%"
"Aug 09, 2019","7.80","7.71","7.84","7.61","6.69M","1.56%"
"Aug 12, 2019","8.08","7.76","8.16","7.70","16.11M","3.59%"
"Aug 13, 2019","7.90","8.10","8.28","7.74","7.72M","-2.23%"
"Aug 14, 2019","7.82","7.94","7.99","7.62","4.21M","-1.01%"
"Aug 15, 2019","7.77","7.97","7.98","7.57","17.10M","-0.64%"
"Aug 16, 2019","7.74","7.83","7.84","7.51","8.36M","-0.39%"
"Aug 19, 2019","7.65","7.81","7.92","7.58","3.38M","-1.16%"
"Aug 20, 2019","7.64","7.68","7.79","7.43","3.89M","-0.13%"
"Aug 21, 2019","7.86","7.71","7.86","7.57","4.09M","2.88%"
"Aug 22, 2019","8.18","7.92","8.18","7.79","7.87M","4.07%"
"Aug 23, 2019","7.98","8.07","8.32","7.78","7.19M","-2.44%"
"Aug 26, 2019","7.80","8.06","8.07","7.72","3.80M","-2.26%"
"Aug 27, 2019","7.69","7.77","7.92","7.69","4.50M","-1.41%"
"Aug 28, 2019","7.67","7.73","7.83","7.49","5.90M","-0.26%"
"Aug 29, 2019","8.19","7.69","8.22","7.62","6.22M","6.78%"
"Aug 30, 2019","8.35","8.22","8.49","8.22","5.53M","1.95%"
"Sep 02, 2019","8.34","8.45","8.49","8.27","2.17M","-0.12%"
"Sep 03, 2019","8.50","8.33","8.65","8.29","7.63M","1.92%"
"Sep 04, 2019","8.52","8.60","8.73","8.40","3.82M","0.24%"
"Sep 05, 2019","8.57","8.60","8.60","8.43","2.90M","0.59%"
"Sep 06, 2019","8.57","8.56","8.69","8.41","2.52M","0.00%"
"Sep 09, 2019","8.90","8.83","9.38","8.69","8.65M","3.85%"
"Sep 10, 2019","8.90","9.10","9.17","8.74","6.80M","0.00%"
"Sep 11, 2019","8.97","9.00","9.05","8.86","4.34M","0.79%"
"Sep 12, 2019","9.01","9.05","9.10","8.96","2.95M","0.45%"
"Sep 13, 2019","9.59","9.10","9.60","9.05","6.27M","6.44%"
"Sep 16, 2019","9.84","9.70","10.10","9.35","7.32M","2.61%"
"Sep 17, 2019","9.92","9.82","10.08","9.82","4.55M","0.81%"
"Sep 18, 2019","9.86","9.90","10.04","9.76","3.27M","-0.60%"
"Sep 19, 2019","10.53","9.92","10.75","9.91","9.76M","6.80%"
"Sep 20, 2019","11.00","10.49","11.00","10.49","6.53M","4.46%"
"Sep 23, 2019","11.04","11.07","11.36","10.85","6.82M","0.36%"
"Sep 24, 2019","11.34","11.11","11.43","10.97","6.43M","2.72%"
"Sep 25, 2019","11.25","11.40","12.10","11.06","13.41M","-0.79%"
"Sep 26, 2019","10.94","11.36","11.54","10.65","11.50M","-2.76%"
"Sep 27, 2019","10.99","10.97","11.09","10.79","5.97M","0.46%"
"Sep 30, 2019","11.02","10.99","11.21","10.87","4.14M","0.27%"
"Oct 01, 2019","11.65","11.07","11.79","10.99","9.15M","5.72%"
"Oct 02, 2019","11.66","11.59","11.95","11.31","12.93M","0.09%"
"Oct 03, 2019","11.62","11.76","11.85","11.42","5.96M","-0.34%"
"Oct 04, 2019","11.87","11.62","11.89","11.46","5.91M","2.15%"
"Oct 07, 2019","11.84","11.80","11.91","11.67","5.24M","-0.25%"
"Oct 08, 2019","11.47","11.82","11.94","11.44","3.69M","-3.12%"
"Oct 09, 2019","11.49","11.58","11.64","11.07","7.42M","0.17%"
"Oct 10, 2019","11.45","11.53","11.70","11.41","2.64M","-0.35%"
"Oct 11, 2019","11.66","11.45","11.73","11.37","2.98M","1.83%"
"Oct 14, 2019","11.51","11.64","11.72","11.37","2.90M","-1.29%"
"Oct 15, 2019","11.43","11.47","11.64","11.40","2.69M","-0.70%"
"Oct 16, 2019","11.43","11.46","11.53","11.32","5.35M","0.00%"
"Oct 17, 2019","11.57","11.47","11.90","11.45","5.98M","1.22%"
"Oct 18, 2019","11.65","11.60","11.87","11.60","2.94M","0.69%"
"Oct 21, 2019","11.55","11.79","11.79","11.49","2.37M","-0.86%"
"Oct 22, 2019","11.86","11.64","11.88","11.61","3.82M","2.68%"
"Oct 23, 2019","11.49","11.96","12.14","11.49","6.52M","-3.12%"
"Oct 24, 2019","11.25","11.52","11.64","11.19","3.82M","-2.09%"
"Oct 25, 2019","11.38","11.36","11.64","11.33","4.94M","1.16%"
"Oct 28, 2019","11.11","11.38","11.46","11.11","3.19M","-2.37%"
"Oct 29, 2019","11.10","11.18","11.26","10.96","3.41M","-0.09%"
"Oct 30, 2019","11.04","11.05","11.20","10.90","3.36M","-0.54%"
"Oct 31, 2019","10.75","11.05","11.08","10.71","3.78M","-2.63%"
"Nov 01, 2019","10.84","10.73","10.98","10.63","2.95M","0.84%"
"Nov 04, 2019","10.97","11.00","11.14","10.81","3.39M","1.20%"
"Nov 05, 2019","10.92","10.97","11.07","10.75","2.71M","-0.46%"
"Nov 06, 2019","10.90","10.89","11.08","10.82","4.71M","-0.18%"
"Nov 07, 2019","11.34","10.92","11.34","10.92","5.25M","4.04%"
"Nov 08, 2019","11.05","11.24","11.42","10.92","4.32M","-2.56%"
"Nov 11, 2019","11.24","10.95","11.24","10.76","4.61M","1.72%"
"Nov 12, 2019","10.79","11.50","11.68","10.77","9.03M","-4.00%"
"Nov 13, 2019","10.67","10.85","10.99","10.47","7.36M","-1.11%"
"Nov 14, 2019","10.44","10.70","10.78","10.29","5.42M","-2.16%"
"Nov 18, 2019","11.02","10.75","11.11","10.70","8.54M","5.56%"
"Nov 19, 2019","11.29","11.15","11.35","11.11","6.62M","2.45%"
"Nov 21, 2019","10.85","11.29","11.29","10.71","8.38M","-3.90%"
"Nov 22, 2019","10.69","10.85","10.88","10.58","6.68M","-1.47%"
"Nov 25, 2019","11.26","10.81","11.37","10.80","10.50M","5.33%"
"Nov 26, 2019","10.74","11.10","11.53","10.74","14.21M","-4.62%"
"Nov 27, 2019","10.77","10.83","11.00","10.63","7.84M","0.28%"
"Nov 28, 2019","10.79","10.82","11.00","10.77","3.81M","0.19%"
"Nov 29, 2019","10.70","10.83","10.96","10.64","3.95M","-0.83%"
"Dec 02, 2019","10.85","10.73","10.90","10.72","4.20M","1.40%"
"Dec 03, 2019","11.27","10.87","11.37","10.87","7.18M","3.87%"
"Dec 04, 2019","10.98","11.31","11.45","10.93","5.76M","-2.57%"
"Dec 05, 2019","11.07","10.98","11.17","10.98","3.02M","0.82%"
"Dec 06, 2019","11.10","11.15","11.21","11.09","2.68M","0.27%"
"Dec 09, 2019","10.87","11.11","11.14","10.80","5.16M","-2.07%"
"Dec 10, 2019","11.19","10.80","11.20","10.80","3.58M","2.94%"
"Dec 11, 2019","11.10","11.20","11.40","11.06","4.65M","-0.80%"
"Dec 12, 2019","10.97","11.11","11.29","10.85","4.36M","-1.17%"
"Dec 13, 2019","10.91","11.02","11.09","10.89","3.23M","-0.55%"
"Dec 16, 2019","10.87","10.95","11.05","10.81","3.98M","-0.37%"
"Dec 17, 2019","10.70","10.90","10.96","10.70","5.18M","-1.56%"
"Dec 18, 2019","10.25","10.30","10.42","10.11","27.29M","-4.21%"
"Dec 19, 2019","9.72","10.20","10.20","9.72","24.79M","-5.17%"
"Dec 20, 2019","9.49","9.80","9.99","9.37","33.52M","-2.37%"
"Dec 23, 2019","9.40","9.59","9.69","9.25","26.54M","-0.95%"
"Dec 26, 2019","9.69","9.55","9.75","9.42","25.26M","3.09%"
"Dec 27, 2019","9.76","9.82","9.90","9.62","17.34M","0.72%"
"Dec 30, 2019","9.96","9.82","10.00","9.70","17.49M","2.05%"
"Jan 02, 2020","10.06","10.08","10.18","9.98","14.75M","1.00%"
"Jan 03, 2020","10.28","9.90","10.34","9.69","18.44M","2.19%"
"Jan 06, 2020","10.09","10.20","10.25","10.03","10.90M","-1.85%"
"Jan 07, 2020","10.40","10.21","10.47","10.18","20.43M","3.07%"
"Jan 08, 2020","10.66","10.40","10.70","10.36","16.29M","2.50%"
"Jan 09, 2020","10.91","10.75","11.15","10.72","22.53M","2.35%"
"Jan 10, 2020","10.75","11.02","11.12","10.63","13.77M","-1.47%"
"Jan 13, 2020","11.05","10.85","11.05","10.80","10.36M","2.79%"
"Jan 14, 2020","11.36","11.18","11.48","11.17","14.56M","2.81%"
"Jan 15, 2020","11.91","11.40","11.96","11.40","22.11M","4.84%"
"Jan 16, 2020","12.10","11.99","12.56","11.85","24.47M","1.60%"
"Jan 17, 2020","12.10","12.10","12.44","11.93","13.90M","0.00%"
"Jan 20, 2020","12.27","12.21","12.39","12.06","8.95M","1.40%"
"Jan 21, 2020","12.35","12.24","12.48","12.16","8.74M","0.65%"
"Jan 22, 2020","12.10","12.30","12.30","11.66","27.53M","-2.02%"
"Jan 23, 2020","12.14","11.91","12.32","11.83","12.19M","0.33%"
"Jan 24, 2020","12.10","12.20","12.25","12.00","7.99M","-0.33%"
"Jan 27, 2020","11.22","11.56","11.68","11.22","13.47M","-7.27%"
"Jan 28, 2020","11.57","11.31","11.57","11.31","7.75M","3.12%"
"Jan 29, 2020","11.10","11.73","11.80","11.02","13.57M","-4.06%"
"Jan 30, 2020","10.82","10.90","10.91","10.54","14.56M","-2.52%"
"Jan 31, 2020","10.97","10.60","11.10","10.60","8.60M","1.39%"
"Feb 03, 2020","11.25","11.18","11.30","10.95","10.09M","2.55%"
"Feb 04, 2020","11.30","11.50","11.58","11.29","8.78M","0.44%"
"Feb 05, 2020","11.63","11.44","11.78","11.44","11.29M","2.92%"
"Feb 06, 2020","11.44","11.73","11.95","11.44","11.97M","-1.63%"
"Feb 07, 2020","11.09","11.30","11.40","11.03","8.11M","-3.06%"
"Feb 10, 2020","10.32","11.07","11.18","10.26","12.78M","-6.94%"
"Feb 11, 2020","10.91","10.52","10.91","10.37","9.28M","5.72%"
"Feb 12, 2020","10.78","11.02","11.08","10.60","10.08M","-1.19%"
"Feb 13, 2020","11.30","10.70","11.30","10.51","13.85M","4.82%"
"Feb 14, 2020","11.65","11.40","11.65","10.86","15.95M","3.10%"
"Feb 17, 2020","12.54","12.30","12.69","11.95","25.10M","7.64%"
"Feb 18, 2020","13.46","12.44","13.57","12.33","39.95M","7.34%"
"Feb 19, 2020","13.75","13.70","14.04","13.45","29.50M","2.15%"
"Feb 20, 2020","13.77","14.20","14.24","13.03","37.89M","0.15%"
"Feb 21, 2020","13.99","13.50","14.15","13.29","22.65M","1.60%"
"Feb 26, 2020","12.66","13.14","13.50","12.60","19.15M","-9.51%"
"Feb 27, 2020","12.05","12.38","12.85","11.94","28.13M","-4.82%"
"Feb 28, 2020","12.07","11.99","12.28","11.43","23.49M","0.17%"
"Mar 02, 2020","12.90","12.29","12.92","12.07","20.19M","6.88%"
"Mar 03, 2020","12.30","13.00","13.24","12.30","19.41M","-4.65%"
"Mar 04, 2020","12.73","12.70","12.90","12.13","15.15M","3.50%"
"Mar 05, 2020","11.83","12.50","12.50","11.40","13.12M","-7.07%"
"Mar 06, 2020","11.26","11.01","11.56","10.66","18.15M","-4.82%"
"Mar 09, 2020","8.57","9.90","9.96","8.57","17.12M","-23.89%"
"Mar 10, 2020","9.92","9.65","10.14","8.95","20.37M","15.75%"
"Mar 11, 2020","9.18","9.50","9.85","8.56","14.65M","-7.46%"
"Mar 12, 2020","7.34","7.75","8.48","7.15","13.46M","-20.04%"
"Mar 13, 2020","9.19","8.94","9.32","7.63","22.26M","25.20%"
"Mar 16, 2020","7.58","7.66","8.65","7.20","19.09M","-17.52%"
"Mar 17, 2020","7.90","8.25","8.59","7.50","24.72M","4.22%"
"Mar 18, 2020","6.44","7.20","7.27","5.63","22.79M","-18.48%"
"Mar 19, 2020","7.11","6.00","7.11","5.50","28.23M","10.40%"
"Mar 20, 2020","7.11","7.55","7.80","6.44","22.29M","0.00%"
"Mar 23, 2020","7.43","7.11","7.79","6.66","19.51M","4.50%"
"Mar 24, 2020","7.90","8.02","8.53","7.81","15.50M","6.33%"
"Mar 25, 2020","8.29","7.94","8.64","7.75","17.93M","4.94%"
"Mar 26, 2020","8.40","8.53","8.99","8.08","15.91M","1.33%"
"Mar 27, 2020","8.52","8.10","8.83","7.87","14.17M","1.43%"
"Mar 30, 2020","8.95","8.79","9.34","8.54","14.66M","5.05%"
"Mar 31, 2020","8.85","9.20","9.40","8.85","14.41M","-1.12%"
"Apr 01, 2020","9.20","8.41","9.29","8.25","17.75M","3.95%"
"Apr 02, 2020","8.85","9.40","9.45","8.77","11.84M","-3.80%"
"Apr 03, 2020","8.62","8.86","8.99","8.06","15.46M","-2.60%"
"Apr 06, 2020","9.32","9.00","9.40","8.90","13.48M","8.12%"
"Apr 07, 2020","8.94","9.76","10.14","8.88","15.57M","-4.08%"
"Apr 08, 2020","8.95","8.98","9.15","8.66","12.17M","0.11%"
"Apr 09, 2020","8.86","9.00","9.23","8.80","8.52M","-1.01%"
"Apr 13, 2020","9.39","8.85","9.39","8.69","11.12M","5.98%"
"Apr 14, 2020","9.50","9.64","9.72","9.36","10.99M","1.17%"
"Apr 15, 2020","9.50","9.25","9.62","9.17","9.43M","0.00%"
"Apr 16, 2020","9.39","9.75","9.82","9.33","8.07M","-1.16%"
"Apr 17, 2020","9.38","9.69","9.69","9.26","5.73M","-0.11%"