result,data,num_ativos,lista_ativos,oper_ativos,volatilidade
0.9572303640952193,"Apr 01, 2010","8","['VALE3', 'GGBR4', 'BRAP4', 'EMBR3', 'BBAS3', 'GFSA3', 'MMXM3', 'RSID3']","[0.375, 0.25, 0.25, 0.25, 0.0, 0.0, 0.0, 0.0]","0.0007230455380148623"
1.0398325239786748,"Oct 01, 2010","8","['BRFS3', 'USIM5', 'BRAP4', 'GOLL4', 'BRKM5', 'MRVE3', 'RSID3', 'LAME4']","[2.0, 1.5, 0.25, 0.25, 0.25, 0.25, 0.25, 0.25]","0.0002953752203593289"
1.076841788938594,"Mar 01, 2010","8","['PETR3', 'RDCD3', 'BRAP4', 'GOAU4', 'USIM3', 'PETR4', 'USIM5', 'VALE3']","[1.75, 1.75, 1.75, 1.75, 1.75, 1.5, 1.5, 1.25]","0.00047415822646728245"
1.0831497840590822,"Sep 01, 2010","8","['BTOW3', 'GOAU4', 'PETR4', 'PDGR3', 'CSAN3', 'GOLL4', 'VALE3', 'EMBR3']","[1.75, 0.5, 0.5, 0.25, 0.0, 0.0, 0.0, 0.0]","0.0009526484901545263"
0.9236478829981023,"May 03, 2010","8","['GGBR4', 'SBSP3', 'RDCD3', 'ELET3', 'GOAU4', 'ABEV3', 'ELET6', 'JBSS3']","[0.25, 0.25, 0.0, 0.0, 0.0, 0.0, 0.0, 0.0]","nan"
1.0598622340503985,"Jun 01, 2010","8","['RSID3', 'MRVE3', 'BRFS3', 'LIGT3', 'LREN3', 'CMIG4', 'ABEV3', 'CPFE3']","[1.75, 1.5, 1.0, 0.75, 0.25, 0.0, 0.0, 0.0]","0.00035761418910753564"
1.012440197958641,"Feb 01, 2010","8","['BTOW3', 'MMXM3', 'ELET3', 'EMBR3', 'CPFE3', 'ITSA4', 'USIM3', 'MRVE3']","[0.375, 0.25, 0.25, 0.25, 0.25, 0.0, 0.0, 0.0]","0.0007205592009765994"
1.080282065167721,"Jul 01, 2010","8","['PDGR3', 'LAME4', 'CPFE3', 'TRPL4', 'TIMP3', 'LIGT3', 'BRAP4', 'GOAU4']","[2.0, 1.75, 0.5, 0.25, 0.25, 0.0, 0.0, 0.0]","0.004323120047139161"
0.9346512406563188,"Jan 04, 2010","8","['CYRE3', 'LREN3', 'MRVE3', 'USIM5', 'BRKM5', 'VALE3', 'ITSA4', 'DTEX3']","[1.5, 1.5, 1.25, 1.0, 0.75, 0.5, 0.5, 0.5]","nan"
0.9914196788084457,"Nov 01, 2010","8","['CESP6', 'BRAP4', 'ABEV3', 'CCRO3', 'ELET6', 'DTEX3', 'ELET3', 'GOLL4']","[1.25, 0.75, 0.25, 0.25, 0.25, 0.25, 0.25, 0.25]","nan"
0.9944101611490357,"Aug 02, 2010","8","['CMIG4', 'DTEX3', 'PETR4', 'ABEV3', 'CPFE3', 'BRKM5', 'RSID3', 'GGBR4']","[2.0, 1.0, 1.0, 0.25, 0.25, 0.25, 0.25, 0.25]","0.0002905954966967563"