result,data,num_ativos,lista_ativos,oper_ativos,volatilidade
0.9505696418026036,"Jan 04, 2010","9","['LREN3', 'EMBR3', 'MRVE3', 'VALE3', 'CCRO3', 'BRKM5', 'ITSA4', 'DTEX3', 'TRPL4']","[2.0, 2.0, 2.0, 1.0, 0.75, 0.75, 0.5, 0.5, 0.5]","nan"
0.9801010295548915,"Feb 01, 2010","9","['BTOW3', 'ELET3', 'EMBR3', 'ITSA4', 'USIM3', 'CSAN3', 'DTEX3', 'BRKM5', 'KLBN4']","[0.375, 0.25, 0.25, 0.0, 0.0, 0.0, 0.0, -0.125, -0.125]","nan"
1.05216323414882,"Mar 01, 2010","9","['CSNA3', 'BBAS3', 'RDCD3', 'CSAN3', 'USIM3', 'PDGR3', 'ABEV3', 'MMXM3', 'EMBR3']","[2.0, 1.75, 1.75, 1.75, 1.5, 1.25, 0.5, 0.25, 0.25]","0.0018697350663696773"
0.944378873488317,"Apr 01, 2010","9","['GGBR4', 'CSNA3', 'VALE3', 'BRAP4', 'EMBR3', 'BBAS3', 'GFSA3', 'MMXM3', 'LAME4']","[1.75, 0.625, 0.375, 0.25, 0.25, 0.0, 0.0, 0.0, 0.0]","0.0006434913377110457"
0.9251325762326291,"May 03, 2010","9","['GGBR4', 'RDCD3', 'ELET3', 'GOAU4', 'ABEV3', 'KLBN4', 'VALE3', 'PETR4', 'PETR3']","[0.0, 0.0, 0.0, 0.0, 0.0, 0.0, -0.125, -0.25, -0.25]","nan"
1.0631806085218265,"Jun 01, 2010","9","['RSID3', 'DTEX3', 'MRVE3', 'LIGT3', 'LREN3', 'CPFE3', 'BRFS3', 'ABEV3', 'TIMP3']","[1.75, 1.75, 1.5, 0.75, 0.25, 0.25, 0.0, 0.0, 0.0]","0.0003554025988707231"
1.1165071917883056,"Jul 01, 2010","9","['GFSA3', 'PETR3', 'CPFE3', 'TRPL4', 'TIMP3', 'LAME4', 'CYRE3', 'JBSS3', 'PDGR3']","[2.0, 1.75, 0.5, 0.25, 0.25, 0.25, 0.25, 0.25, 0.25]","0.0036942921092048718"
0.9913741654941522,"Aug 02, 2010","9","['CMIG4', 'ELET3', 'DTEX3', 'ABEV3', 'CPFE3', 'BRKM5', 'RSID3', 'ITSA4', 'SBSP3']","[2.0, 1.75, 1.0, 0.25, 0.25, 0.25, 0.25, 0.25, 0.0]","0.0002578542050777028"
1.0793523027710126,"Sep 01, 2010","9","['PETR4', 'PDGR3', 'BRAP4', 'GOLL4', 'VALE3', 'EMBR3', 'GGBR4', 'CSNA3', 'RDCD3']","[0.5, 0.25, 0.0, 0.0, 0.0, 0.0, 0.0, -0.125, -0.25]","0.0008526787130207281"
1.0440212704327874,"Oct 01, 2010","9","['BRAP4', 'CSAN3', 'BBDC4', 'CYRE3', 'ITUB4', 'DTEX3', 'GOLL4', 'BRKM5', 'MRVE3']","[1.75, 1.75, 1.75, 1.25, 1.25, 0.25, 0.25, 0.25, 0.25]","0.00024597136690534686"
0.9886936915177021,"Nov 01, 2010","9","['TRPL4', 'MRVE3', 'BRAP4', 'ABEV3', 'ELET6', 'DTEX3', 'ELET3', 'GOLL4', 'BRKM5']","[1.0, 1.0, 0.75, 0.25, 0.25, 0.25, 0.25, 0.25, 0.25]","nan"
0.9953427860922179,"Dec 01, 2010","9","['ABEV3', 'BTOW3', 'BRKM5', 'USIM5', 'TRPL4', 'LREN3', 'TIMP3', 'GOLL4', 'VALE3']","[0.25, 0.25, 0.25, 0.25, 0.0, 0.0, 0.0, 0.0, 0.0]","0.0030754709747506763"
0.9460871407669799,"Jan 03, 2011","9","['ITUB4', 'PDGR3', 'ITSA4', 'GOAU4', 'CSAN3', 'BRKM5', 'CMIG4', 'BRFS3', 'KLBN4']","[1.75, 1.75, 1.5, 1.25, 1.0, 1.0, 0.75, 0.375, 0.375]","0.0009136292653922417"
0.9973165384639924,"Feb 01, 2011","9","['SANB11', 'SBSP3', 'GOAU4', 'RDCD3', 'MMXM3', 'GFSA3', 'LREN3', 'BTOW3', 'CPLE6']","[1.625, 1.0, 1.0, 1.0, 0.75, 0.625, 0.375, 0.375, 0.25]","0.00011576038046405432"
0.9654537390156469,"Sep 01, 2016","9","['BRFS3', 'UGPA3', 'VIVT4', 'KLBN11', 'GGBR4', 'QUAL3', 'GOAU4', 'BBSE3', 'LREN3']","[0.25, 0.25, 0.25, 0.25, 0.25, 0.25, 0.25, 0.0, 0.0]","0.00037645080356663534"
1.1304126979235878,"Oct 03, 2016","9","['MULT3', 'CSNA3', 'ITUB4', 'ABEV3', 'BBAS3', 'LAME4', 'CSAN3', 'VALE3', 'BBDC4']","[1.75, 1.5, 1.25, 1.25, 1.25, 1.25, 1.25, 1.0, 0.25]","0.0006566886530208051"
0.9497777939240395,"Nov 01, 2016","9","['CCRO3', 'UGPA3', 'CESP6', 'BRAP4', 'PETR4', 'CIEL3', 'ECOR3', 'VALE3', 'LREN3']","[2.0, 1.75, 1.75, 1.125, 1.0, 0.5, 0.375, 0.25, 0.25]","0.0006003535526695748"
0.9618922338121265,"Dec 01, 2016","9","['HYPE3', 'UGPA3', 'GOAU4', 'GGBR4', 'CSNA3', 'BRAP4', 'BBAS3', 'SANB11', 'USIM5']","[1.5, 1.25, 1.0, 0.5, 0.5, 0.5, 0.25, 0.25, 0.25]","0.0011785158214445272"
1.0892635511887412,"Jan 02, 2017","9","['MRFG3', 'BBDC3', 'HYPE3', 'CMIG4', 'RENT3', 'USIM5', 'BBAS3', 'CIEL3', 'BBSE3']","[2.0, 1.75, 1.75, 1.75, 1.75, 1.75, 1.5, 1.5, 1.5]","0.0005040991233794462"
1.0161186194015148,"Feb 01, 2017","9","['GGBR4', 'MRFG3', 'BBDC4', 'BBDC3', 'HYPE3', 'ITUB4', 'SBSP3', 'TIMP3', 'PETR3']","[1.75, 1.5, 1.0, 1.0, 1.0, 0.75, 0.75, 0.75, 0.5]","0.00042421723381427063"
0.9725543277522353,"Mar 01, 2017","9","['BBDC3', 'BBAS3', 'CMIG4', 'ITSA4', 'ABEV3', 'BRML3', 'CCRO3', 'ITUB4', 'BBDC4']","[1.5, 1.25, 1.25, 1.125, 0.75, 0.75, 0.5, 0.25, 0.25]","0.00039057612090531246"
1.0633619406824932,"Apr 03, 2017","9","['CCRO3', 'PCAR4', 'EQTL3', 'MULT3', 'ENBR3', 'MRFG3', 'RADL3', 'LAME4', 'JBSS3']","[2.0, 2.0, 1.75, 1.75, 1.75, 1.75, 1.5, 1.5, 0.75]","0.00017402392394497046"
0.9798884761384703,"May 02, 2017","9","['WEGE3', 'KLBN11', 'BBDC4', 'BRFS3', 'BRKM5', 'LAME4', 'ENBR3', 'ECOR3', 'ITSA4']","[2.0, 2.0, 1.75, 1.75, 1.75, 1.75, 1.75, 1.75, 1.5]","0.0001389739651975102"
1.0103163490371367,"Jun 01, 2017","9","['CPLE6', 'GOAU4', 'CPFE3', 'QUAL3', 'KLBN11', 'UGPA3', 'BBDC4', 'ABEV3', 'BBSE3']","[1.75, 1.75, 1.125, 1.0, 0.75, 0.25, 0.0, 0.0, 0.0]","0.00012691856612192007"
1.0446258589960373,"Jul 03, 2017","9","['ECOR3', 'CCRO3', 'CSAN3', 'ITUB4', 'CIEL3', 'GOAU4', 'BRML3', 'ENBR3', 'BBDC4']","[2.25, 1.75, 1.75, 1.5, 1.25, 1.25, 0.75, 0.25, 0.0]","0.00018057220601349342"
1.063559219363746,"Aug 01, 2017","9","['JBSS3', 'CPLE6', 'PETR4', 'CCRO3', 'PCAR4', 'ITUB4', 'RENT3', 'MULT3', 'BBDC4']","[2.0, 2.0, 1.75, 1.25, 1.125, 0.75, 0.625, 0.375, 0.25]","0.0001426883945352437"
1.0054634150657609,"Sep 01, 2017","9","['RENT3', 'MULT3', 'ABEV3', 'CPFE3', 'CMIG4', 'PETR4', 'VALE3', 'CCRO3', 'LAME4']","[1.5, 1.25, 1.125, 1.125, 1.0, 0.5, 0.5, 0.5, 0.375]","0.00010423774229538804"
0.906874239099794,"Aug 03, 2015","9","['VIVT4', 'PCAR4', 'ENBR3', 'KLBN11', 'SBSP3', 'BRPR3', 'BBDC3', 'LAME4', 'SANB11']","[1.75, 1.75, 0.375, 0.25, 0.25, 0.25, 0.0, 0.0, 0.0]","9.5434975961595e-05"
1.0569623685229526,"Sep 01, 2015","9","['CMIG4', 'MRFG3', 'OIBR4', 'BRFS3', 'KLBN11', 'CIEL3', 'JBSS3', 'EMBR3', 'VIVT4']","[0.75, 0.25, 0.25, 0.0, 0.0, -0.25, -0.25, -0.25, -0.25]","4.6543239416394504e-05"
1.026131079115025,"Oct 01, 2015","9","['BBDC4', 'ITSA4', 'BBSE3', 'BBDC3', 'SANB11', 'BRML3', 'GFSA3', 'ABEV3', 'JBSS3']","[0.75, 0.75, 0.75, 0.75, 0.75, 0.75, 0.625, 0.25, 0.25]","0.00023175279395069647"
1.016026626814166,"Nov 03, 2015","9","['SANB11', 'CESP6', 'BRKM5', 'PETR4', 'CIEL3', 'UGPA3', 'HYPE3', 'CSNA3', 'BRPR3']","[2.0, 1.75, 1.0, 0.25, 0.25, 0.25, 0.25, 0.25, 0.25]","0.00023892626908759827"
0.9507208522093578,"Dec 01, 2015","9","['HYPE3', 'GOAU4', 'SBSP3', 'ITUB4', 'ITSA4', 'BBSE3', 'KLBN11', 'SANB11', 'BRML3']","[0.875, 0.75, 0.5, 0.25, 0.25, 0.25, 0.25, 0.25, 0.25]","0.00024744170041381624"
0.9282176775367535,"Jan 04, 2016","9","['SBSP3', 'JBSS3', 'VALE3', 'MRVE3', 'MRFG3', 'USIM5', 'SANB11', 'CCRO3', 'ABEV3']","[2.0, 1.5, 1.25, 1.25, 1.0, 0.75, 0.25, 0.0, -0.25]","0.00013399037793540786"
1.1229087728234033,"Feb 01, 2016","9","['CSAN3', 'HYPE3', 'SBSP3', 'USIM5', 'VIVT4', 'BBDC3', 'CSNA3', 'CESP6', 'MRFG3']","[1.75, 1.5, 1.25, 0.375, -0.25, -0.25, -0.25, -0.25, -0.25]","0.0002471787561895226"
1.0789576943882284,"Mar 01, 2016","9","['LAME4', 'BBSE3', 'CIEL3', 'EMBR3', 'UGPA3', 'BBDC4', 'BRFS3', 'CCRO3', 'RADL3']","[2.25, 2.0, 1.75, 1.25, 0.75, 0.25, 0.25, 0.25, 0.25]","9.825130610365339e-05"
1.0368569778393442,"Apr 01, 2016","9","['UGPA3', 'CSAN3', 'OIBR3', 'ABEV3', 'RADL3', 'GGBR4', 'ITUB4', 'BBDC4', 'PETR4']","[1.25, 0.75, 0.75, 0.375, 0.375, 0.375, 0.25, 0.25, 0.25]","0.0004156197284445429"
0.8458191659174159,"May 02, 2016","9","['ENBR3', 'CPFE3', 'PETR3', 'BBDC4', 'PETR4', 'ITSA4', 'VALE3', 'BBSE3', 'BBAS3']","[1.75, 1.25, 0.625, 0.25, 0.25, 0.25, 0.25, 0.25, 0.25]","0.0007518832603372876"
1.2587483225903133,"Jun 01, 2016","9","['ELET3', 'OIBR3', 'PCAR4', 'JBSS3', 'RADL3', 'EQTL3', 'CSAN3', 'ABEV3', 'PETR4']","[2.0, 1.5, 1.375, 1.25, 0.25, 0.25, 0.25, 0.0, 0.0]","0.00027171168056120375"
1.1305632430895138,"Jul 01, 2016","9","['CCRO3', 'MULT3', 'CMIG4', 'VIVT4', 'LREN3', 'SBSP3', 'CPFE3', 'QUAL3', 'BRAP4']","[2.0, 1.75, 1.25, 1.0, 0.25, 0.25, 0.25, 0.25, 0.25]","0.0004032568093510055"
1.0371572755632785,"Aug 01, 2016","9","['GGBR4', 'CSNA3', 'BBAS3', 'ENBR3', 'WEGE3', 'TIMP3', 'BRAP4', 'GOAU4', 'LREN3']","[1.125, 1.125, 1.0, 0.75, 0.625, 0.625, 0.5, 0.5, 0.25]","0.0007022889383527628"
1.0368311090697182,"Mar 01, 2011","9","['CCRO3', 'JBSS3', 'CPLE6', 'KLBN4', 'RDCD3', 'LIGT3', 'PETR3', 'DTEX3', 'TIMP3']","[1.75, 1.75, 1.5, 1.125, 1.0, 0.75, 0.625, 0.5, 0.25]","5.987813048009538e-05"
0.9749865696844146,"Apr 04, 2011","9","['TIMP3', 'CCRO3', 'SANB11', 'BRAP4', 'CSNA3', 'TRPL4', 'MMXM3', 'DTEX3', 'LREN3']","[1.75, 1.75, 1.75, 1.625, 1.5, 1.25, 1.0, 0.375, 0.25]","0.003642398538348231"
0.9948430747583814,"May 02, 2011","9","['GOLL4', 'BBAS3', 'CCRO3', 'JBSS3', 'USIM5', 'SBSP3', 'CPFE3', 'TIMP3', 'CESP6']","[1.75, 1.75, 1.25, 0.625, 0.375, 0.25, 0.25, 0.25, 0.25]","9.648010873575125e-05"
0.9865161839893463,"Jun 01, 2011","9","['LREN3', 'CYRE3', 'KLBN4', 'BRAP4', 'CSAN3', 'CPFE3', 'PETR4', 'RDCD3', 'TIMP3']","[2.0, 1.75, 1.75, 1.625, 1.5, 1.0, 1.0, 0.75, 0.25]","6.153227163971072e-05"
0.9244460135858658,"Jul 01, 2011","9","['CESP6', 'DTEX3', 'VALE3', 'BBDC4', 'ITUB4', 'ITSA4', 'TIMP3', 'LIGT3', 'GFSA3']","[2.0, 1.875, 1.75, 1.5, 1.5, 1.5, 1.25, 0.75, 0.75]","5.0014809942470717e-05"
0.95920562944268,"Aug 01, 2011","9","['PETR3', 'JBSS3', 'CPLE6', 'BRKM5', 'BRFS3', 'CPFE3', 'LREN3', 'GOAU4', 'DTEX3']","[1.5, 0.75, 0.625, 0.25, 0.25, -0.25, -0.25, -0.25, -0.25]","0.00014454292859086335"
0.8712163581961329,"Sep 01, 2011","9","['CESP6', 'LAME4', 'PCAR4', 'LIGT3', 'GOLL4', 'CMIG4', 'SANB11', 'CSNA3', 'CYRE3']","[1.75, 1.75, 1.5, 1.5, 1.5, 1.5, 1.5, 1.5, 1.5]","0.00011630204479632439"
1.1251419730365437,"Oct 03, 2011","9","['EMBR3', 'TRPL4', 'PCAR4', 'LIGT3', 'LREN3', 'GOLL4', 'CMIG4', 'LAME4', 'KLBN4']","[0.25, 0.0, 0.0, 0.0, 0.0, 0.0, 0.0, 0.0, 0.0]","0.0037585347966379913"
0.9703634858845417,"Nov 01, 2011","9","['BRAP4', 'BTOW3', 'CSNA3', 'MMXM3', 'TRPL4', 'SBSP3', 'HYPE3', 'CESP6', 'BBAS3']","[1.75, 1.75, 1.75, 1.75, 1.25, 1.25, 1.25, 1.0, 1.0]","0.0038442439044136783"
1.0017266937878997,"Dec 01, 2011","7","['TRPL4', 'USIM5', 'USIM3', 'CPFE3', 'MRVE3', 'HYPE3', 'BRAP4']","[1.5, 1.0, 0.375, 0.25, 0.0, -0.25, -0.5]","0.006295409921406225"
1.0630249852465181,"Jan 02, 2012","9","['CCRO3', 'SANB11', 'MRFG3', 'BBAS3', 'CSNA3', 'HYPE3', 'CPFE3', 'CPLE6', 'EMBR3']","[1.75, 1.75, 1.75, 1.75, 1.5, 1.25, 1.0, 1.0, 1.0]","0.00030734205140033673"
1.0533644180698967,"Jan 30, 2012","9","['CESP6', 'TRPL4', 'BRAP4', 'VALE3', 'PCAR4', 'PETR3', 'PETR4', 'DTEX3', 'SANB11']","[2.0, 1.75, 1.25, 1.25, 1.125, 1.0, 1.0, 0.75, 0.75]","0.004133844268284437"
1.0295856673725758,"Feb 29, 2012","9","['BRFS3', 'CIEL3', 'VIVT4', 'TIMP3', 'SBSP3', 'CPFE3', 'RDCD3', 'CESP6', 'BRAP4']","[1.0, 0.625, 0.5, 0.5, 0.375, 0.375, 0.375, 0.25, 0.25]","0.00025847271557139016"
1.0044580187511756,"Mar 29, 2012","9","['CSAN3', 'PCAR4', 'HGTX3', 'UGPA3', 'BRFS3', 'DTEX3', 'MRFG3', 'USIM5', 'CIEL3']","[1.0, 0.375, 0.25, 0.25, 0.25, 0.25, 0.25, 0.25, 0.0]","0.00022231288518000588"
0.7874344146729735,"May 02, 2012","9","['RSID3', 'VALE3', 'GGBR4', 'MRVE3', 'PDGR3', 'GFSA3', 'SBSP3', 'UGPA3', 'USIM3']","[1.75, 1.25, 1.25, 0.75, 0.75, 0.625, 0.5, 0.25, 0.0]","0.00030108985812302754"
1.0355350018956262,"Jun 01, 2012","8","['GOLL4', 'RSID3', 'MRVE3', 'GFSA3', 'CSNA3', 'SBSP3', 'CCRO3', 'SANB11']","[0.75, 0.625, 0.625, 0.625, 0.25, 0.0, 0.0, 0.0]","0.0003701968631478542"
1.0370818897958238,"Jul 02, 2012","9","['KLBN4', 'UGPA3', 'RDCD3', 'CCRO3', 'VIVT4', 'ABEV3', 'LIGT3', 'BRAP4', 'OIBR3']","[1.75, 0.25, 0.25, 0.25, 0.0, 0.0, 0.0, 0.0, 0.0]","0.00014990788019521837"
1.0076188576431566,"Aug 01, 2012","9","['RENT3', 'BBDC4', 'BBAS3', 'TRPL4', 'ABEV3', 'SANB11', 'GOLL4', 'LREN3', 'LAME4']","[2.0, 2.0, 2.0, 1.75, 1.75, 1.75, 1.5, 1.0, 0.625]","0.004294564777550583"
1.0999403659612395,"Sep 03, 2012","9","['PCAR4', 'GFSA3', 'MRFG3', 'USIM3', 'LREN3', 'RENT3', 'BRML3', 'BRFS3', 'BTOW3']","[0.75, 0.5, 0.375, 0.25, 0.25, 0.25, 0.25, 0.25, 0.25]","0.0001624111058718356"
0.9925152093296442,"Oct 01, 2012","9","['CSAN3', 'LREN3', 'GOAU4', 'DTEX3', 'BRKM5', 'LAME4', 'GOLL4', 'MRFG3', 'CSNA3']","[0.375, 0.25, 0.25, 0.25, 0.25, 0.25, 0.25, 0.25, 0.25]","0.00027155205941513226"
0.9915548745750974,"Nov 01, 2012","9","['DASA3', 'CYRE3', 'CPLE6', 'MRVE3', 'CPFE3', 'BRAP4', 'EMBR3', 'BRFS3', 'DTEX3']","[1.25, 1.0, 0.75, 0.375, 0.25, 0.25, 0.25, 0.25, 0.25]","0.00015275427154315356"
1.0298271134275048,"Dec 03, 2012","9","['CYRE3', 'RENT3', 'CCRO3', 'EMBR3', 'BRML3', 'KLBN4', 'SANB11', 'VALE3', 'BRKM5']","[1.5, 0.25, 0.25, 0.0, 0.0, 0.0, 0.0, 0.0, -0.25]","0.00017125191914390306"
1.012114935250788,"Dec 28, 2012","9","['UGPA3', 'CPLE6', 'OIBR3', 'CSNA3', 'USIM5', 'BRFS3', 'VIVT4', 'EMBR3', 'BBAS3']","[2.0, 1.75, 1.75, 1.75, 1.75, 1.375, 1.125, 1.0, 1.0]","0.00013913223226030881"
0.9886596900702868,"Feb 01, 2013","9","['MRFG3', 'LREN3', 'UGPA3', 'PETR4', 'TRPL4', 'SBSP3', 'ABEV3', 'ELET3', 'BRFS3']","[2.0, 1.75, 1.25, 1.0, 0.25, 0.25, 0.25, 0.25, 0.25]","0.0018211120557677465"
0.9431687189083966,"Mar 01, 2013","9","['VIVT4', 'MRVE3', 'CIEL3', 'TRPL4', 'SBSP3', 'UGPA3', 'BBAS3', 'RENT3', 'ELET6']","[1.75, 1.125, 0.5, 0.25, 0.25, 0.25, 0.125, 0.0, 0.0]","0.0019214845905081168"
1.0028081137917169,"Mar 28, 2013","9","['BRFS3', 'PETR4', 'BTOW3', 'PCAR4', 'VIVT4', 'EMBR3', 'BBAS3', 'CESP6', 'UGPA3']","[3.0, 2.0, 1.75, 0.25, 0.25, 0.25, 0.25, 0.0, 0.0]","9.19340104979277e-05"
0.9545051360501556,"May 02, 2013","9","['BRAP4', 'RENT3', 'BRML3', 'UGPA3', 'PETR3', 'KLBN4', 'GOLL4', 'RSID3', 'BBDC4']","[1.75, 1.0, 1.0, 0.5, 0.25, 0.0, 0.0, 0.0, 0.0]","0.00010231277898040647"
0.9175889808767681,"Jun 03, 2013","9","['USIM5', 'CSNA3', 'UGPA3', 'BBDC4', 'ITUB4', 'ELET6', 'CIEL3', 'TIMP3', 'GGBR4']","[1.0, 0.625, 0.25, 0.25, 0.25, 0.0, 0.0, 0.0, -0.25]","4.210930913235414e-05"
1.0178345046323831,"Jul 01, 2013","9","['BRKM5', 'LREN3', 'EMBR3', 'MRFG3', 'CPLE6', 'RENT3', 'LIGT3', 'CPFE3', 'SBSP3']","[1.75, 0.75, 0.25, 0.0, -0.25, -0.25, -0.25, -0.25, -0.25]","4.451864703556501e-05"
1.0315242183375948,"Aug 01, 2013","9","['BRAP4', 'CMIG4', 'KLBN4', 'VALE3', 'TRPL4', 'UGPA3', 'BRFS3', 'DASA3', 'TIMP3']","[2.0, 1.875, 1.75, 1.75, 1.5, 0.25, 0.25, 0.25, 0.25]","6.106688882574387e-05"
1.0572362333849419,"Sep 02, 2013","9","['BTOW3', 'BRAP4', 'CIEL3', 'ELET3', 'MRVE3', 'USIM5', 'RSID3', 'CCRO3', 'ITUB4']","[1.0, 0.25, 0.25, 0.25, 0.25, 0.25, 0.25, 0.0, 0.0]","0.0002556708361871696"
1.012371657063055,"Oct 01, 2013","9","['TRPL4', 'MRFG3', 'ENBR3', 'ELET3', 'CPLE6', 'CSAN3', 'USIM3', 'DTEX3', 'GOLL4']","[1.75, 1.5, 1.25, 0.375, 0.25, 0.25, 0.25, 0.25, 0.25]","0.0002240095293833281"
0.9681791988800175,"Nov 01, 2013","9","['ITUB4', 'LREN3', 'CSAN3', 'UGPA3', 'RENT3', 'LIGT3', 'BTOW3', 'DTEX3', 'BRKM5']","[0.5, 0.25, 0.25, 0.25, 0.25, 0.25, 0.25, 0.25, 0.25]","0.00012776802162424374"
1.0175312143040816,"Dec 02, 2013","9","['CCRO3', 'ABEV3', 'CIEL3', 'BRKM5', 'JBSS3', 'USIM5', 'GFSA3', 'PCAR4', 'UGPA3']","[0.75, 0.25, 0.25, 0.25, 0.25, 0.25, 0.25, 0.0, 0.0]","0.00010195200619691989"
0.9399136832171389,"Jan 02, 2014","9","['BRKM5', 'ITUB4', 'ABEV3', 'JBSS3', 'LREN3', 'RENT3', 'RSID3', 'LAME4', 'DASA3']","[2.0, 1.75, 1.75, 1.75, 1.75, 1.75, 1.75, 1.0, 1.0]","0.00010866434151321143"
0.9821060435141844,"Feb 03, 2014","9","['CMIG4', 'CSNA3', 'BTOW3', 'BRML3', 'HYPE3', 'LIGT3', 'KLBN4', 'DASA3', 'MRFG3']","[1.75, 1.375, 1.0, 0.625, 0.625, 0.5, 0.25, 0.25, 0.25]","0.00016909947309456965"
1.0611998104063245,"Mar 05, 2014","9","['GFSA3', 'EMBR3', 'CESP6', 'BTOW3', 'GGBR4', 'GOAU4', 'DASA3', 'BBDC4', 'ABEV3']","[1.75, 1.75, 1.75, 1.75, 0.75, 0.75, 0.25, 0.0, 0.0]","0.00013862457084752393"
1.0108357654754485,"Apr 01, 2014","9","['UGPA3', 'CSAN3', 'GGBR4', 'CYRE3', 'USIM3', 'HYPE3', 'GOLL4', 'BRPR3', 'VIVT4']","[1.875, 1.75, 1.5, 1.5, 1.5, 1.25, 1.25, 1.25, 1.125]","0.0001585310167673509"
0.9802419780231957,"May 02, 2014","9","['SBSP3', 'TIMP3', 'CESP6', 'OIBR4', 'PETR4', 'BBDC4', 'BBAS3', 'ITSA4', 'PETR3']","[2.0, 1.5, 0.75, 0.625, 0.25, 0.25, 0.25, 0.25, 0.25]","0.00019998652933564924"
1.0071085580843722,"Jun 02, 2014","9","['SANB11', 'BBDC3', 'USIM5', 'DTEX3', 'USIM3', 'RSID3', 'CIEL3', 'PDGR3', 'HYPE3']","[1.0, 1.0, 0.75, 0.75, 0.625, 0.5, 0.25, 0.25, 0.25]","0.00022075556910832963"
0.9759166265780204,"Jul 01, 2014","9","['CYRE3', 'CIEL3', 'RSID3', 'BBSE3', 'BBAS3', 'CCRO3', 'CMIG4', 'TIMP3', 'LREN3']","[2.0, 0.875, 0.5, 0.25, 0.25, 0.25, 0.25, 0.25, 0.25]","0.00010361726703673823"
1.0471899242423934,"Aug 01, 2014","9","['MMXM3', 'VIVT4', 'RSID3', 'BBDC4', 'BBDC3', 'EGIE3', 'RENT3', 'ENBR3', 'LIGT3']","[0.75, 0.5, 0.375, 0.25, 0.25, 0.25, 0.25, 0.25, 0.25]","0.0001994036416970051"
0.9046725440908108,"Sep 01, 2014","9","['RSID3', 'TIMP3', 'USIM5', 'BRAP4', 'RENT3', 'BRPR3', 'MRVE3', 'PCAR4', 'EMBR3']","[1.5, 1.0, 1.0, 0.875, 0.5, 0.5, 0.375, 0.25, 0.25]","9.089099040450528e-05"
0.9507288615937893,"Oct 01, 2014","9","['EVEN3', 'ABEV3', 'EMBR3', 'SANB11', 'TIMP3', 'OIBR4', 'BRKM5', 'PETR4', 'PETR3']","[1.0, 0.25, 0.25, 0.25, 0.25, 0.25, 0.25, 0.0, 0.0]","7.197674177733822e-05"
1.0870405486812278,"Nov 03, 2014","9","['MMXM3', 'ITUB4', 'PETR4', 'BBDC4', 'PETR3', 'ITSA4', 'BBSE3', 'BBAS3', 'PCAR4']","[0.75, -0.25, -0.25, -0.25, -0.25, -0.25, -0.25, -0.25, -0.25]","0.0002549715852015858"
0.9169250164429438,"Dec 01, 2014","9","['CCRO3', 'EVEN3', 'PCAR4', 'MRVE3', 'BBDC3', 'BRAP4', 'CSAN3', 'PDGR3', 'ELET3']","[2.75, 2.5, 2.0, 2.0, 1.75, 1.75, 1.5, 1.5, 1.5]","0.00018625613641365502"
0.9348281156420783,"Jan 02, 2015","9","['GOLL4', 'UGPA3', 'LAME4', 'EGIE3', 'HYPE3', 'BRFS3', 'VALE3', 'BRAP4', 'BRPR3']","[2.0, 1.75, 1.75, 1.75, 1.75, 1.5, 1.5, 1.5, 1.5]","9.429886932438376e-05"
1.118314060296701,"Feb 02, 2015","9","['EMBR3', 'CIEL3', 'BBDC4', 'USIM5', 'UGPA3', 'PETR4', 'ITSA4', 'PETR3', 'JBSS3']","[1.75, 1.5, 1.0, 0.625, 0.5, 0.0, 0.0, 0.0, 0.0]","0.00018098881496520685"
1.0070783593996122,"Mar 02, 2015","9","['LREN3', 'ELET3', 'EVEN3', 'PETR3', 'VIVT4', 'GGBR4', 'CSAN3', 'CYRE3', 'VALE3']","[1.25, 1.0, 1.0, 0.25, 0.25, 0.25, 0.25, 0.25, 0.0]","0.00025690866069543947"
1.1249128741725554,"Apr 01, 2015","9","['LAME4', 'BRPR3', 'CYRE3', 'ELET3', 'GFSA3', 'ABEV3', 'PETR4', 'CIEL3', 'PETR3']","[1.75, 1.0, 0.75, 0.75, 0.5, 0.25, 0.25, 0.25, 0.25]","0.0003051023348233623"
0.8822049566558307,"May 04, 2015","9","['GGBR4', 'PCAR4', 'USIM5', 'TIMP3', 'BBAS3', 'ENBR3', 'ITUB4', 'BBDC4', 'PETR4']","[1.5, 1.25, 0.75, 0.625, 0.5, 0.375, 0.25, 0.25, 0.25]","0.00033418078303606687"
1.002791649834112,"Jun 01, 2015","9","['TIMP3', 'HYPE3', 'KLBN11', 'ABEV3', 'VALE3', 'PETR3', 'BBAS3', 'EMBR3', 'CMIG4']","[1.5, 0.25, 0.25, 0.0, 0.0, 0.0, 0.0, 0.0, 0.0]","0.00012744791530897544"
0.9552607383444502,"Jul 01, 2015","9","['UGPA3', 'BRFS3', 'TIMP3', 'ITUB4', 'BBDC4', 'ABEV3', 'PETR4', 'PETR3', 'ITSA4']","[0.625, 0.25, 0.25, 0.0, 0.0, 0.0, 0.0, 0.0, 0.0]","0.00016083021165941847"
1.0055596244029754,"Oct 02, 2017","9","['JBSS3', 'BBAS3', 'MRFG3', 'ITUB4', 'BBDC4', 'PETR4', 'PETR3', 'BRFS3', 'UGPA3']","[2.0, 0.75, 0.625, 0.25, 0.25, 0.25, 0.25, 0.25, 0.25]","0.00011526157471172495"
0.9310922400697895,"Nov 01, 2017","9","['PETR4', 'CCRO3', 'ELET3', 'PETR3', 'UGPA3', 'BRML3', 'ECOR3', 'ABEV3', 'VALE3']","[1.25, 1.25, 0.75, 0.625, 0.25, 0.25, 0.25, 0.0, 0.0]","0.00015935588042068215"
1.0564062681035793,"Dec 01, 2017","9","['RADL3', 'QUAL3', 'ITSA4', 'BRFS3', 'SANB11', 'MRFG3', 'CYRE3', 'GGBR4', 'ITUB4']","[1.125, 0.625, 0.25, 0.25, 0.25, 0.25, 0.25, 0.125, 0.0]","0.0001264177735585073"
1.0180697068609863,"Jan 02, 2018","9","['PCAR4', 'EQTL3', 'TAEE11', 'CPFE3', 'CCRO3', 'BRML3', 'QUAL3', 'CMIG4', 'ELET3']","[2.75, 2.0, 2.0, 2.0, 1.75, 1.75, 1.75, 1.75, 1.75]","0.00012246755631321977"
1.011702753689294,"Feb 01, 2018","9","['CPLE6', 'PCAR4', 'PETR4', 'PETR3', 'CSAN3', 'CYRE3', 'MGLU3', 'LREN3', 'LAME4']","[1.75, 1.25, 1.0, 1.0, 1.0, 1.0, 0.625, 0.25, 0.25]","0.00023389384417134724"
0.975911964715621,"Mar 01, 2018","9","['WEGE3', 'JBSS3', 'CPFE3', 'ELET6', 'EQTL3', 'PETR4', 'PETR3', 'USIM5', 'ABEV3']","[1.75, 1.25, 1.125, 1.0, 0.75, 0.625, 0.5, 0.5, 0.25]","0.0002567308389831659"
0.9766968828593519,"Apr 02, 2018","9","['EQTL3', 'BBSE3', 'IGTA3', 'TAEE11', 'CPFE3', 'PETR3', 'ABEV3', 'RENT3', 'CMIG4']","[2.0, 1.75, 1.75, 1.75, 1.125, 0.75, 0.25, 0.25, 0.25]","5.925066826770157e-05"
0.9011418590668445,"May 02, 2018","9","['TAEE11', 'GOAU4', 'CPLE6', 'SMLS3', 'GGBR4', 'ECOR3', 'CMIG4', 'VALE3', 'PETR3']","[2.0, 1.75, 1.75, 1.5, 1.25, 1.25, 1.0, 0.375, 0.25]","0.0001233675804945959"
1.0254193636152098,"Jun 01, 2018","9","['BBDC3', 'WEGE3', 'SUZB3', 'MGLU3', 'MRFG3', 'JBSS3', 'RAIL3', 'GGBR4', 'BRKM5']","[0.375, 0.25, 0.25, 0.25, 0.25, 0.0, 0.0, 0.0, 0.0]","0.0003965816548429968"
1.0660384962954847,"Jul 02, 2018","9","['PETR4', 'RAIL3', 'CMIG4', 'QUAL3', 'RADL3', 'PCAR4', 'FLRY3', 'EMBR3', 'BRKM5']","[1.75, 1.75, 1.75, 1.75, 1.25, 1.0, 1.0, 0.25, 0.25]","9.596724317535013e-05"
0.9488195907248266,"Aug 01, 2018","9","['VALE3', 'SANB11', 'SBSP3', 'GOLL4', 'EGIE3', 'CSNA3', 'USIM5', 'GGBR4', 'BBDC4']","[2.0, 1.875, 1.75, 1.75, 1.25, 1.25, 1.25, 0.75, 0.25]","0.0003135242764551254"
1.0214905362790183,"Sep 03, 2018","9","['PCAR4', 'WEGE3', 'KLBN11', 'EMBR3', 'BRKM5', 'VALE3', 'GOAU4', 'BBDC4', 'ABEV3']","[1.25, 1.25, 1.25, 0.5, 0.5, 0.25, 0.25, 0.0, 0.0]","0.0001242795757642097"
1.1347958032916807,"Oct 01, 2018","9","['BRFS3', 'BBSE3', 'CMIG4', 'MULT3', 'CYRE3', 'CPLE6', 'BRAP4', 'VALE3', 'WEGE3']","[2.0, 1.75, 1.5, 1.5, 1.5, 1.25, 0.5, 0.25, 0.25]","9.032021622114986e-05"
1.047229915689849,"Nov 01, 2018","9","['PETR4', 'CMIG4', 'QUAL3', 'PETR3', 'B3SA3', 'RAIL3', 'JBSS3', 'LAME4', 'CCRO3']","[0.75, 0.75, 0.5, 0.25, 0.25, 0.25, 0.25, 0.25, 0.25]","0.00019502103597087634"
0.9685974567781408,"Dec 03, 2018","9","['BRFS3', 'MGLU3', 'QUAL3', 'ECOR3', 'EQTL3', 'SBSP3', 'EGIE3', 'LAME4', 'RADL3']","[1.75, 1.75, 1.75, 1.75, 1.25, 1.25, 1.125, 0.875, 0.75]","0.00012632863034742374"
1.1253733233361727,"Dec 28, 2018","9","['BBAS3', 'BRKM5', 'MGLU3', 'LREN3', 'BRFS3', 'RENT3', 'SBSP3', 'CVCB3', 'TAEE11']","[2.0, 0.875, 0.625, 0.25, 0.25, 0.25, 0.25, 0.25, 0.25]","0.00017145027412942502"
0.9759492523423137,"Feb 01, 2019","9","['VIVT4', 'EGIE3', 'CCRO3', 'SBSP3', 'CPLE6', 'UGPA3', 'B3SA3', 'ITSA4', 'PETR4']","[1.75, 1.25, 1.125, 1.0, 1.0, 0.875, 0.75, 0.75, 0.25]","0.0002921898331418329"
0.9889809184881657,"Mar 01, 2019","9","['MGLU3', 'CVCB3', 'USIM5', 'RADL3', 'RENT3', 'CSAN3', 'ITUB4', 'VALE3', 'ITSA4']","[1.5, 1.0, 1.0, 0.75, 0.25, 0.25, 0.0, 0.0, 0.0]","0.00015641783910234032"
0.9790851948944892,"Apr 01, 2019","9","['BRKM5', 'SANB11', 'QUAL3', 'UGPA3', 'WEGE3', 'PETR4', 'PETR3', 'BBDC4', 'BBDC3']","[1.0, 0.75, 0.75, 0.5, 0.5, 0.25, 0.25, 0.0, 0.0]","0.00022066866541429442"
1.0477696795794462,"May 02, 2019","9","['BBDC4', 'HYPE3', 'ITSA4', 'EQTL3', 'ABEV3', 'TAEE11', 'MRVE3', 'SMLS3', 'BBDC3']","[1.75, 1.625, 1.5, 1.5, 1.25, 1.25, 1.25, 1.25, 1.0]","0.00019941703791584087"
1.0819534650191085,"Jun 03, 2019","9","['RADL3', 'GOLL4', 'VVAR3', 'MGLU3', 'CYRE3', 'MRVE3', 'SANB11', 'CMIG4', 'CCRO3']","[2.0, 2.0, 2.0, 1.75, 1.75, 1.125, 1.0, 1.0, 0.375]","0.0002807653217861911"
0.9493898890981324,"Jul 01, 2019","9","['PCAR4', 'HYPE3', 'TIMP3', 'GOAU4', 'ITSA4', 'IRBR3', 'ITUB4', 'VALE3', 'BBDC4']","[2.5, 2.0, 1.25, 1.25, 0.5, 0.5, 0.25, 0.25, 0.25]","0.00010578544443151717"
1.0120521262848372,"Aug 01, 2019","9","['ABEV3', 'EGIE3', 'BBSE3', 'UGPA3', 'VVAR3', 'RADL3', 'JBSS3', 'BRFS3', 'VIVT4']","[1.125, 1.125, 1.0, 0.75, 0.625, 0.5, 0.25, 0.25, 0.25]","0.0001672458959617559"
1.0239815308180817,"Sep 02, 2019","9","['JBSS3', 'RADL3', 'CCRO3', 'HYPE3', 'ELET3', 'ELET6', 'FLRY3', 'BTOW3', 'QUAL3']","[0.25, 0.25, 0.25, 0.25, 0.25, 0.25, 0.25, 0.25, 0.25]","0.000397374301033176"
1.0016748677389946,"Oct 01, 2019","9","['ITUB4', 'UGPA3', 'BRKM5', 'WEGE3', 'KLBN11', 'CYRE3', 'BBDC4', 'GGBR4', 'JBSS3']","[2.0, 2.0, 2.0, 1.75, 1.75, 1.75, 1.25, 1.25, 0.75]","5.3851270259341677e-05"
1.0144109887859558,"Nov 01, 2019","9","['FLRY3', 'ELET6', 'B3SA3', 'UGPA3', 'BBSE3', 'SBSP3', 'IRBR3', 'BRML3', 'HYPE3']","[1.25, 0.5, 0.25, 0.25, 0.25, 0.25, 0.25, 0.25, 0.25]","0.00020443041755100353"