Date,Price,Open,High,Low
"Jun 03, 2019",6.480000019073486,6.53000020980835,6.539999961853027,6.449999809265137
"Jun 04, 2019",6.449999809265137,6.519999980926514,6.570000171661377,6.440000057220459
"Jun 05, 2019",6.349999904632568,6.480000019073486,6.5,6.349999904632568
"Jun 06, 2019",6.349999904632568,6.400000095367432,6.409999847412109,6.289999961853027
"Jun 07, 2019",6.53000020980835,6.389999866485596,6.53000020980835,6.329999923706055
"Jun 10, 2019",6.690000057220459,6.5,6.690000057220459,6.480000019073486
"Jun 11, 2019",6.909999847412109,6.75,6.96999979019165,6.75
"Jun 12, 2019",6.800000190734863,6.949999809265137,6.960000038146973,6.800000190734863
"Jun 13, 2019",6.920000076293945,6.880000114440918,6.989999771118164,6.840000152587891
"Jun 14, 2019",6.760000228881836,6.900000095367432,6.920000076293945,6.710000038146973
"Jun 17, 2019",6.690000057220459,6.75,6.789999961853027,6.670000076293945
"Jun 18, 2019",6.989999771118164,6.739999771118164,6.989999771118164,6.71999979019165
"Jun 19, 2019",7.110000133514404,7.010000228881836,7.139999866485596,6.960000038146973
"Jun 21, 2019",7.170000076293945,7.150000095367432,7.199999809265137,7.110000133514404
"Jun 24, 2019",7.190000057220459,7.190000057220459,7.21999979019165,7.119999885559082
"Jun 25, 2019",6.989999771118164,7.119999885559082,7.179999828338623,6.960000038146973
"Jun 26, 2019",7.150000095367432,7.079999923706055,7.150000095367432,6.989999771118164
"Jun 27, 2019",7.099999904632568,7.150000095367432,7.159999847412109,6.980000019073486
"Jun 28, 2019",7.239999771118164,7.150000095367432,7.239999771118164,7.110000133514404
"Jul 01, 2019",7.150000095367432,7.320000171661377,7.400000095367432,7.119999885559082
"Jul 02, 2019",6.949999809265137,7.159999847412109,7.170000076293945,6.900000095367432
"Jul 03, 2019",7.050000190734863,6.96999979019165,7.059999942779541,6.869999885559082
"Jul 04, 2019",7.21999979019165,7.090000152587891,7.230000019073486,7.090000152587891
"Jul 05, 2019",7.230000019073486,7.170000076293945,7.25,7.090000152587891
"Jul 08, 2019",7.269999980926514,7.260000228881836,7.309999942779541,7.199999809265137
"Jul 10, 2019",7.230000019073486,7.300000190734863,7.340000152587891,7.230000019073486
"Jul 11, 2019",7.050000190734863,7.300000190734863,7.300000190734863,6.989999771118164
"Jul 12, 2019",6.960000038146973,7.090000152587891,7.110000133514404,6.949999809265137
"Jul 15, 2019",7.090000152587891,6.989999771118164,7.090000152587891,6.96999979019165
"Jul 16, 2019",7.059999942779541,7.110000133514404,7.210000038146973,6.980000019073486
"Jul 17, 2019",7.0,7.050000190734863,7.079999923706055,6.960000038146973
"Jul 18, 2019",6.909999847412109,7.0,7.03000020980835,6.889999866485596
"Jul 19, 2019",6.900000095367432,6.909999847412109,6.989999771118164,6.840000152587891
"Jul 22, 2019",6.769999980926514,6.909999847412109,6.920000076293945,6.699999809265137
"Jul 23, 2019",6.809999942779541,6.829999923706055,6.860000133514404,6.730000019073486
"Jul 24, 2019",6.690000057220459,6.789999961853027,6.820000171661377,6.690000057220459
"Jul 25, 2019",6.630000114440918,6.730000019073486,6.739999771118164,6.559999942779541
"Jul 26, 2019",6.699999809265137,6.659999847412109,6.699999809265137,6.579999923706055
"Jul 29, 2019",6.710000038146973,6.71999979019165,6.75,6.670000076293945
"Jul 30, 2019",6.820000171661377,6.699999809265137,6.829999923706055,6.679999828338623
"Jul 31, 2019",6.650000095367432,6.840000152587891,6.849999904632568,6.599999904632568
"Aug 01, 2019",6.570000171661377,6.679999828338623,6.78000020980835,6.510000228881836
"Aug 02, 2019",6.559999942779541,6.599999904632568,6.630000114440918,6.489999771118164
"Aug 05, 2019",6.369999885559082,6.449999809265137,6.460000038146973,6.329999923706055
"Aug 06, 2019",6.409999847412109,6.420000076293945,6.460000038146973,6.329999923706055
"Aug 07, 2019",6.300000190734863,6.300000190734863,6.300000190734863,6.159999847412109
"Aug 08, 2019",6.590000152587891,6.400000095367432,6.590000152587891,6.369999885559082
"Aug 09, 2019",6.480000019073486,6.599999904632568,6.619999885559082,6.46999979019165
"Aug 12, 2019",6.329999923706055,6.360000133514404,6.449999809265137,6.320000171661377
"Aug 13, 2019",6.570000171661377,6.349999904632568,6.570000171661377,6.320000171661377
"Aug 14, 2019",6.25,6.5,6.53000020980835,6.25
"Aug 15, 2019",6.099999904632568,6.320000171661377,6.340000152587891,5.96999979019165
"Aug 16, 2019",6.28000020980835,6.179999828338623,6.309999942779541,6.059999942779541
"Aug 19, 2019",6.099999904632568,6.300000190734863,6.349999904632568,6.050000190734863
"Aug 20, 2019",6.159999847412109,6.03000020980835,6.25,5.989999771118164
"Aug 21, 2019",6.269999980926514,6.239999771118164,6.289999961853027,6.099999904632568
"Aug 22, 2019",6.28000020980835,6.230000019073486,6.369999885559082,6.190000057220459
"Aug 23, 2019",6.050000190734863,6.230000019073486,6.369999885559082,5.989999771118164
"Aug 26, 2019",5.889999866485596,6.119999885559082,6.130000114440918,5.829999923706055
"Aug 27, 2019",5.78000020980835,5.880000114440918,5.96999979019165,5.699999809265137
"Aug 28, 2019",5.809999942779541,5.75,5.849999904632568,5.690000057220459
"Aug 29, 2019",6.070000171661377,5.900000095367432,6.139999866485596,5.849999904632568
"Aug 30, 2019",6.25,6.170000076293945,6.269999980926514,6.090000152587891
"Sep 02, 2019",6.159999847412109,6.28000020980835,6.320000171661377,6.159999847412109
"Sep 03, 2019",6.130000114440918,6.130000114440918,6.199999809265137,6.059999942779541
"Sep 04, 2019",6.090000152587891,6.210000038146973,6.260000228881836,6.090000152587891
"Sep 05, 2019",6.150000095367432,6.170000076293945,6.289999961853027,6.130000114440918
"Sep 06, 2019",6.119999885559082,6.199999809265137,6.199999809265137,6.099999904632568
"Sep 09, 2019",6.380000114440918,6.150000095367432,6.46999979019165,6.099999904632568
"Sep 10, 2019",6.539999961853027,6.420000076293945,6.599999904632568,6.380000114440918
"Sep 11, 2019",6.420000076293945,6.599999904632568,6.619999885559082,6.389999866485596
"Sep 12, 2019",6.550000190734863,6.5,6.610000133514404,6.460000038146973
"Sep 13, 2019",6.5,6.579999923706055,6.619999885559082,6.460000038146973
"Sep 16, 2019",6.440000057220459,6.46999979019165,6.5,6.369999885559082
"Sep 17, 2019",6.510000228881836,6.380000114440918,6.519999980926514,6.360000133514404
"Sep 18, 2019",6.46999979019165,6.510000228881836,6.550000190734863,6.400000095367432
"Sep 19, 2019",6.449999809265137,6.480000019073486,6.539999961853027,6.400000095367432
"Sep 20, 2019",6.389999866485596,6.460000038146973,6.5,6.349999904632568
"Sep 23, 2019",6.400000095367432,6.349999904632568,6.460000038146973,6.320000171661377
"Sep 24, 2019",6.260000228881836,6.420000076293945,6.420000076293945,6.239999771118164
"Sep 25, 2019",6.289999961853027,6.260000228881836,6.329999923706055,6.130000114440918
"Sep 26, 2019",6.269999980926514,6.389999866485596,6.440000057220459,6.190000057220459
"Sep 27, 2019",6.239999771118164,6.260000228881836,6.349999904632568,6.199999809265137
"Sep 30, 2019",6.25,6.239999771118164,6.309999942779541,6.170000076293945
"Oct 01, 2019",6.230000019073486,6.230000019073486,6.340000152587891,6.190000057220459
"Oct 02, 2019",5.989999771118164,6.159999847412109,6.170000076293945,5.96999979019165
"Oct 03, 2019",6.050000190734863,6.010000228881836,6.070000171661377,5.929999828338623
"Oct 04, 2019",6.139999866485596,6.079999923706055,6.210000038146973,6.070000171661377
"Oct 07, 2019",5.980000019073486,6.099999904632568,6.159999847412109,5.980000019073486
"Oct 08, 2019",5.849999904632568,6.0,6.019999980926514,5.820000171661377
"Oct 09, 2019",5.829999923706055,5.920000076293945,5.949999809265137,5.820000171661377
"Oct 10, 2019",6.119999885559082,5.840000152587891,6.190000057220459,5.840000152587891
"Oct 11, 2019",6.309999942779541,6.199999809265137,6.369999885559082,6.170000076293945
"Oct 14, 2019",6.300000190734863,6.269999980926514,6.320000171661377,6.199999809265137
"Oct 15, 2019",6.369999885559082,6.300000190734863,6.440000057220459,6.289999961853027
"Oct 16, 2019",6.289999961853027,6.340000152587891,6.369999885559082,6.269999980926514
"Oct 17, 2019",6.300000190734863,6.300000190734863,6.360000133514404,6.21999979019165
"Oct 18, 2019",6.150000095367432,6.289999961853027,6.360000133514404,6.150000095367432
"Oct 21, 2019",6.199999809265137,6.199999809265137,6.239999771118164,6.150000095367432
"Oct 22, 2019",6.199999809265137,6.210000038146973,6.21999979019165,6.130000114440918
"Oct 23, 2019",6.179999828338623,6.190000057220459,6.28000020980835,6.150000095367432
"Oct 24, 2019",6.03000020980835,6.179999828338623,6.179999828338623,6.0
"Oct 25, 2019",6.199999809265137,6.03000020980835,6.230000019073486,6.03000020980835
"Oct 28, 2019",6.190000057220459,6.199999809265137,6.289999961853027,6.170000076293945
"Oct 29, 2019",6.159999847412109,6.170000076293945,6.25,6.119999885559082
"Oct 30, 2019",6.400000095367432,6.090000152587891,6.409999847412109,6.059999942779541
"Oct 31, 2019",6.289999961853027,6.340000152587891,6.440000057220459,6.239999771118164
"Nov 01, 2019",6.550000190734863,6.340000152587891,6.579999923706055,6.320000171661377
"Nov 04, 2019",6.820000171661377,6.590000152587891,6.860000133514404,6.590000152587891
"Nov 05, 2019",6.869999885559082,6.820000171661377,6.929999828338623,6.760000228881836
"Nov 06, 2019",6.869999885559082,6.880000114440918,6.900000095367432,6.710000038146973
"Nov 07, 2019",7.110000133514404,6.869999885559082,7.179999828338623,6.869999885559082
"Nov 08, 2019",7.050000190734863,7.010000228881836,7.190000057220459,6.960000038146973
"Nov 11, 2019",7.119999885559082,6.960000038146973,7.130000114440918,6.889999866485596
"Nov 12, 2019",7.110000133514404,7.150000095367432,7.150000095367432,6.980000019073486
"Nov 13, 2019",7.110000133514404,7.039999961853027,7.170000076293945,7.039999961853027
"Nov 14, 2019",7.179999828338623,7.110000133514404,7.199999809265137,7.019999980926514
"Nov 18, 2019",7.110000133514404,7.21999979019165,7.289999961853027,7.050000190734863
"Nov 19, 2019",7.119999885559082,7.099999904632568,7.21999979019165,7.03000020980835
"Nov 21, 2019",7.630000114440918,7.119999885559082,7.639999866485596,7.119999885559082
"Nov 22, 2019",7.760000228881836,7.559999942779541,7.809999942779541,7.510000228881836
"Nov 25, 2019",7.809999942779541,7.760000228881836,8.029999732971191,7.71999979019165
"Nov 26, 2019",8.0,7.71999979019165,8.029999732971191,7.710000038146973
"Nov 27, 2019",7.989999771118164,8.039999961853027,8.100000381469727,7.829999923706055
"Nov 28, 2019",7.900000095367432,7.960000038146973,8.0600004196167,7.820000171661377
"Nov 29, 2019",7.800000190734863,7.920000076293945,7.940000057220459,7.75
"Dec 02, 2019",8.050000190734863,7.599999904632568,8.050000190734863,7.559999942779541
"Dec 03, 2019",7.849999904632568,8.010000228881836,8.039999961853027,7.820000171661377
"Dec 04, 2019",7.920000076293945,7.909999847412109,8.0,7.849999904632568
"Dec 05, 2019",7.909999847412109,7.900000095367432,7.96999979019165,7.860000133514404
"Dec 06, 2019",8.100000381469727,7.889999866485596,8.1899995803833,7.869999885559082
"Dec 09, 2019",7.900000095367432,8.1899995803833,8.25,7.869999885559082
"Dec 10, 2019",8.0600004196167,7.900000095367432,8.149999618530273,7.820000171661377
"Dec 11, 2019",8.0,8.09000015258789,8.130000114440918,7.949999809265137
"Dec 12, 2019",8.100000381469727,8.050000190734863,8.119999885559082,7.980000019073486
"Dec 13, 2019",8.569999694824219,8.130000114440918,8.569999694824219,8.079999923706055
"Dec 16, 2019",8.479999542236328,8.600000381469727,8.630000114440918,8.380000114440918
"Dec 17, 2019",8.430000305175781,8.470000267028809,8.569999694824219,8.350000381469727
"Dec 18, 2019",8.390000343322754,8.4399995803833,8.470000267028809,8.329999923706055
"Dec 19, 2019",8.699999809265137,8.399999618530273,8.699999809265137,8.390000343322754
"Dec 20, 2019",8.930000305175781,8.710000038146973,9.039999961853027,8.710000038146973
"Dec 23, 2019",9.020000457763672,9.039999961853027,9.069999694824219,8.84000015258789
"Dec 26, 2019",9.140000343322754,9.0,9.140000343322754,8.9399995803833
"Dec 27, 2019",9.100000381469727,9.170000076293945,9.229999542236328,9.010000228881836
"Dec 30, 2019",9.279999732971191,9.109999656677246,9.279999732971191,9.079999923706055
"Jan 02, 2020",9.680000305175781,9.369999885559082,9.760000228881836,9.3100004196167
"Jan 03, 2020",9.699999809265137,9.40999984741211,9.699999809265137,9.390000343322754
"Jan 06, 2020",9.649999618530273,9.600000381469727,9.710000038146973,9.380000114440918
"Jan 07, 2020",9.720000267028809,9.609999656677246,9.789999961853027,9.539999961853027
"Jan 08, 2020",9.65999984741211,9.699999809265137,9.770000457763672,9.569999694824219
"Jan 09, 2020",9.670000076293945,9.640000343322754,9.760000228881836,9.600000381469727
"Jan 10, 2020",9.880000114440918,9.710000038146973,9.979999542236328,9.680000305175781
"Jan 13, 2020",10.399999618530273,9.949999809265137,10.399999618530273,9.949999809265137
"Jan 14, 2020",10.149999618530273,10.390000343322754,10.449999809265137,10.109999656677246
"Jan 15, 2020",10.170000076293945,10.170000076293945,10.369999885559082,9.930000305175781
"Jan 16, 2020",10.210000038146973,10.199999809265137,10.270000457763672,10.020000457763672
"Jan 17, 2020",10.420000076293945,10.279999732971191,10.420000076293945,10.140000343322754
"Jan 20, 2020",10.850000381469727,10.399999618530273,10.850000381469727,10.300000190734863
"Jan 21, 2020",10.510000228881836,10.739999771118164,10.739999771118164,10.460000038146973
"Jan 22, 2020",10.710000038146973,10.600000381469727,10.710000038146973,10.329999923706055
"Jan 23, 2020",10.619999885559082,10.5,10.6899995803833,10.40999984741211
"Jan 24, 2020",10.380000114440918,10.670000076293945,10.729999542236328,10.229999542236328
"Jan 27, 2020",9.600000381469727,10.010000228881836,10.050000190734863,9.600000381469727
"Jan 28, 2020",9.859999656677246,9.699999809265137,10.020000457763672,9.699999809265137
"Jan 29, 2020",9.670000076293945,9.989999771118164,9.989999771118164,9.600000381469727
"Jan 30, 2020",9.899999618530273,9.369999885559082,9.899999618530273,9.279999732971191
"Jan 31, 2020",9.529999732971191,9.670000076293945,9.770000457763672,9.529999732971191
"Feb 03, 2020",9.890000343322754,9.600000381469727,9.90999984741211,9.3100004196167
"Feb 04, 2020",10.079999923706055,10.029999732971191,10.119999885559082,9.930000305175781
"Feb 05, 2020",10.239999771118164,10.170000076293945,10.350000381469727,10.149999618530273
"Feb 06, 2020",9.880000114440918,10.399999618530273,10.479999542236328,9.880000114440918
"Feb 07, 2020",9.470000267028809,9.880000114440918,9.960000038146973,9.369999885559082
"Feb 10, 2020",9.420000076293945,9.510000228881836,9.649999618530273,9.319999694824219
"Feb 11, 2020",9.829999923706055,9.579999923706055,9.930000305175781,9.460000038146973
"Feb 12, 2020",10.010000228881836,9.920000076293945,10.170000076293945,9.899999618530273
"Feb 13, 2020",10.010000228881836,9.869999885559082,10.039999961853027,9.6899995803833
"Feb 14, 2020",9.670000076293945,10.0,10.0,9.569999694824219
"Feb 17, 2020",9.760000228881836,9.779999732971191,9.800000190734863,9.579999923706055
"Feb 18, 2020",9.640000343322754,9.630000114440918,9.640000343322754,9.449999809265137
"Feb 19, 2020",10.140000343322754,9.539999961853027,10.140000343322754,9.170000076293945
"Feb 20, 2020",9.390000343322754,10.079999923706055,10.079999923706055,9.350000381469727
"Feb 21, 2020",9.079999923706055,9.369999885559082,9.390000343322754,8.960000038146973
"Feb 27, 2020",7.869999885559082,7.829999923706055,8.25,7.75
"Feb 28, 2020",7.949999809265137,7.820000171661377,7.949999809265137,7.449999809265137
"Mar 02, 2020",8.220000267028809,8.100000381469727,8.260000228881836,7.900000095367432
"Mar 03, 2020",8.170000076293945,8.25,8.430000305175781,7.980000019073486
"Mar 04, 2020",8.649999618530273,8.390000343322754,8.729999542236328,8.279999732971191
"Mar 05, 2020",8.149999618530273,8.5,8.510000228881836,7.909999847412109
"Mar 06, 2020",7.599999904632568,7.710000038146973,7.809999942779541,7.400000095367432
"Mar 09, 2020",6.25,6.670000076293945,6.789999961853027,6.0
"Mar 10, 2020",6.789999961853027,6.769999980926514,6.840000152587891,6.110000133514404
"Mar 11, 2020",5.96999979019165,6.519999980926514,6.650000095367432,5.53000020980835
"Mar 12, 2020",4.699999809265137,5.050000190734863,5.159999847412109,4.199999809265137
"Mar 13, 2020",5.670000076293945,5.5,5.699999809265137,4.690000057220459
"Mar 16, 2020",5.039999961853027,4.769999980926514,5.320000171661377,4.650000095367432
"Mar 17, 2020",5.039999961853027,5.199999809265137,5.409999847412109,4.78000020980835
"Mar 18, 2020",4.320000171661377,4.550000190734863,4.75,3.9700000286102295
"Mar 19, 2020",4.239999771118164,4.0,4.659999847412109,3.7100000381469727
"Mar 20, 2020",4.150000095367432,4.550000190734863,4.650000095367432,3.940000057220459
"Mar 23, 2020",3.8399999141693115,4.119999885559082,4.150000095367432,3.799999952316284
"Mar 24, 2020",4.170000076293945,4.199999809265137,4.25,3.990000009536743
"Mar 25, 2020",4.559999942779541,4.150000095367432,4.699999809265137,4.139999866485596
"Mar 26, 2020",4.809999942779541,4.449999809265137,5.070000171661377,4.440000057220459
"Mar 27, 2020",4.599999904632568,4.559999942779541,4.809999942779541,4.480000019073486
"Mar 30, 2020",4.5,4.690000057220459,4.760000228881836,4.389999866485596
"Mar 31, 2020",4.650000095367432,4.550000190734863,4.869999885559082,4.5
"Apr 01, 2020",4.460000038146973,4.510000228881836,4.590000152587891,4.369999885559082
"Apr 02, 2020",4.559999942779541,4.619999885559082,4.809999942779541,4.440000057220459
"Apr 03, 2020",4.179999828338623,4.599999904632568,4.639999866485596,4.070000171661377
"Apr 06, 2020",4.340000152587891,4.480000019073486,4.519999980926514,4.260000228881836
"Apr 07, 2020",4.599999904632568,4.670000076293945,4.849999904632568,4.599999904632568
"Apr 08, 2020",4.889999866485596,4.599999904632568,4.989999771118164,4.570000171661377
"Apr 09, 2020",4.71999979019165,5.0,5.050000190734863,4.679999828338623
"Apr 13, 2020",4.960000038146973,4.699999809265137,4.960000038146973,4.610000133514404
"Apr 14, 2020",5.110000133514404,5.070000171661377,5.25,5.039999961853027
"Apr 15, 2020",5.019999980926514,4.880000114440918,5.079999923706055,4.809999942779541
"Apr 16, 2020",5.099999904632568,5.119999885559082,5.150000095367432,4.920000076293945
"Apr 17, 2020",5.400000095367432,5.25,5.480000019073486,5.230000019073486
"Apr 20, 2020",5.199999809265137,5.21999979019165,5.429999828338623,5.150000095367432
"Apr 22, 2020",5.170000076293945,5.230000019073486,5.360000133514404,5.110000133514404
"Apr 23, 2020",5.320000171661377,5.210000038146973,5.570000171661377,5.150000095367432
"Apr 24, 2020",4.849999904632568,5.210000038146973,5.360000133514404,4.699999809265137
"Apr 27, 2020",5.03000020980835,5.0,5.099999904632568,4.840000152587891
"Apr 28, 2020",5.269999980926514,5.199999809265137,5.360000133514404,5.110000133514404
"Apr 29, 2020",5.5,5.400000095367432,5.650000095367432,5.340000152587891
"Apr 30, 2020",5.150000095367432,5.300000190734863,5.369999885559082,5.119999885559082
"May 04, 2020",5.099999904632568,4.940000057220459,5.119999885559082,4.889999866485596
"May 05, 2020",5.139999866485596,5.21999979019165,5.320000171661377,5.119999885559082
"May 06, 2020",5.199999809265137,5.170000076293945,5.309999942779541,4.940000057220459
"May 07, 2020",5.539999961853027,5.300000190734863,5.639999866485596,5.21999979019165
"May 08, 2020",5.829999923706055,5.739999771118164,5.849999904632568,5.579999923706055
"May 11, 2020",5.639999866485596,5.769999980926514,5.829999923706055,5.579999923706055
"May 12, 2020",5.440000057220459,5.690000057220459,5.739999771118164,5.380000114440918
"May 13, 2020",5.170000076293945,5.5,5.53000020980835,5.119999885559082
"May 14, 2020",5.25,5.070000171661377,5.269999980926514,4.880000114440918
"May 15, 2020",4.949999809265137,5.170000076293945,5.269999980926514,4.949999809265137
"May 18, 2020",5.420000076293945,5.159999847412109,5.46999979019165,5.139999866485596
"May 19, 2020",5.429999828338623,5.440000057220459,5.550000190734863,5.340000152587891
"May 20, 2020",5.420000076293945,5.510000228881836,5.639999866485596,5.409999847412109
"May 21, 2020",5.480000019073486,5.449999809265137,5.599999904632568,5.329999923706055
"May 22, 2020",5.320000171661377,5.380000114440918,5.440000057220459,5.25
"May 25, 2020",5.619999885559082,5.480000019073486,5.639999866485596,5.46999979019165
"May 26, 2020",5.440000057220459,5.710000038146973,5.849999904632568,5.400000095367432
"May 27, 2020",6.079999923706055,5.53000020980835,6.079999923706055,5.510000228881836
"May 28, 2020",6.199999809265137,6.070000171661377,6.28000020980835,5.96999979019165
"May 29, 2020",6.170000076293945,6.260000228881836,6.380000114440918,6.0
"Jun 01, 2020",6.210000038146973,6.25,6.309999942779541,6.110000133514404
"Jun 02, 2020",6.480000019073486,6.300000190734863,6.639999866485596,6.28000020980835
"Jun 03, 2020",6.949999809265137,6.630000114440918,7.050000190734863,6.480000019073486
"Jun 04, 2020",7.039999961853027,6.849999904632568,7.139999866485596,6.78000020980835
"Jun 05, 2020",7.070000171661377,7.28000020980835,7.420000076293945,7.019999980926514
"Jun 08, 2020",7.230000019073486,7.159999847412109,7.340000152587891,7.070000171661377
"Jun 09, 2020",7.03000020980835,7.03000020980835,7.119999885559082,6.920000076293945
"Jun 10, 2020",6.769999980926514,7.139999866485596,7.179999828338623,6.710000038146973
"Jun 12, 2020",6.510000228881836,6.489999771118164,6.659999847412109,6.329999923706055
"Jun 15, 2020",6.420000076293945,6.28000020980835,6.480000019073486,6.190000057220459
"Jun 16, 2020",6.889999866485596,6.820000171661377,6.980000019073486,6.679999828338623
"Jun 17, 2020",6.849999904632568,6.889999866485596,6.96999979019165,6.739999771118164
"Jun 18, 2020",7.019999980926514,6.75,7.039999961853027,6.71999979019165
"Jun 19, 2020",7.059999942779541,7.150000095367432,7.489999771118164,7.059999942779541
"Jun 22, 2020",6.989999771118164,7.059999942779541,7.150000095367432,6.920000076293945
"Jun 23, 2020",7.159999847412109,7.139999866485596,7.409999847412109,7.099999904632568
"Jun 24, 2020",7.190000057220459,7.119999885559082,7.25,7.010000228881836
"Jun 25, 2020",7.150000095367432,7.239999771118164,7.239999771118164,7.0
"Jun 26, 2020",6.96999979019165,7.059999942779541,7.199999809265137,6.829999923706055
"Jun 29, 2020",7.110000133514404,7.070000171661377,7.110000133514404,6.929999828338623
"Jun 30, 2020",7.309999942779541,7.039999961853027,7.369999885559082,7.0
"Jul 01, 2020",7.070000171661377,7.349999904632568,7.409999847412109,7.0
"Jul 02, 2020",7.230000019073486,7.199999809265137,7.289999961853027,7.130000114440918
"Jul 03, 2020",7.269999980926514,7.190000057220459,7.28000020980835,7.139999866485596
"Jul 06, 2020",7.360000133514404,7.400000095367432,7.599999904632568,7.28000020980835
"Jul 07, 2020",7.260000228881836,7.300000190734863,7.360000133514404,7.179999828338623
"Jul 08, 2020",7.369999885559082,7.329999923706055,7.519999980926514,7.289999961853027
"Jul 09, 2020",7.329999923706055,7.420000076293945,7.429999828338623,7.21999979019165
"Jul 10, 2020",7.320000171661377,7.300000190734863,7.420000076293945,7.260000228881836
"Jul 13, 2020",7.409999847412109,7.409999847412109,7.769999980926514,7.389999866485596
"Jul 14, 2020",7.630000114440918,7.449999809265137,7.690000057220459,7.309999942779541
"Jul 15, 2020",7.659999847412109,7.739999771118164,7.75,7.519999980926514
"Jul 16, 2020",7.550000190734863,7.610000133514404,7.630000114440918,7.480000019073486
"Jul 17, 2020",7.599999904632568,7.579999923706055,7.659999847412109,7.519999980926514
"Jul 20, 2020",7.679999828338623,7.610000133514404,7.71999979019165,7.590000152587891
"Jul 21, 2020",7.570000171661377,7.71999979019165,7.730000019073486,7.460000038146973
"Jul 22, 2020",7.96999979019165,7.559999942779541,8.020000457763672,7.539999961853027
"Jul 23, 2020",7.670000076293945,8.0,8.09000015258789,7.570000171661377
"Jul 24, 2020",7.889999866485596,7.630000114440918,7.949999809265137,7.519999980926514
"Jul 27, 2020",8.25,7.920000076293945,8.300000190734863,7.909999847412109
"Jul 28, 2020",8.170000076293945,8.220000267028809,8.229999542236328,8.020000457763672
"Jul 29, 2020",8.220000267028809,8.199999809265137,8.279999732971191,8.119999885559082
"Jul 30, 2020",8.119999885559082,8.109999656677246,8.220000267028809,8.029999732971191
"Jul 31, 2020",8.039999961853027,8.119999885559082,8.15999984741211,7.929999828338623
"Aug 03, 2020",8.069999694824219,8.109999656677246,8.25,8.020000457763672
"Aug 04, 2020",8.079999923706055,8.020000457763672,8.180000305175781,7.880000114440918
"Aug 05, 2020",8.529999732971191,8.260000228881836,8.630000114440918,8.260000228881836
"Aug 06, 2020",8.319999694824219,8.539999961853027,8.600000381469727,8.260000228881836
"Aug 07, 2020",8.100000381469727,8.220000267028809,8.3100004196167,7.949999809265137
"Aug 10, 2020",8.4399995803833,8.15999984741211,8.449999809265137,8.130000114440918
"Aug 11, 2020",8.3100004196167,8.5,8.539999961853027,8.279999732971191
"Aug 12, 2020",8.319999694824219,8.390000343322754,8.520000457763672,8.15999984741211
"Aug 13, 2020",8.260000228881836,8.350000381469727,8.420000076293945,8.1899995803833
"Aug 14, 2020",8.3100004196167,8.25,8.3100004196167,8.140000343322754
"Aug 17, 2020",8.359999656677246,8.329999923706055,8.470000267028809,8.239999771118164
"Aug 18, 2020",8.949999809265137,8.5,9.039999961853027,8.4399995803833
"Aug 19, 2020",9.15999984741211,9.020000457763672,9.359999656677246,8.970000267028809
"Aug 20, 2020",9.279999732971191,8.989999771118164,9.300000190734863,8.930000305175781
"Aug 21, 2020",9.039999961853027,9.239999771118164,9.260000228881836,8.859999656677246
"Aug 24, 2020",9.020000457763672,9.079999923706055,9.130000114440918,8.949999809265137
"Aug 25, 2020",8.960000038146973,9.029999732971191,9.039999961853027,8.829999923706055
"Aug 26, 2020",8.890000343322754,8.949999809265137,9.1899995803833,8.770000457763672
"Aug 27, 2020",8.789999961853027,8.90999984741211,9.010000228881836,8.699999809265137
"Aug 28, 2020",8.9399995803833,8.789999961853027,8.970000267028809,8.760000228881836
"Aug 31, 2020",8.789999961853027,8.869999885559082,9.010000228881836,8.789999961853027
