Date,Price,Open,High,Low
"Jun 03, 2019",39.689998626708984,39.5,40.0,38.880001068115234
"Jun 04, 2019",40.0,39.810001373291016,40.20000076293945,39.619998931884766
"Jun 05, 2019",40.619998931884766,40.0,41.529998779296875,39.52000045776367
"Jun 06, 2019",42.689998626708984,41.220001220703125,42.689998626708984,41.11000061035156
"Jun 07, 2019",43.65999984741211,42.52000045776367,43.75,42.400001525878906
"Jun 10, 2019",44.099998474121094,43.349998474121094,44.099998474121094,42.59000015258789
"Jun 11, 2019",43.7400016784668,43.90999984741211,44.45000076293945,42.0099983215332
"Jun 12, 2019",43.619998931884766,43.5099983215332,44.34000015258789,43.0
"Jun 13, 2019",44.25,43.880001068115234,44.54999923706055,43.689998626708984
"Jun 14, 2019",43.790000915527344,44.15999984741211,44.650001525878906,43.11000061035156
"Jun 17, 2019",44.779998779296875,43.439998626708984,44.779998779296875,43.2599983215332
"Jun 18, 2019",45.25,44.9900016784668,45.869998931884766,44.0099983215332
"Jun 19, 2019",45.400001525878906,45.25,45.540000915527344,44.70000076293945
"Jun 21, 2019",44.2599983215332,45.630001068115234,45.75,43.66999816894531
"Jun 24, 2019",43.56999969482422,44.279998779296875,44.79999923706055,43.380001068115234
"Jun 25, 2019",42.599998474121094,43.209999084472656,43.56999969482422,42.0099983215332
"Jun 26, 2019",42.38999938964844,42.900001525878906,43.79999923706055,41.5099983215332
"Jun 27, 2019",42.470001220703125,42.08000183105469,42.59000015258789,41.540000915527344
"Jun 28, 2019",43.290000915527344,42.79999923706055,43.290000915527344,42.439998626708984
"Jul 01, 2019",42.09000015258789,43.5,43.79999923706055,41.959999084472656
"Jul 02, 2019",42.40999984741211,42.25,42.529998779296875,41.84000015258789
"Jul 03, 2019",44.060001373291016,42.29999923706055,44.209999084472656,42.15999984741211
"Jul 04, 2019",46.75,44.599998474121094,46.75,44.56999969482422
"Jul 05, 2019",48.45000076293945,47.04999923706055,48.81999969482422,45.59000015258789
"Jul 08, 2019",48.72999954223633,48.7599983215332,49.599998474121094,48.31999969482422
"Jul 10, 2019",49.9900016784668,49.29999923706055,51.040000915527344,48.70000076293945
"Jul 11, 2019",49.470001220703125,49.959999084472656,49.959999084472656,48.5
"Jul 12, 2019",49.09000015258789,49.650001525878906,49.97999954223633,48.58000183105469
"Jul 15, 2019",49.36000061035156,49.0,50.20000076293945,48.56999969482422
"Jul 16, 2019",50.0,49.27000045776367,50.02000045776367,48.97999954223633
"Jul 17, 2019",49.63999938964844,50.5,50.65999984741211,48.84000015258789
"Jul 18, 2019",49.849998474121094,49.84000015258789,50.22999954223633,49.2400016784668
"Jul 19, 2019",49.70000076293945,49.29999923706055,50.25,49.25
"Jul 22, 2019",49.900001525878906,49.70000076293945,50.400001525878906,49.34000015258789
"Jul 23, 2019",49.029998779296875,50.25,50.27000045776367,48.650001525878906
"Jul 24, 2019",49.45000076293945,48.81999969482422,49.779998779296875,48.81999969482422
"Jul 25, 2019",50.88999938964844,49.54999923706055,50.88999938964844,48.09000015258789
"Jul 26, 2019",51.88999938964844,52.25,52.29999923706055,50.45000076293945
"Jul 29, 2019",52.91999816894531,51.810001373291016,52.91999816894531,51.25
"Jul 30, 2019",53.0099983215332,52.70000076293945,53.56999969482422,52.25
"Jul 31, 2019",51.779998779296875,53.18000030517578,53.5099983215332,51.150001525878906
"Aug 01, 2019",54.130001068115234,52.29999923706055,54.400001525878906,51.790000915527344
"Aug 02, 2019",53.599998474121094,53.77000045776367,53.97999954223633,52.400001525878906
"Aug 05, 2019",51.650001525878906,52.45000076293945,52.88999938964844,50.65999984741211
"Aug 06, 2019",52.970001220703125,52.0,53.470001220703125,52.0
"Aug 07, 2019",53.119998931884766,52.70000076293945,53.290000915527344,51.31999969482422
"Aug 08, 2019",54.54999923706055,54.220001220703125,55.31999969482422,53.880001068115234
"Aug 09, 2019",55.470001220703125,53.849998474121094,56.68000030517578,53.849998474121094
"Aug 12, 2019",54.29999923706055,54.0,54.72999954223633,51.65999984741211
"Aug 13, 2019",53.54999923706055,55.150001525878906,55.5099983215332,52.529998779296875
"Aug 14, 2019",50.970001220703125,53.54999923706055,53.720001220703125,50.70000076293945
"Aug 15, 2019",50.560001373291016,51.5,51.900001525878906,49.81999969482422
"Aug 16, 2019",50.470001220703125,51.0099983215332,51.72999954223633,49.70000076293945
"Aug 19, 2019",49.83000183105469,50.849998474121094,51.5,48.86000061035156
"Aug 20, 2019",49.68000030517578,50.0,50.310001373291016,48.310001373291016
"Aug 21, 2019",50.849998474121094,50.400001525878906,50.849998474121094,49.650001525878906
"Aug 22, 2019",48.939998626708984,50.5099983215332,50.790000915527344,48.720001220703125
"Aug 23, 2019",47.29999923706055,48.599998474121094,48.72999954223633,46.40999984741211
"Aug 26, 2019",46.0,47.349998474121094,48.02000045776367,45.849998474121094
"Aug 27, 2019",45.97999954223633,46.20000076293945,46.77000045776367,44.880001068115234
"Aug 28, 2019",46.540000915527344,45.2599983215332,46.63999938964844,45.15999984741211
"Aug 29, 2019",48.54999923706055,46.79999923706055,48.97999954223633,45.45000076293945
"Aug 30, 2019",47.099998474121094,49.29999923706055,49.779998779296875,47.099998474121094
"Sep 02, 2019",47.13999938964844,47.47999954223633,48.09000015258789,46.630001068115234
"Sep 03, 2019",45.959999084472656,47.08000183105469,48.150001525878906,45.70000076293945
"Sep 04, 2019",47.11000061035156,46.5,47.15999984741211,46.09000015258789
"Sep 05, 2019",49.220001220703125,47.52000045776367,49.439998626708984,47.38999938964844
"Sep 06, 2019",49.349998474121094,49.81999969482422,50.689998626708984,48.88999938964844
"Sep 09, 2019",48.38999938964844,49.470001220703125,49.790000915527344,47.529998779296875
"Sep 10, 2019",48.150001525878906,48.380001068115234,48.380001068115234,47.02000045776367
"Sep 11, 2019",49.38999938964844,48.65999984741211,49.9900016784668,48.65999984741211
"Sep 12, 2019",52.04999923706055,49.900001525878906,52.56999969482422,49.63999938964844
"Sep 13, 2019",51.34000015258789,52.45000076293945,52.56999969482422,50.810001373291016
"Sep 16, 2019",47.0,49.41999816894531,49.529998779296875,46.599998474121094
"Sep 17, 2019",48.45000076293945,47.7400016784668,49.130001068115234,47.15999984741211
"Sep 18, 2019",49.20000076293945,48.81999969482422,49.25,47.849998474121094
"Sep 19, 2019",49.279998779296875,48.900001525878906,50.08000183105469,48.79999923706055
"Sep 20, 2019",48.72999954223633,49.099998474121094,49.689998626708984,48.0099983215332
"Sep 23, 2019",48.130001068115234,48.47999954223633,48.68000030517578,47.77000045776367
"Sep 24, 2019",47.279998779296875,48.599998474121094,48.66999816894531,47.15999984741211
"Sep 25, 2019",48.5,47.310001373291016,48.68000030517578,46.91999816894531
"Sep 26, 2019",49.869998931884766,48.77000045776367,49.900001525878906,48.29999923706055
"Sep 27, 2019",49.619998931884766,49.380001068115234,49.7400016784668,48.08000183105469
"Sep 30, 2019",49.709999084472656,49.79999923706055,50.220001220703125,49.08000183105469
"Oct 01, 2019",48.939998626708984,50.09000015258789,50.34000015258789,48.36000061035156
"Oct 02, 2019",47.90999984741211,48.61000061035156,48.61000061035156,46.709999084472656
"Oct 03, 2019",49.88999938964844,47.91999816894531,50.150001525878906,47.45000076293945
"Oct 04, 2019",50.95000076293945,50.15999984741211,51.31999969482422,49.29999923706055
"Oct 07, 2019",50.59000015258789,50.900001525878906,51.380001068115234,50.27000045776367
"Oct 08, 2019",50.20000076293945,50.599998474121094,51.72999954223633,49.93000030517578
"Oct 09, 2019",49.5,51.0,51.33000183105469,49.34000015258789
"Oct 10, 2019",49.68000030517578,49.84000015258789,49.900001525878906,48.70000076293945
"Oct 11, 2019",50.400001525878906,49.7599983215332,50.77000045776367,49.72999954223633
"Oct 14, 2019",51.18000030517578,50.599998474121094,51.54999923706055,50.2599983215332
"Oct 15, 2019",51.209999084472656,51.439998626708984,51.720001220703125,51.0
"Oct 16, 2019",51.29999923706055,51.209999084472656,51.40999984741211,50.099998474121094
"Oct 17, 2019",51.2599983215332,51.41999816894531,52.279998779296875,51.220001220703125
"Oct 18, 2019",50.9900016784668,50.880001068115234,51.369998931884766,50.529998779296875
"Oct 21, 2019",51.349998474121094,50.84000015258789,51.40999984741211,50.54999923706055
"Oct 22, 2019",52.9900016784668,51.220001220703125,53.029998779296875,50.95000076293945
"Oct 23, 2019",52.150001525878906,52.9900016784668,53.2599983215332,51.90999984741211
"Oct 24, 2019",52.900001525878906,52.20000076293945,53.150001525878906,51.900001525878906
"Oct 25, 2019",52.540000915527344,52.900001525878906,53.59000015258789,52.439998626708984
"Oct 28, 2019",53.15999984741211,52.540000915527344,53.290000915527344,52.290000915527344
"Oct 29, 2019",53.5,53.2400016784668,53.52000045776367,52.43000030517578
"Oct 30, 2019",53.63999938964844,53.400001525878906,53.63999938964844,52.5099983215332
"Oct 31, 2019",52.52000045776367,53.400001525878906,53.400001525878906,52.029998779296875
"Nov 01, 2019",53.54999923706055,52.849998474121094,53.68000030517578,52.04999923706055
"Nov 04, 2019",53.5,53.70000076293945,54.15999984741211,53.0
"Nov 05, 2019",53.369998931884766,53.5099983215332,54.56999969482422,52.439998626708984
"Nov 06, 2019",51.72999954223633,53.5,54.349998474121094,51.72999954223633
"Nov 07, 2019",52.4900016784668,52.09000015258789,52.779998779296875,51.0
"Nov 08, 2019",50.91999816894531,52.02000045776367,52.2400016784668,49.709999084472656
"Nov 11, 2019",50.45000076293945,50.470001220703125,50.779998779296875,49.540000915527344
"Nov 12, 2019",48.5099983215332,50.2400016784668,50.2400016784668,48.5099983215332
"Nov 13, 2019",48.130001068115234,48.349998474121094,49.220001220703125,47.70000076293945
"Nov 14, 2019",50.099998474121094,48.119998931884766,50.31999969482422,48.119998931884766
"Nov 18, 2019",50.900001525878906,50.099998474121094,51.79999923706055,49.869998931884766
"Nov 19, 2019",50.4900016784668,51.150001525878906,51.650001525878906,49.959999084472656
"Nov 21, 2019",52.20000076293945,50.88999938964844,52.20000076293945,50.619998931884766
"Nov 22, 2019",54.66999816894531,52.099998474121094,54.66999816894531,51.83000183105469
"Nov 25, 2019",53.84000015258789,54.25,54.630001068115234,53.33000183105469
"Nov 26, 2019",51.400001525878906,53.84000015258789,53.84000015258789,50.310001373291016
"Nov 27, 2019",50.9900016784668,51.599998474121094,52.060001373291016,50.43000030517578
"Nov 28, 2019",52.75,51.150001525878906,52.95000076293945,50.880001068115234
"Nov 29, 2019",53.099998474121094,52.70000076293945,53.2599983215332,52.22999954223633
"Dec 02, 2019",52.939998626708984,52.900001525878906,53.08000183105469,52.2400016784668
"Dec 03, 2019",53.5,53.04999923706055,53.5,52.45000076293945
"Dec 04, 2019",53.40999984741211,53.56999969482422,54.099998474121094,52.9900016784668
"Dec 05, 2019",53.40999984741211,53.189998626708984,54.0,52.959999084472656
"Dec 06, 2019",54.70000076293945,53.5,54.83000183105469,52.7599983215332
"Dec 09, 2019",54.709999084472656,54.689998626708984,55.400001525878906,54.08000183105469
"Dec 10, 2019",53.599998474121094,54.470001220703125,54.470001220703125,52.33000183105469
"Dec 11, 2019",54.63999938964844,53.9900016784668,54.86000061035156,53.630001068115234
"Dec 12, 2019",55.06999969482422,55.0,55.4900016784668,54.189998626708984
"Dec 13, 2019",56.86000061035156,55.400001525878906,57.04999923706055,55.119998931884766
"Dec 16, 2019",57.27000045776367,57.0,57.81999969482422,56.630001068115234
"Dec 17, 2019",56.869998931884766,57.150001525878906,57.45000076293945,56.33000183105469
"Dec 18, 2019",57.61000061035156,56.869998931884766,58.060001373291016,56.5099983215332
"Dec 19, 2019",57.709999084472656,57.599998474121094,57.900001525878906,56.81999969482422
"Dec 20, 2019",57.0,57.70000076293945,57.70000076293945,56.34000015258789
"Dec 23, 2019",57.599998474121094,57.0,57.849998474121094,56.65999984741211
"Dec 26, 2019",57.06999969482422,57.65999984741211,58.150001525878906,57.040000915527344
"Dec 27, 2019",57.79999923706055,57.40999984741211,57.79999923706055,56.65999984741211
"Dec 30, 2019",58.279998779296875,57.599998474121094,58.79999923706055,57.43000030517578
"Jan 02, 2020",58.79999923706055,58.779998779296875,59.29999923706055,58.150001525878906
"Jan 03, 2020",56.7599983215332,57.040000915527344,58.209999084472656,56.61000061035156
"Jan 06, 2020",55.0,56.61000061035156,56.61000061035156,54.560001373291016
"Jan 07, 2020",56.81999969482422,55.790000915527344,57.060001373291016,55.099998474121094
"Jan 08, 2020",56.91999816894531,56.310001373291016,57.61000061035156,56.0099983215332
"Jan 09, 2020",57.279998779296875,57.060001373291016,58.18000030517578,56.900001525878906
"Jan 10, 2020",57.5,57.52000045776367,58.09000015258789,56.95000076293945
"Jan 13, 2020",58.29999923706055,57.5,58.38999938964844,57.41999816894531
"Jan 14, 2020",59.189998626708984,58.29999923706055,59.189998626708984,57.93000030517578
"Jan 15, 2020",59.29999923706055,59.380001068115234,59.79999923706055,58.70000076293945
"Jan 16, 2020",59.439998626708984,59.81999969482422,60.4900016784668,59.130001068115234
"Jan 17, 2020",61.349998474121094,59.95000076293945,61.349998474121094,59.75
"Jan 20, 2020",61.77000045776367,61.25,61.77000045776367,60.88999938964844
"Jan 21, 2020",60.04999923706055,61.400001525878906,61.54999923706055,59.709999084472656
"Jan 22, 2020",59.599998474121094,60.099998474121094,61.040000915527344,58.459999084472656
"Jan 23, 2020",61.20000076293945,59.5,61.22999954223633,57.86000061035156
"Jan 24, 2020",59.459999084472656,61.2400016784668,61.4900016784668,59.25
"Jan 27, 2020",57.47999954223633,56.70000076293945,58.130001068115234,56.65999984741211
"Jan 28, 2020",62.40999984741211,59.0,62.66999816894531,58.79999923706055
"Jan 29, 2020",59.869998931884766,62.54999923706055,62.869998931884766,59.29999923706055
"Jan 30, 2020",59.709999084472656,59.0,59.779998779296875,57.369998931884766
"Jan 31, 2020",59.2599983215332,58.099998474121094,59.68000030517578,57.84000015258789
"Feb 03, 2020",60.130001068115234,59.2599983215332,61.25,58.97999954223633
"Feb 04, 2020",60.79999923706055,61.43000030517578,61.7599983215332,60.36000061035156
"Feb 05, 2020",61.27000045776367,61.66999816894531,62.0,61.27000045776367
"Feb 06, 2020",59.06999969482422,61.95000076293945,61.95000076293945,58.88999938964844
"Feb 07, 2020",56.290000915527344,59.380001068115234,59.45000076293945,56.290000915527344
"Feb 10, 2020",56.81999969482422,56.29999923706055,56.900001525878906,55.34000015258789
"Feb 11, 2020",58.34000015258789,58.34000015258789,58.91999816894531,57.31999969482422
"Feb 12, 2020",59.65999984741211,58.5,60.54999923706055,58.099998474121094
"Feb 13, 2020",59.0,58.79999923706055,59.189998626708984,57.93000030517578
"Feb 14, 2020",59.2400016784668,59.150001525878906,59.790000915527344,58.5
"Feb 17, 2020",58.70000076293945,59.9900016784668,59.9900016784668,58.54999923706055
"Feb 18, 2020",58.02000045776367,58.599998474121094,58.599998474121094,57.16999816894531
"Feb 19, 2020",58.08000183105469,58.0,58.77000045776367,57.599998474121094
"Feb 20, 2020",56.400001525878906,57.5099983215332,57.86000061035156,55.959999084472656
"Feb 21, 2020",55.650001525878906,55.790000915527344,56.209999084472656,54.959999084472656
"Feb 27, 2020",45.130001068115234,47.790000915527344,48.310001373291016,44.52000045776367
"Feb 28, 2020",44.439998626708984,44.11000061035156,45.290000915527344,42.54999923706055
"Mar 02, 2020",45.189998626708984,45.650001525878906,46.959999084472656,44.34000015258789
"Mar 03, 2020",44.0,45.400001525878906,46.380001068115234,43.66999816894531
"Mar 04, 2020",44.75,46.0,46.209999084472656,43.5099983215332
"Mar 05, 2020",38.25,43.849998474121094,43.849998474121094,37.70000076293945
"Mar 06, 2020",38.68000030517578,34.5099983215332,39.779998779296875,33.79999923706055
"Mar 09, 2020",32.099998474121094,36.0,36.349998474121094,31.549999237060547
"Mar 10, 2020",36.18000030517578,36.79999923706055,36.79999923706055,32.900001525878906
"Mar 11, 2020",30.25,33.97999954223633,35.119998931884766,28.479999542236328
"Mar 12, 2020",20.299999237060547,20.020000457763672,22.020000457763672,20.0
"Mar 13, 2020",24.709999084472656,24.469999313354492,25.0,20.299999237060547
"Mar 16, 2020",15.600000381469727,17.399999618530273,20.780000686645508,15.579999923706055
"Mar 17, 2020",15.229999542236328,16.34000015258789,16.34000015258789,13.720000267028809
"Mar 18, 2020",10.350000381469727,13.5,13.5,9.100000381469727
"Mar 19, 2020",11.970000267028809,9.800000190734863,13.399999618530273,8.739999771118164
"Mar 20, 2020",13.800000190734863,13.699999809265137,17.5,13.010000228881836
"Mar 23, 2020",14.279999732971191,14.220000267028809,14.34000015258789,12.529999732971191
"Mar 24, 2020",16.170000076293945,16.600000381469727,17.65999984741211,15.65999984741211
"Mar 25, 2020",19.170000076293945,16.59000015258789,20.0,16.549999237060547
"Mar 26, 2020",20.520000457763672,19.0,23.479999542236328,19.0
"Mar 27, 2020",19.5,19.229999542236328,21.979999542236328,18.25
"Mar 30, 2020",19.09000015258789,20.969999313354492,22.3799991607666,18.899999618530273
"Mar 31, 2020",17.549999237060547,19.5,19.649999618530273,17.200000762939453
"Apr 01, 2020",14.850000381469727,16.040000915527344,16.09000015258789,14.369999885559082
"Apr 02, 2020",14.609999656677246,15.199999809265137,15.979999542236328,14.399999618530273
"Apr 03, 2020",14.100000381469727,14.600000381469727,14.609999656677246,13.119999885559082
"Apr 06, 2020",15.600000381469727,15.800000190734863,15.920000076293945,14.710000038146973
"Apr 07, 2020",15.600000381469727,16.860000610351562,17.899999618530273,15.600000381469727
"Apr 08, 2020",16.790000915527344,15.6899995803833,16.860000610351562,15.010000228881836
"Apr 09, 2020",16.299999237060547,17.440000534057617,17.600000381469727,16.020000457763672
"Apr 13, 2020",16.149999618530273,16.389999389648438,16.709999084472656,15.619999885559082
"Apr 14, 2020",16.350000381469727,16.280000686645508,16.899999618530273,15.90999984741211
"Apr 15, 2020",16.5,15.800000190734863,16.8700008392334,15.710000038146973
"Apr 16, 2020",16.0,16.93000030517578,17.200000762939453,16.0
"Apr 17, 2020",16.190000534057617,16.559999465942383,17.149999618530273,16.020000457763672
"Apr 20, 2020",16.68000030517578,15.989999771118164,16.84000015258789,15.75
"Apr 22, 2020",16.309999465942383,16.450000762939453,16.729999542236328,16.18000030517578
"Apr 23, 2020",16.3700008392334,16.360000610351562,16.649999618530273,16.020000457763672
"Apr 24, 2020",13.989999771118164,16.239999771118164,16.260000228881836,13.699999809265137
"Apr 27, 2020",14.109999656677246,14.609999656677246,14.739999771118164,13.890000343322754
"Apr 28, 2020",16.049999237060547,14.489999771118164,16.100000381469727,14.289999961853027
"Apr 29, 2020",17.1200008392334,16.290000915527344,17.479999542236328,16.25
"Apr 30, 2020",17.399999618530273,16.790000915527344,17.399999618530273,16.280000686645508
"May 04, 2020",15.15999984741211,15.899999618530273,16.200000762939453,14.880000114440918
"May 05, 2020",15.15999984741211,15.649999618530273,15.779999732971191,15.0600004196167
"May 06, 2020",14.770000457763672,15.119999885559082,15.260000228881836,14.449999809265137
"May 07, 2020",13.65999984741211,15.210000038146973,15.260000228881836,13.649999618530273
"May 08, 2020",13.600000381469727,13.9399995803833,14.199999809265137,13.449999809265137
"May 11, 2020",13.149999618530273,13.5,13.640000343322754,12.65999984741211
"May 12, 2020",12.529999732971191,13.25,13.789999961853027,12.529999732971191
"May 13, 2020",12.289999961853027,12.859999656677246,13.020000457763672,12.079999923706055
"May 14, 2020",11.600000381469727,12.0,12.199999809265137,11.359999656677246
"May 15, 2020",11.079999923706055,11.609999656677246,11.829999923706055,11.010000228881836
"May 18, 2020",14.390000343322754,11.65999984741211,14.600000381469727,11.4399995803833
"May 19, 2020",13.649999618530273,13.890000343322754,14.989999771118164,12.720000267028809
"May 20, 2020",15.329999923706055,14.260000228881836,16.8700008392334,14.050000190734863
"May 21, 2020",15.430000305175781,15.800000190734863,16.799999237060547,15.34000015258789
"May 22, 2020",14.800000190734863,15.0,15.350000381469727,14.600000381469727
"May 25, 2020",15.34000015258789,15.600000381469727,16.100000381469727,15.1899995803833
"May 26, 2020",14.75,15.899999618530273,16.0,14.630000114440918
"May 27, 2020",14.869999885559082,15.020000457763672,15.100000381469727,14.079999923706055
"May 28, 2020",14.75,14.59000015258789,15.239999771118164,14.430000305175781
"May 29, 2020",14.279999732971191,14.5,14.649999618530273,14.100000381469727
"Jun 01, 2020",15.350000381469727,14.199999809265137,15.449999809265137,14.0
"Jun 02, 2020",16.75,15.699999809265137,16.799999237060547,15.630000114440918
"Jun 03, 2020",18.450000762939453,17.850000381469727,19.6299991607666,17.700000762939453
"Jun 04, 2020",19.079999923706055,18.75,19.59000015258789,17.739999771118164
"Jun 05, 2020",21.15999984741211,20.700000762939453,21.729999542236328,20.530000686645508
"Jun 08, 2020",27.350000381469727,23.440000534057617,27.489999771118164,22.860000610351562
"Jun 09, 2020",25.780000686645508,26.200000762939453,29.559999465942383,25.020000457763672
"Jun 10, 2020",23.5,27.299999237060547,28.0,22.90999984741211
"Jun 12, 2020",22.1200008392334,21.139999389648438,23.229999542236328,21.0
"Jun 15, 2020",22.149999618530273,20.700000762939453,22.889999389648438,19.809999465942383
"Jun 16, 2020",22.59000015258789,24.0,24.459999084472656,22.260000228881836
"Jun 17, 2020",22.6200008392334,23.059999465942383,23.780000686645508,21.850000381469727
"Jun 18, 2020",21.93000030517578,22.15999984741211,22.899999618530273,21.829999923706055
"Jun 19, 2020",21.799999237060547,22.600000381469727,22.719999313354492,21.350000381469727
"Jun 22, 2020",20.6299991607666,21.649999618530273,21.75,20.420000076293945
"Jun 23, 2020",22.5,21.100000381469727,22.959999084472656,20.309999465942383
"Jun 24, 2020",21.100000381469727,22.299999237060547,22.3700008392334,20.5
"Jun 25, 2020",21.200000762939453,21.110000610351562,21.950000762939453,20.5
"Jun 26, 2020",20.0,21.0,21.450000762939453,20.0
"Jun 29, 2020",20.729999542236328,20.510000228881836,20.969999313354492,19.219999313354492
"Jun 30, 2020",20.110000610351562,20.440000534057617,20.670000076293945,20.100000381469727
"Jul 01, 2020",20.670000076293945,20.399999618530273,21.549999237060547,20.200000762939453
"Jul 02, 2020",20.760000228881836,21.40999984741211,21.829999923706055,20.639999389648438
"Jul 03, 2020",21.149999618530273,20.81999969482422,21.149999618530273,20.399999618530273
"Jul 06, 2020",22.049999237060547,21.899999618530273,22.049999237060547,21.350000381469727
"Jul 07, 2020",21.5,21.6200008392334,22.360000610351562,21.399999618530273
"Jul 08, 2020",21.530000686645508,22.020000457763672,22.049999237060547,21.450000762939453
"Jul 09, 2020",20.899999618530273,21.59000015258789,21.6200008392334,20.809999465942383
"Jul 10, 2020",21.90999984741211,20.75,22.149999618530273,20.6299991607666
"Jul 13, 2020",21.15999984741211,22.270000457763672,22.899999618530273,21.15999984741211
"Jul 14, 2020",21.75,21.170000076293945,22.049999237060547,20.6299991607666
"Jul 15, 2020",22.729999542236328,22.579999923706055,22.850000381469727,22.049999237060547
"Jul 16, 2020",22.049999237060547,22.530000686645508,22.700000762939453,21.90999984741211
"Jul 17, 2020",21.799999237060547,22.190000534057617,22.440000534057617,21.670000076293945
"Jul 20, 2020",21.59000015258789,21.989999771118164,22.0,21.579999923706055
"Jul 21, 2020",21.799999237060547,21.799999237060547,22.219999313354492,21.649999618530273
"Jul 22, 2020",21.68000030517578,21.860000610351562,21.920000076293945,21.170000076293945
"Jul 23, 2020",20.950000762939453,21.549999237060547,21.700000762939453,20.780000686645508
"Jul 24, 2020",20.540000915527344,20.690000534057617,20.690000534057617,20.049999237060547
"Jul 27, 2020",20.709999084472656,20.709999084472656,20.8799991607666,20.219999313354492
"Jul 28, 2020",21.520000457763672,20.899999618530273,21.760000228881836,20.559999465942383
"Jul 29, 2020",20.959999084472656,21.639999389648438,21.690000534057617,20.719999313354492
"Jul 30, 2020",21.020000457763672,20.610000610351562,21.280000686645508,20.520000457763672
"Jul 31, 2020",20.309999465942383,21.020000457763672,21.549999237060547,20.1200008392334
"Aug 03, 2020",20.100000381469727,20.600000381469727,20.600000381469727,19.90999984741211
"Aug 04, 2020",19.81999969482422,19.8799991607666,20.420000076293945,19.690000534057617
"Aug 05, 2020",20.15999984741211,20.15999984741211,20.290000915527344,19.850000381469727
"Aug 06, 2020",21.450000762939453,20.360000610351562,21.59000015258789,20.010000228881836
"Aug 07, 2020",21.010000228881836,21.219999313354492,21.829999923706055,20.700000762939453
"Aug 10, 2020",21.780000686645508,21.079999923706055,21.899999618530273,20.8700008392334
"Aug 11, 2020",23.31999969482422,22.149999618530273,24.049999237060547,22.010000228881836
"Aug 12, 2020",22.8799991607666,24.40999984741211,24.700000762939453,22.530000686645508
"Aug 13, 2020",22.010000228881836,22.260000228881836,23.100000381469727,22.0
"Aug 14, 2020",22.489999771118164,21.899999618530273,22.780000686645508,21.360000610351562
"Aug 17, 2020",21.25,22.399999618530273,22.450000762939453,21.0
"Aug 18, 2020",21.799999237060547,21.700000762939453,22.06999969482422,21.350000381469727
"Aug 19, 2020",21.469999313354492,21.889999389648438,22.1200008392334,21.329999923706055
"Aug 20, 2020",21.56999969482422,21.0,21.739999771118164,20.729999542236328
"Aug 21, 2020",21.690000534057617,21.56999969482422,22.399999618530273,21.3799991607666
"Aug 24, 2020",22.56999969482422,21.920000076293945,22.600000381469727,21.59000015258789
"Aug 25, 2020",21.950000762939453,23.0,23.010000228881836,21.8700008392334
"Aug 26, 2020",21.59000015258789,21.899999618530273,22.149999618530273,21.239999771118164
"Aug 27, 2020",22.3700008392334,21.75,22.65999984741211,21.639999389648438
"Aug 28, 2020",22.8799991607666,22.399999618530273,22.979999542236328,22.049999237060547
"Aug 31, 2020",22.209999084472656,22.700000762939453,23.510000228881836,22.139999389648438
