Date,Price,Open,High,Low
"Jun 03, 2019",14.699999809265137,14.800000190734863,15.039999961853027,14.699999809265137
"Jun 04, 2019",14.899999618530273,14.800000190734863,14.970000267028809,14.569999694824219
"Jun 05, 2019",14.75,14.930000305175781,14.989999771118164,14.720000267028809
"Jun 06, 2019",15.25,14.899999618530273,15.34000015258789,14.869999885559082
"Jun 07, 2019",15.149999618530273,15.3100004196167,15.739999771118164,15.029999732971191
"Jun 10, 2019",14.699999809265137,15.270000457763672,15.270000457763672,14.619999885559082
"Jun 11, 2019",15.0,14.819999694824219,15.199999809265137,14.699999809265137
"Jun 12, 2019",14.609999656677246,14.979999542236328,15.020000457763672,14.569999694824219
"Jun 13, 2019",14.779999732971191,14.760000228881836,15.0,14.699999809265137
"Jun 14, 2019",14.529999732971191,14.8100004196167,15.050000190734863,14.520000457763672
"Jun 17, 2019",14.710000038146973,14.529999732971191,14.729999542236328,14.350000381469727
"Jun 18, 2019",14.59000015258789,14.819999694824219,14.930000305175781,14.510000228881836
"Jun 19, 2019",14.600000381469727,14.520000457763672,14.600000381469727,14.380000114440918
"Jun 21, 2019",14.739999771118164,14.65999984741211,14.890000343322754,14.649999618530273
"Jun 24, 2019",14.770000457763672,14.850000381469727,15.039999961853027,14.65999984741211
"Jun 25, 2019",14.390000343322754,14.760000228881836,14.819999694824219,14.25
"Jun 26, 2019",14.329999923706055,14.579999923706055,14.6899995803833,14.25
"Jun 27, 2019",14.65999984741211,14.300000190734863,14.65999984741211,14.069999694824219
"Jun 28, 2019",14.850000381469727,14.800000190734863,14.989999771118164,14.720000267028809
"Jul 01, 2019",14.960000038146973,14.989999771118164,15.039999961853027,14.75
"Jul 02, 2019",14.699999809265137,14.970000267028809,15.050000190734863,14.420000076293945
"Jul 03, 2019",14.84000015258789,14.550000190734863,14.850000381469727,14.539999961853027
"Jul 04, 2019",14.989999771118164,14.949999809265137,15.010000228881836,14.84000015258789
"Jul 05, 2019",15.039999961853027,14.9399995803833,15.180000305175781,14.770000457763672
"Jul 08, 2019",15.109999656677246,15.119999885559082,15.300000190734863,15.020000457763672
"Jul 10, 2019",15.399999618530273,15.220000267028809,15.579999923706055,15.1899995803833
"Jul 11, 2019",15.289999961853027,15.399999618530273,15.59000015258789,15.149999618530273
"Jul 12, 2019",15.119999885559082,15.289999961853027,15.300000190734863,14.90999984741211
"Jul 15, 2019",14.869999885559082,15.119999885559082,15.170000076293945,14.8100004196167
"Jul 16, 2019",14.899999618530273,14.9399995803833,15.020000457763672,14.789999961853027
"Jul 17, 2019",14.989999771118164,14.869999885559082,15.130000114440918,14.869999885559082
"Jul 18, 2019",14.859999656677246,15.069999694824219,15.100000381469727,14.84000015258789
"Jul 19, 2019",14.5,14.850000381469727,14.880000114440918,14.4399995803833
"Jul 22, 2019",14.430000305175781,14.550000190734863,14.670000076293945,14.430000305175781
"Jul 23, 2019",14.449999809265137,14.449999809265137,14.670000076293945,14.449999809265137
"Jul 24, 2019",14.229999542236328,14.5600004196167,14.59000015258789,14.1899995803833
"Jul 25, 2019",14.069999694824219,14.25,14.369999885559082,14.0
"Jul 26, 2019",14.109999656677246,14.109999656677246,14.25,14.0600004196167
"Jul 29, 2019",14.050000190734863,14.130000114440918,14.199999809265137,13.819999694824219
"Jul 30, 2019",14.180000305175781,13.979999542236328,14.199999809265137,13.930000305175781
"Jul 31, 2019",14.140000343322754,14.229999542236328,14.300000190734863,14.0
"Aug 01, 2019",14.369999885559082,14.199999809265137,14.630000114440918,14.140000343322754
"Aug 02, 2019",14.359999656677246,14.329999923706055,14.5,14.100000381469727
"Aug 05, 2019",14.0600004196167,14.079999923706055,14.199999809265137,13.880000114440918
"Aug 06, 2019",14.5,14.130000114440918,14.539999961853027,14.050000190734863
"Aug 07, 2019",14.0,14.319999694824219,14.40999984741211,13.869999885559082
"Aug 08, 2019",14.5,14.100000381469727,14.5600004196167,14.050000190734863
"Aug 09, 2019",14.600000381469727,14.489999771118164,14.649999618530273,14.319999694824219
"Aug 12, 2019",14.529999732971191,14.470000267028809,14.670000076293945,14.25
"Aug 13, 2019",14.84000015258789,14.479999542236328,14.920000076293945,14.279999732971191
"Aug 14, 2019",14.5,14.65999984741211,14.800000190734863,14.390000343322754
"Aug 15, 2019",14.109999656677246,14.529999732971191,14.710000038146973,13.9399995803833
"Aug 16, 2019",14.539999961853027,14.5,14.859999656677246,14.289999961853027
"Aug 19, 2019",14.75,14.829999923706055,14.979999542236328,14.59000015258789
"Aug 20, 2019",14.760000228881836,14.630000114440918,14.899999618530273,14.359999656677246
"Aug 21, 2019",15.380000114440918,14.899999618530273,15.420000076293945,14.640000343322754
"Aug 22, 2019",15.029999732971191,15.380000114440918,15.40999984741211,15.029999732971191
"Aug 23, 2019",14.569999694824219,14.75,15.0600004196167,14.510000228881836
"Aug 26, 2019",14.369999885559082,14.579999923706055,14.670000076293945,14.170000076293945
"Aug 27, 2019",14.460000038146973,14.380000114440918,14.649999618530273,14.220000267028809
"Aug 28, 2019",14.020000457763672,14.359999656677246,14.399999618530273,13.649999618530273
"Aug 29, 2019",14.460000038146973,14.0600004196167,14.460000038146973,14.010000228881836
"Aug 30, 2019",14.760000228881836,14.5,14.979999542236328,14.380000114440918
"Sep 02, 2019",14.899999618530273,14.699999809265137,15.050000190734863,14.699999809265137
"Sep 03, 2019",14.609999656677246,14.800000190734863,15.050000190734863,14.59000015258789
"Sep 04, 2019",14.6899995803833,14.789999961853027,14.829999923706055,14.59000015258789
"Sep 05, 2019",14.819999694824219,14.729999542236328,14.930000305175781,14.6899995803833
"Sep 06, 2019",14.710000038146973,14.9399995803833,14.9399995803833,14.520000457763672
"Sep 09, 2019",14.470000267028809,14.720000267028809,14.890000343322754,14.470000267028809
"Sep 10, 2019",14.399999618530273,14.5,14.569999694824219,14.270000457763672
"Sep 11, 2019",14.729999542236328,14.489999771118164,14.729999542236328,14.40999984741211
"Sep 12, 2019",14.75,14.800000190734863,15.039999961853027,14.609999656677246
"Sep 13, 2019",14.430000305175781,14.699999809265137,14.75,14.3100004196167
"Sep 16, 2019",14.109999656677246,14.260000228881836,14.380000114440918,14.109999656677246
"Sep 17, 2019",14.420000076293945,14.15999984741211,14.420000076293945,14.079999923706055
"Sep 18, 2019",14.300000190734863,14.399999618530273,14.5,14.220000267028809
"Sep 19, 2019",14.350000381469727,14.350000381469727,14.59000015258789,14.319999694824219
"Sep 20, 2019",14.289999961853027,14.449999809265137,14.479999542236328,14.180000305175781
"Sep 23, 2019",14.199999809265137,14.359999656677246,14.369999885559082,14.149999618530273
"Sep 24, 2019",14.050000190734863,14.270000457763672,14.390000343322754,13.869999885559082
"Sep 25, 2019",13.899999618530273,14.0,14.029999732971191,13.640000343322754
"Sep 26, 2019",14.100000381469727,13.930000305175781,14.140000343322754,13.930000305175781
"Sep 27, 2019",14.100000381469727,14.140000343322754,14.220000267028809,14.020000457763672
"Sep 30, 2019",14.329999923706055,14.180000305175781,14.380000114440918,14.09000015258789
"Oct 01, 2019",14.5,14.319999694824219,14.539999961853027,14.220000267028809
"Oct 02, 2019",14.09000015258789,14.380000114440918,14.399999618530273,14.09000015258789
"Oct 03, 2019",13.9399995803833,14.109999656677246,14.220000267028809,13.850000381469727
"Oct 04, 2019",13.960000038146973,14.050000190734863,14.130000114440918,13.760000228881836
"Oct 07, 2019",13.779999732971191,13.920000076293945,13.970000267028809,13.699999809265137
"Oct 08, 2019",13.8100004196167,13.789999961853027,14.029999732971191,13.640000343322754
"Oct 09, 2019",13.800000190734863,13.829999923706055,13.949999809265137,13.539999961853027
"Oct 10, 2019",13.670000076293945,13.779999732971191,14.010000228881836,13.670000076293945
"Oct 11, 2019",13.869999885559082,13.800000190734863,14.050000190734863,13.699999809265137
"Oct 14, 2019",13.869999885559082,13.899999618530273,13.979999542236328,13.779999732971191
"Oct 15, 2019",13.899999618530273,13.880000114440918,13.989999771118164,13.819999694824219
"Oct 16, 2019",13.84000015258789,13.84000015258789,13.920000076293945,13.579999923706055
"Oct 17, 2019",13.920000076293945,13.800000190734863,14.0,13.760000228881836
"Oct 18, 2019",13.649999618530273,13.829999923706055,13.899999618530273,13.630000114440918
"Oct 21, 2019",13.699999809265137,13.720000267028809,13.760000228881836,13.609999656677246
"Oct 22, 2019",13.699999809265137,13.699999809265137,13.90999984741211,13.609999656677246
"Oct 23, 2019",13.569999694824219,13.699999809265137,13.739999771118164,13.470000267028809
"Oct 24, 2019",13.489999771118164,13.600000381469727,13.609999656677246,13.420000076293945
"Oct 25, 2019",13.15999984741211,13.489999771118164,13.489999771118164,13.109999656677246
"Oct 28, 2019",13.260000228881836,13.229999542236328,13.270000457763672,13.069999694824219
"Oct 29, 2019",13.260000228881836,13.199999809265137,13.329999923706055,13.15999984741211
"Oct 30, 2019",13.550000190734863,13.239999771118164,13.550000190734863,13.15999984741211
"Oct 31, 2019",13.649999618530273,13.550000190734863,13.649999618530273,13.430000305175781
"Nov 01, 2019",13.4399995803833,13.65999984741211,13.699999809265137,13.359999656677246
"Nov 04, 2019",13.430000305175781,13.460000038146973,13.640000343322754,13.319999694824219
"Nov 05, 2019",13.260000228881836,13.40999984741211,13.5,13.149999618530273
"Nov 06, 2019",13.130000114440918,13.210000038146973,13.279999732971191,13.029999732971191
"Nov 07, 2019",13.25,13.180000305175781,13.300000190734863,13.109999656677246
"Nov 08, 2019",13.09000015258789,13.210000038146973,13.399999618530273,13.050000190734863
"Nov 11, 2019",13.140000343322754,13.09000015258789,13.180000305175781,12.920000076293945
"Nov 12, 2019",12.920000076293945,13.09000015258789,13.09000015258789,12.869999885559082
"Nov 13, 2019",12.850000381469727,12.880000114440918,12.970000267028809,12.779999732971191
"Nov 14, 2019",12.880000114440918,12.899999618530273,13.020000457763672,12.850000381469727
"Nov 18, 2019",12.600000381469727,12.800000190734863,12.84000015258789,12.529999732971191
"Nov 19, 2019",12.550000190734863,12.609999656677246,12.6899995803833,12.479999542236328
"Nov 21, 2019",12.600000381469727,12.5,12.680000305175781,12.199999809265137
"Nov 22, 2019",12.899999618530273,12.649999618530273,12.90999984741211,12.550000190734863
"Nov 25, 2019",12.800000190734863,12.9399995803833,12.989999771118164,12.65999984741211
"Nov 26, 2019",12.6899995803833,12.699999809265137,12.760000228881836,12.539999961853027
"Nov 27, 2019",12.65999984741211,12.75,12.8100004196167,12.5
"Nov 28, 2019",12.819999694824219,12.649999618530273,12.880000114440918,12.600000381469727
"Nov 29, 2019",13.050000190734863,12.819999694824219,13.09000015258789,12.770000457763672
"Dec 02, 2019",12.979999542236328,13.050000190734863,13.170000076293945,12.899999618530273
"Dec 03, 2019",12.819999694824219,13.0,13.0,12.6899995803833
"Dec 04, 2019",12.880000114440918,12.8100004196167,12.949999809265137,12.8100004196167
"Dec 05, 2019",13.079999923706055,12.869999885559082,13.140000343322754,12.84000015258789
"Dec 06, 2019",13.020000457763672,13.09000015258789,13.170000076293945,12.920000076293945
"Dec 09, 2019",12.880000114440918,13.010000228881836,13.029999732971191,12.869999885559082
"Dec 10, 2019",12.739999771118164,12.899999618530273,12.899999618530273,12.630000114440918
"Dec 11, 2019",13.0,12.739999771118164,13.010000228881836,12.680000305175781
"Dec 12, 2019",13.020000457763672,13.0,13.100000381469727,12.960000038146973
"Dec 13, 2019",13.029999732971191,13.100000381469727,13.100000381469727,12.960000038146973
"Dec 16, 2019",13.40999984741211,13.020000457763672,13.470000267028809,13.020000457763672
"Dec 17, 2019",13.5,13.489999771118164,13.59000015258789,13.260000228881836
"Dec 18, 2019",13.569999694824219,13.460000038146973,13.630000114440918,13.270000457763672
"Dec 19, 2019",13.6899995803833,13.510000228881836,13.789999961853027,13.510000228881836
"Dec 20, 2019",13.649999618530273,13.699999809265137,13.729999542236328,13.510000228881836
"Dec 23, 2019",13.699999809265137,13.680000305175781,13.739999771118164,13.579999923706055
"Dec 26, 2019",13.6899995803833,13.59000015258789,13.720000267028809,13.489999771118164
"Dec 27, 2019",13.6899995803833,13.729999542236328,13.75,13.569999694824219
"Dec 30, 2019",13.789999961853027,13.680000305175781,13.880000114440918,13.649999618530273
"Jan 02, 2020",13.880000114440918,13.819999694824219,13.880000114440918,13.65999984741211
"Jan 03, 2020",13.729999542236328,13.710000038146973,13.920000076293945,13.5600004196167
"Jan 06, 2020",13.920000076293945,13.680000305175781,13.920000076293945,13.4399995803833
"Jan 07, 2020",14.430000305175781,13.9399995803833,14.5,13.829999923706055
"Jan 08, 2020",14.829999923706055,14.5,14.949999809265137,14.359999656677246
"Jan 09, 2020",14.710000038146973,14.729999542236328,14.899999618530273,14.4399995803833
"Jan 10, 2020",14.930000305175781,14.760000228881836,15.279999732971191,14.59000015258789
"Jan 13, 2020",15.350000381469727,15.0,15.399999618530273,15.0
"Jan 14, 2020",15.510000228881836,15.399999618530273,15.619999885559082,15.260000228881836
"Jan 15, 2020",15.40999984741211,15.449999809265137,15.579999923706055,15.3100004196167
"Jan 16, 2020",15.5,15.5,15.520000457763672,15.279999732971191
"Jan 17, 2020",15.640000343322754,15.609999656677246,15.789999961853027,15.529999732971191
"Jan 20, 2020",15.40999984741211,15.529999732971191,15.65999984741211,15.40999984741211
"Jan 21, 2020",15.220000267028809,15.359999656677246,15.479999542236328,15.15999984741211
"Jan 22, 2020",15.050000190734863,15.25,15.40999984741211,14.920000076293945
"Jan 23, 2020",15.279999732971191,15.029999732971191,15.279999732971191,14.84000015258789
"Jan 24, 2020",15.4399995803833,15.300000190734863,15.4399995803833,15.180000305175781
"Jan 27, 2020",15.220000267028809,15.210000038146973,15.319999694824219,15.039999961853027
"Jan 28, 2020",15.5,15.3100004196167,15.5,15.199999809265137
"Jan 29, 2020",15.40999984741211,15.5,15.699999809265137,15.319999694824219
"Jan 30, 2020",15.1899995803833,15.170000076293945,15.220000267028809,14.739999771118164
"Jan 31, 2020",14.949999809265137,15.170000076293945,15.199999809265137,14.819999694824219
"Feb 03, 2020",15.180000305175781,15.029999732971191,15.239999771118164,14.970000267028809
"Feb 04, 2020",15.369999885559082,15.300000190734863,15.460000038146973,15.229999542236328
"Feb 05, 2020",15.970000267028809,15.5,15.970000267028809,15.399999618530273
"Feb 06, 2020",15.680000305175781,16.06999969482422,16.209999084472656,15.680000305175781
"Feb 07, 2020",15.180000305175781,15.600000381469727,15.6899995803833,15.140000343322754
"Feb 10, 2020",14.630000114440918,15.1899995803833,15.199999809265137,14.600000381469727
"Feb 11, 2020",15.0600004196167,14.619999885559082,15.0600004196167,14.619999885559082
"Feb 12, 2020",15.079999923706055,15.149999618530273,15.149999618530273,14.90999984741211
"Feb 13, 2020",14.779999732971191,14.899999618530273,15.079999923706055,14.720000267028809
"Feb 14, 2020",14.819999694824219,14.8100004196167,14.930000305175781,14.670000076293945
"Feb 17, 2020",15.069999694824219,14.90999984741211,15.09000015258789,14.779999732971191
"Feb 18, 2020",15.0600004196167,15.050000190734863,15.100000381469727,14.869999885559082
"Feb 19, 2020",14.979999542236328,14.9399995803833,15.100000381469727,14.800000190734863
"Feb 20, 2020",14.600000381469727,15.0,15.0,14.569999694824219
"Feb 21, 2020",14.960000038146973,14.59000015258789,14.979999542236328,14.460000038146973
"Feb 27, 2020",13.699999809265137,13.699999809265137,14.130000114440918,13.5600004196167
"Feb 28, 2020",13.960000038146973,13.680000305175781,13.960000038146973,13.130000114440918
"Mar 02, 2020",14.390000343322754,13.829999923706055,14.390000343322754,13.699999809265137
"Mar 03, 2020",14.420000076293945,14.25,14.920000076293945,14.170000076293945
"Mar 04, 2020",15.079999923706055,14.6899995803833,15.079999923706055,14.270000457763672
"Mar 05, 2020",14.359999656677246,14.789999961853027,14.960000038146973,14.100000381469727
"Mar 06, 2020",13.6899995803833,13.899999618530273,13.920000076293945,13.40999984741211
"Mar 09, 2020",12.300000190734863,13.199999809265137,13.220000267028809,12.199999809265137
"Mar 10, 2020",12.640000343322754,12.75,13.0,12.170000076293945
"Mar 11, 2020",11.390000343322754,12.199999809265137,12.579999923706055,10.930000305175781
"Mar 12, 2020",9.1899995803833,9.600000381469727,9.789999961853027,8.020000457763672
"Mar 13, 2020",10.5,10.25,10.640000343322754,9.079999923706055
"Mar 16, 2020",9.319999694824219,9.100000381469727,10.0,9.100000381469727
"Mar 17, 2020",9.920000076293945,9.65999984741211,10.180000305175781,9.420000076293945
"Mar 18, 2020",9.180000305175781,9.319999694824219,9.670000076293945,8.6899995803833
"Mar 19, 2020",9.4399995803833,8.800000190734863,9.460000038146973,8.65999984741211
"Mar 20, 2020",8.899999618530273,9.729999542236328,9.930000305175781,8.59000015258789
"Mar 23, 2020",8.149999618530273,9.0,9.0,7.539999961853027
"Mar 24, 2020",8.399999618530273,8.779999732971191,8.800000190734863,8.039999961853027
"Mar 25, 2020",9.069999694824219,8.25,9.069999694824219,7.840000152587891
"Mar 26, 2020",10.0,8.949999809265137,10.300000190734863,8.770000457763672
"Mar 27, 2020",9.220000267028809,9.550000190734863,9.680000305175781,9.199999809265137
"Mar 30, 2020",9.109999656677246,9.319999694824219,9.529999732971191,9.039999961853027
"Mar 31, 2020",8.90999984741211,9.109999656677246,9.4399995803833,8.729999542236328
"Apr 01, 2020",8.430000305175781,8.8100004196167,8.819999694824219,8.239999771118164
"Apr 02, 2020",8.210000038146973,8.430000305175781,8.539999961853027,8.109999656677246
"Apr 03, 2020",7.949999809265137,8.229999542236328,8.270000457763672,7.860000133514404
"Apr 06, 2020",8.5,8.350000381469727,8.949999809265137,8.109999656677246
"Apr 07, 2020",8.670000076293945,9.0,9.229999542236328,8.65999984741211
"Apr 08, 2020",8.869999885559082,8.680000305175781,8.970000267028809,8.529999732971191
"Apr 09, 2020",9.170000076293945,9.029999732971191,9.550000190734863,9.029999732971191
"Apr 13, 2020",9.479999542236328,9.300000190734863,9.539999961853027,9.0
"Apr 14, 2020",9.9399995803833,9.800000190734863,10.109999656677246,9.680000305175781
"Apr 15, 2020",10.050000190734863,9.729999542236328,10.109999656677246,9.5
"Apr 16, 2020",10.109999656677246,10.199999809265137,10.420000076293945,9.84000015258789
"Apr 17, 2020",10.140000343322754,10.220000267028809,10.34000015258789,9.989999771118164
"Apr 20, 2020",10.0600004196167,9.880000114440918,10.279999732971191,9.6899995803833
"Apr 22, 2020",10.140000343322754,10.100000381469727,10.199999809265137,9.960000038146973
"Apr 23, 2020",9.850000381469727,10.199999809265137,10.260000228881836,9.649999618530273
"Apr 24, 2020",8.75,9.600000381469727,9.640000343322754,8.5600004196167
"Apr 27, 2020",8.819999694824219,9.109999656677246,9.119999885559082,8.729999542236328
"Apr 28, 2020",9.399999618530273,9.15999984741211,9.529999732971191,9.010000228881836
"Apr 29, 2020",9.760000228881836,9.619999885559082,9.84000015258789,9.420000076293945
"Apr 30, 2020",9.520000457763672,9.600000381469727,9.65999984741211,9.399999618530273
"May 04, 2020",9.239999771118164,9.15999984741211,9.369999885559082,9.100000381469727
"May 05, 2020",9.25,9.510000228881836,9.550000190734863,9.220000267028809
"May 06, 2020",8.819999694824219,9.34000015258789,9.359999656677246,8.8100004196167
"May 07, 2020",8.279999732971191,8.949999809265137,8.949999809265137,8.229999542236328
"May 08, 2020",8.630000114440918,8.4399995803833,8.630000114440918,8.350000381469727
"May 11, 2020",8.300000190734863,8.510000228881836,8.5600004196167,8.229999542236328
"May 12, 2020",8.0600004196167,8.319999694824219,8.550000190734863,8.0600004196167
"May 13, 2020",7.920000076293945,8.170000076293945,8.300000190734863,7.789999961853027
"May 14, 2020",8.59000015258789,7.789999961853027,8.59000015258789,7.579999923706055
"May 15, 2020",8.210000038146973,8.460000038146973,8.649999618530273,8.109999656677246
"May 18, 2020",8.779999732971191,8.489999771118164,8.800000190734863,8.3100004196167
"May 19, 2020",8.529999732971191,8.819999694824219,8.859999656677246,8.529999732971191
"May 20, 2020",8.770000457763672,8.65999984741211,8.899999618530273,8.59000015258789
"May 21, 2020",9.25,8.8100004196167,9.369999885559082,8.770000457763672
"May 22, 2020",9.359999656677246,9.149999618530273,9.5,9.010000228881836
"May 25, 2020",10.029999732971191,9.710000038146973,10.149999618530273,9.649999618530273
"May 26, 2020",10.470000267028809,10.220000267028809,10.5600004196167,10.0600004196167
"May 27, 2020",10.930000305175781,10.949999809265137,11.399999618530273,10.670000076293945
"May 28, 2020",10.609999656677246,10.800000190734863,10.800000190734863,10.510000228881836
"May 29, 2020",10.800000190734863,10.649999618530273,10.800000190734863,10.430000305175781
"Jun 01, 2020",10.899999618530273,10.630000114440918,10.989999771118164,10.609999656677246
"Jun 02, 2020",11.130000114440918,10.90999984741211,11.180000305175781,10.850000381469727
"Jun 03, 2020",11.260000228881836,11.25,11.369999885559082,10.979999542236328
"Jun 04, 2020",11.180000305175781,11.25,11.470000267028809,11.039999961853027
"Jun 05, 2020",11.399999618530273,11.489999771118164,11.640000343322754,11.229999542236328
"Jun 08, 2020",12.010000228881836,11.550000190734863,12.010000228881836,11.40999984741211
"Jun 09, 2020",12.050000190734863,11.800000190734863,12.100000381469727,11.619999885559082
"Jun 10, 2020",11.510000228881836,12.210000038146973,12.229999542236328,11.510000228881836
"Jun 12, 2020",11.029999732971191,11.15999984741211,11.220000267028809,10.720000267028809
"Jun 15, 2020",10.75,10.800000190734863,10.970000267028809,10.4399995803833
"Jun 16, 2020",11.119999885559082,11.09000015258789,11.489999771118164,11.0600004196167
"Jun 17, 2020",11.720000267028809,11.180000305175781,11.789999961853027,11.180000305175781
"Jun 18, 2020",11.359999656677246,11.510000228881836,11.699999809265137,11.279999732971191
"Jun 19, 2020",11.380000114440918,11.510000228881836,11.59000015258789,11.300000190734863
"Jun 22, 2020",11.579999923706055,11.399999618530273,11.890000343322754,11.229999542236328
"Jun 23, 2020",11.399999618530273,11.720000267028809,11.789999961853027,11.329999923706055
"Jun 24, 2020",11.039999961853027,11.350000381469727,11.399999618530273,10.890000343322754
"Jun 25, 2020",11.1899995803833,11.039999961853027,11.229999542236328,10.920000076293945
"Jun 26, 2020",10.600000381469727,11.069999694824219,11.130000114440918,10.600000381469727
"Jun 29, 2020",10.869999885559082,10.710000038146973,10.930000305175781,10.510000228881836
"Jun 30, 2020",11.020000457763672,10.779999732971191,11.180000305175781,10.760000228881836
"Jul 01, 2020",11.170000076293945,11.140000343322754,11.359999656677246,10.979999542236328
"Jul 02, 2020",11.119999885559082,11.300000190734863,11.34000015258789,11.050000190734863
"Jul 03, 2020",11.130000114440918,11.109999656677246,11.180000305175781,11.010000228881836
"Jul 06, 2020",11.359999656677246,11.300000190734863,11.399999618530273,11.1899995803833
"Jul 07, 2020",11.260000228881836,11.25,11.4399995803833,11.1899995803833
"Jul 08, 2020",11.5,11.3100004196167,11.520000457763672,11.300000190734863
"Jul 09, 2020",11.569999694824219,11.539999961853027,11.600000381469727,11.399999618530273
"Jul 10, 2020",11.520000457763672,11.510000228881836,11.6899995803833,11.34000015258789
"Jul 13, 2020",11.670000076293945,11.600000381469727,11.75,11.510000228881836
"Jul 14, 2020",11.40999984741211,11.640000343322754,11.710000038146973,11.3100004196167
"Jul 15, 2020",11.449999809265137,11.529999732971191,11.600000381469727,11.319999694824219
"Jul 16, 2020",11.25,11.399999618530273,11.489999771118164,11.119999885559082
"Jul 17, 2020",11.329999923706055,11.369999885559082,11.430000305175781,11.210000038146973
"Jul 20, 2020",11.640000343322754,11.380000114440918,11.649999618530273,11.279999732971191
"Jul 21, 2020",11.053400039672852,11.235799789428711,11.245400428771973,10.995699882507324
"Jul 22, 2020",11.907999992370605,11.09179973602295,12.00409984588623,10.947699546813965
"Jul 23, 2020",11.65839958190918,11.91759967803955,11.98490047454834,11.591099739074707
"Jul 24, 2020",11.533499717712402,11.610300064086914,11.687199592590332,11.341400146484375
"Jul 27, 2020",11.859999656677246,11.581500053405762,11.965700149536133,11.533499717712402
"Jul 28, 2020",11.89840030670166,11.859999656677246,12.1673002243042,11.715999603271484
"Jul 29, 2020",11.706399917602539,12.013699531555176,12.07129955291748,11.639200210571289
"Jul 30, 2020",11.754400253295898,11.523900032043457,11.812000274658203,11.427900314331055
"Jul 31, 2020",11.523900032043457,11.754400253295898,11.840800285339355,11.50469970703125
"Aug 03, 2020",11.3100004196167,11.369999885559082,11.479999542236328,11.140000343322754
"Aug 04, 2020",11.0600004196167,11.25,11.34000015258789,10.899999618530273
"Aug 05, 2020",10.970000267028809,11.199999809265137,11.260000228881836,10.880000114440918
"Aug 06, 2020",11.40999984741211,10.960000038146973,11.59000015258789,10.880000114440918
"Aug 07, 2020",11.180000305175781,11.300000190734863,11.34000015258789,11.069999694824219
"Aug 10, 2020",11.1899995803833,11.180000305175781,11.220000267028809,11.0
"Aug 11, 2020",11.010000228881836,11.239999771118164,11.270000457763672,10.970000267028809
"Aug 12, 2020",10.770000457763672,11.010000228881836,11.039999961853027,10.609999656677246
"Aug 13, 2020",10.420000076293945,10.819999694824219,10.869999885559082,10.3100004196167
"Aug 14, 2020",10.399999618530273,10.470000267028809,10.470000267028809,10.170000076293945
"Aug 17, 2020",10.1899995803833,10.460000038146973,10.489999771118164,10.020000457763672
"Aug 18, 2020",10.460000038146973,10.34000015258789,10.5,10.180000305175781
"Aug 19, 2020",10.520000457763672,10.5,10.630000114440918,10.199999809265137
"Aug 20, 2020",10.449999809265137,10.289999961853027,10.5,10.069999694824219
"Aug 21, 2020",10.8100004196167,10.479999542236328,10.869999885559082,10.359999656677246
"Aug 24, 2020",10.800000190734863,10.949999809265137,11.020000457763672,10.729999542236328
"Aug 25, 2020",11.119999885559082,10.800000190734863,11.140000343322754,10.699999809265137
"Aug 26, 2020",10.649999618530273,11.109999656677246,11.170000076293945,10.569999694824219
"Aug 27, 2020",10.779999732971191,10.699999809265137,10.880000114440918,10.630000114440918
"Aug 28, 2020",10.970000267028809,10.84000015258789,11.020000457763672,10.699999809265137
"Aug 31, 2020",10.529999732971191,10.899999618530273,10.899999618530273,10.520000457763672
