Date,Price,Open,High,Low
"Jun 03, 2019",12.420000076293945,12.420000076293945,12.5,12.329999923706055
"Jun 04, 2019",12.449999809265137,12.430000305175781,12.520000457763672,12.369999885559082
"Jun 05, 2019",12.149999618530273,12.489999771118164,12.5,12.149999618530273
"Jun 06, 2019",12.289999961853027,12.279999732971191,12.34000015258789,12.140000343322754
"Jun 07, 2019",12.399999618530273,12.329999923706055,12.479999542236328,12.289999961853027
"Jun 10, 2019",12.210000038146973,12.399999618530273,12.40999984741211,12.029999732971191
"Jun 11, 2019",12.239999771118164,12.25,12.300000190734863,12.109999656677246
"Jun 12, 2019",12.180000305175781,12.229999542236328,12.319999694824219,12.069999694824219
"Jun 13, 2019",12.020000457763672,12.180000305175781,12.220000267028809,11.970000267028809
"Jun 14, 2019",11.979999542236328,12.0,12.029999732971191,11.829999923706055
"Jun 17, 2019",11.970000267028809,11.979999542236328,12.050000190734863,11.90999984741211
"Jun 18, 2019",12.199999809265137,12.079999923706055,12.199999809265137,12.039999961853027
"Jun 19, 2019",12.380000114440918,12.180000305175781,12.380000114440918,12.069999694824219
"Jun 21, 2019",12.600000381469727,12.399999618530273,12.609999656677246,12.390000343322754
"Jun 24, 2019",12.649999618530273,12.619999885559082,12.720000267028809,12.5600004196167
"Jun 25, 2019",12.579999923706055,12.619999885559082,12.729999542236328,12.479999542236328
"Jun 26, 2019",12.979999542236328,12.630000114440918,13.0,12.630000114440918
"Jun 27, 2019",12.9399995803833,12.850000381469727,13.069999694824219,12.75
"Jun 28, 2019",12.890000343322754,13.0600004196167,13.0600004196167,12.880000114440918
"Jul 01, 2019",12.920000076293945,13.0,13.050000190734863,12.829999923706055
"Jul 02, 2019",12.779999732971191,12.930000305175781,13.0,12.760000228881836
"Jul 03, 2019",12.970000267028809,12.75,13.020000457763672,12.729999542236328
"Jul 04, 2019",13.149999618530273,13.0600004196167,13.300000190734863,13.039999961853027
"Jul 05, 2019",13.270000457763672,13.149999618530273,13.279999732971191,13.069999694824219
"Jul 08, 2019",13.279999732971191,13.25,13.319999694824219,13.170000076293945
"Jul 10, 2019",13.34000015258789,13.399999618530273,13.449999809265137,13.270000457763672
"Jul 11, 2019",13.199999809265137,13.25,13.279999732971191,13.130000114440918
"Jul 12, 2019",13.0,13.239999771118164,13.270000457763672,13.0
"Jul 15, 2019",12.949999809265137,13.050000190734863,13.100000381469727,12.859999656677246
"Jul 16, 2019",12.890000343322754,12.949999809265137,13.0,12.819999694824219
"Jul 17, 2019",12.930000305175781,12.90999984741211,13.039999961853027,12.869999885559082
"Jul 18, 2019",13.210000038146973,12.970000267028809,13.210000038146973,12.890000343322754
"Jul 19, 2019",13.050000190734863,13.180000305175781,13.180000305175781,13.0
"Jul 22, 2019",13.25,13.09000015258789,13.300000190734863,13.0600004196167
"Jul 23, 2019",13.319999694824219,13.279999732971191,13.420000076293945,13.15999984741211
"Jul 24, 2019",13.300000190734863,13.34000015258789,13.489999771118164,13.270000457763672
"Jul 25, 2019",12.899999618530273,13.319999694824219,13.390000343322754,12.84000015258789
"Jul 26, 2019",13.010000228881836,12.960000038146973,13.149999618530273,12.880000114440918
"Jul 29, 2019",12.989999771118164,13.0,13.149999618530273,12.880000114440918
"Jul 30, 2019",12.779999732971191,12.989999771118164,12.989999771118164,12.670000076293945
"Jul 31, 2019",12.470000267028809,12.8100004196167,12.819999694824219,12.430000305175781
"Aug 01, 2019",12.550000190734863,12.5600004196167,12.84000015258789,12.460000038146973
"Aug 02, 2019",12.460000038146973,12.600000381469727,12.609999656677246,12.319999694824219
"Aug 05, 2019",12.260000228881836,12.260000228881836,12.34000015258789,12.15999984741211
"Aug 06, 2019",12.65999984741211,12.350000381469727,12.6899995803833,12.350000381469727
"Aug 07, 2019",12.989999771118164,12.520000457763672,12.989999771118164,12.420000076293945
"Aug 08, 2019",13.119999885559082,13.029999732971191,13.15999984741211,12.960000038146973
"Aug 09, 2019",13.0600004196167,13.119999885559082,13.15999984741211,12.930000305175781
"Aug 12, 2019",12.600000381469727,12.869999885559082,12.869999885559082,12.59000015258789
"Aug 13, 2019",12.920000076293945,12.739999771118164,12.989999771118164,12.619999885559082
"Aug 14, 2019",12.75,12.800000190734863,12.819999694824219,12.670000076293945
"Aug 15, 2019",12.800000190734863,12.850000381469727,12.890000343322754,12.649999618530273
"Aug 16, 2019",12.510000228881836,12.569999694824219,12.640000343322754,12.380000114440918
"Aug 19, 2019",12.289999961853027,12.609999656677246,12.630000114440918,12.210000038146973
"Aug 20, 2019",12.100000381469727,12.279999732971191,12.369999885559082,12.050000190734863
"Aug 21, 2019",12.25,12.239999771118164,12.369999885559082,12.15999984741211
"Aug 22, 2019",12.050000190734863,12.279999732971191,12.359999656677246,12.029999732971191
"Aug 23, 2019",11.880000114440918,11.970000267028809,12.170000076293945,11.789999961853027
"Aug 26, 2019",11.829999923706055,12.029999732971191,12.0600004196167,11.670000076293945
"Aug 27, 2019",12.020000457763672,11.880000114440918,12.109999656677246,11.8100004196167
"Aug 28, 2019",12.199999809265137,11.899999618530273,12.199999809265137,11.84000015258789
"Aug 29, 2019",12.260000228881836,12.229999542236328,12.34000015258789,12.0
"Aug 30, 2019",12.289999961853027,12.369999885559082,12.390000343322754,12.170000076293945
"Sep 02, 2019",12.140000343322754,12.270000457763672,12.319999694824219,12.109999656677246
"Sep 03, 2019",11.949999809265137,12.130000114440918,12.239999771118164,11.899999618530273
"Sep 04, 2019",12.140000343322754,12.119999885559082,12.140000343322754,11.960000038146973
"Sep 05, 2019",12.579999923706055,12.210000038146973,12.640000343322754,12.180000305175781
"Sep 06, 2019",12.949999809265137,12.609999656677246,12.960000038146973,12.609999656677246
"Sep 09, 2019",13.109999656677246,12.949999809265137,13.199999809265137,12.9399995803833
"Sep 10, 2019",12.979999542236328,13.109999656677246,13.180000305175781,12.899999618530273
"Sep 11, 2019",12.9399995803833,13.029999732971191,13.050000190734863,12.880000114440918
"Sep 12, 2019",13.109999656677246,13.0,13.1899995803833,12.989999771118164
"Sep 13, 2019",13.15999984741211,13.130000114440918,13.369999885559082,13.079999923706055
"Sep 16, 2019",13.119999885559082,13.140000343322754,13.140000343322754,12.930000305175781
"Sep 17, 2019",13.180000305175781,13.039999961853027,13.1899995803833,12.979999542236328
"Sep 18, 2019",13.199999809265137,13.210000038146973,13.239999771118164,13.020000457763672
"Sep 19, 2019",13.079999923706055,13.25,13.359999656677246,13.020000457763672
"Sep 20, 2019",13.239999771118164,13.1899995803833,13.239999771118164,13.020000457763672
"Sep 23, 2019",13.100000381469727,13.15999984741211,13.199999809265137,13.020000457763672
"Sep 24, 2019",13.0600004196167,13.149999618530273,13.15999984741211,12.970000267028809
"Sep 25, 2019",13.140000343322754,13.0,13.170000076293945,12.949999809265137
"Sep 26, 2019",13.420000076293945,13.140000343322754,13.420000076293945,13.079999923706055
"Sep 27, 2019",13.390000343322754,13.380000114440918,13.4399995803833,13.260000228881836
"Sep 30, 2019",13.180000305175781,13.390000343322754,13.4399995803833,13.180000305175781
"Oct 01, 2019",12.949999809265137,13.199999809265137,13.210000038146973,12.949999809265137
"Oct 02, 2019",12.649999618530273,12.850000381469727,12.850000381469727,12.609999656677246
"Oct 03, 2019",12.5,12.680000305175781,12.710000038146973,12.430000305175781
"Oct 04, 2019",12.510000228881836,12.550000190734863,12.550000190734863,12.329999923706055
"Oct 07, 2019",12.180000305175781,12.510000228881836,12.59000015258789,12.180000305175781
"Oct 08, 2019",12.140000343322754,12.260000228881836,12.380000114440918,12.109999656677246
"Oct 09, 2019",12.329999923706055,12.25,12.399999618530273,12.15999984741211
"Oct 10, 2019",12.430000305175781,12.319999694824219,12.470000267028809,12.289999961853027
"Oct 11, 2019",12.699999809265137,12.489999771118164,12.770000457763672,12.470000267028809
"Oct 14, 2019",12.90999984741211,12.6899995803833,12.90999984741211,12.640000343322754
"Oct 15, 2019",12.930000305175781,12.899999618530273,13.039999961853027,12.84000015258789
"Oct 16, 2019",13.170000076293945,12.899999618530273,13.1899995803833,12.729999542236328
"Oct 17, 2019",13.149999618530273,13.130000114440918,13.260000228881836,13.0600004196167
"Oct 18, 2019",13.069999694824219,13.100000381469727,13.149999618530273,13.020000457763672
"Oct 21, 2019",13.260000228881836,13.069999694824219,13.260000228881836,13.010000228881836
"Oct 22, 2019",13.5600004196167,13.260000228881836,13.5600004196167,13.239999771118164
"Oct 23, 2019",13.65999984741211,13.539999961853027,13.729999542236328,13.449999809265137
"Oct 24, 2019",13.649999618530273,13.649999618530273,13.739999771118164,13.5600004196167
"Oct 25, 2019",13.789999961853027,13.670000076293945,13.850000381469727,13.670000076293945
"Oct 28, 2019",13.90999984741211,13.729999542236328,13.960000038146973,13.710000038146973
"Oct 29, 2019",13.779999732971191,13.869999885559082,13.899999618530273,13.770000457763672
"Oct 30, 2019",13.949999809265137,13.75,13.989999771118164,13.59000015258789
"Oct 31, 2019",13.710000038146973,13.869999885559082,13.869999885559082,13.609999656677246
"Nov 01, 2019",13.760000228881836,13.75,13.850000381469727,13.579999923706055
"Nov 04, 2019",13.899999618530273,13.800000190734863,13.930000305175781,13.729999542236328
"Nov 05, 2019",14.069999694824219,14.170000076293945,14.25,14.010000228881836
"Nov 06, 2019",13.960000038146973,14.069999694824219,14.25,13.920000076293945
"Nov 07, 2019",13.9399995803833,14.020000457763672,14.079999923706055,13.84000015258789
"Nov 08, 2019",13.760000228881836,13.899999618530273,13.9399995803833,13.649999618530273
"Nov 11, 2019",13.890000343322754,13.75,13.890000343322754,13.670000076293945
"Nov 12, 2019",13.729999542236328,13.779999732971191,13.779999732971191,13.5
"Nov 13, 2019",13.5,13.670000076293945,13.699999809265137,13.390000343322754
"Nov 14, 2019",13.630000114440918,13.510000228881836,13.65999984741211,13.420000076293945
"Nov 18, 2019",13.600000381469727,13.729999542236328,13.819999694824219,13.600000381469727
"Nov 19, 2019",13.420000076293945,13.619999885559082,13.670000076293945,13.350000381469727
"Nov 21, 2019",13.510000228881836,13.399999618530273,13.539999961853027,13.380000114440918
"Nov 22, 2019",13.710000038146973,13.510000228881836,13.710000038146973,13.479999542236328
"Nov 25, 2019",13.380000114440918,13.720000267028809,13.739999771118164,13.380000114440918
"Nov 26, 2019",13.0600004196167,13.380000114440918,13.390000343322754,13.0
"Nov 27, 2019",13.220000267028809,13.109999656677246,13.3100004196167,13.010000228881836
"Nov 28, 2019",13.25,13.149999618530273,13.279999732971191,13.050000190734863
"Nov 29, 2019",13.270000457763672,13.270000457763672,13.34000015258789,13.140000343322754
"Dec 02, 2019",13.359999656677246,13.3100004196167,13.420000076293945,13.289999961853027
"Dec 03, 2019",13.329999923706055,13.40999984741211,13.449999809265137,13.260000228881836
"Dec 04, 2019",13.649999618530273,13.350000381469727,13.649999618530273,13.329999923706055
"Dec 05, 2019",13.59000015258789,13.65999984741211,13.800000190734863,13.579999923706055
"Dec 06, 2019",13.460000038146973,13.640000343322754,13.699999809265137,13.4399995803833
"Dec 09, 2019",13.680000305175781,13.520000457763672,13.75,13.479999542236328
"Dec 10, 2019",13.65999984741211,13.680000305175781,13.800000190734863,13.539999961853027
"Dec 11, 2019",13.619999885559082,13.779999732971191,13.800000190734863,13.569999694824219
"Dec 12, 2019",13.600000381469727,13.6899995803833,13.779999732971191,13.600000381469727
"Dec 13, 2019",13.699999809265137,13.680000305175781,13.699999809265137,13.489999771118164
"Dec 16, 2019",13.569999694824219,13.739999771118164,13.890000343322754,13.569999694824219
"Dec 17, 2019",13.829999923706055,13.680000305175781,13.829999923706055,13.630000114440918
"Dec 18, 2019",13.970000267028809,13.8100004196167,13.970000267028809,13.729999542236328
"Dec 19, 2019",13.979999542236328,13.899999618530273,13.979999542236328,13.800000190734863
"Dec 20, 2019",13.850000381469727,13.979999542236328,13.979999542236328,13.84000015258789
"Dec 23, 2019",13.949999809265137,13.890000343322754,13.949999809265137,13.84000015258789
"Dec 26, 2019",14.1899995803833,13.930000305175781,14.1899995803833,13.90999984741211
"Dec 27, 2019",14.130000114440918,14.199999809265137,14.260000228881836,13.989999771118164
"Dec 30, 2019",14.09000015258789,14.130000114440918,14.239999771118164,14.010000228881836
"Jan 02, 2020",14.350000381469727,14.140000343322754,14.380000114440918,14.069999694824219
"Jan 03, 2020",14.140000343322754,14.199999809265137,14.359999656677246,14.119999885559082
"Jan 06, 2020",14.109999656677246,14.119999885559082,14.210000038146973,14.010000228881836
"Jan 07, 2020",13.920000076293945,14.119999885559082,14.140000343322754,13.819999694824219
"Jan 08, 2020",13.710000038146973,13.949999809265137,14.050000190734863,13.680000305175781
"Jan 09, 2020",13.4399995803833,13.739999771118164,13.779999732971191,13.420000076293945
"Jan 10, 2020",13.350000381469727,13.5,13.65999984741211,13.279999732971191
"Jan 13, 2020",13.529999732971191,13.470000267028809,13.59000015258789,13.390000343322754
"Jan 14, 2020",13.680000305175781,13.520000457763672,13.680000305175781,13.369999885559082
"Jan 15, 2020",13.460000038146973,13.630000114440918,13.630000114440918,13.380000114440918
"Jan 16, 2020",13.489999771118164,13.5,13.550000190734863,13.380000114440918
"Jan 17, 2020",13.600000381469727,13.5,13.649999618530273,13.5
"Jan 20, 2020",13.40999984741211,13.59000015258789,13.630000114440918,13.300000190734863
"Jan 21, 2020",13.100000381469727,13.359999656677246,13.399999618530273,13.100000381469727
"Jan 22, 2020",13.289999961853027,13.210000038146973,13.329999923706055,13.15999984741211
"Jan 23, 2020",13.550000190734863,13.210000038146973,13.59000015258789,13.15999984741211
"Jan 24, 2020",13.350000381469727,13.600000381469727,13.600000381469727,13.3100004196167
"Jan 27, 2020",13.0600004196167,13.199999809265137,13.25,12.960000038146973
"Jan 28, 2020",13.109999656677246,13.149999618530273,13.220000267028809,13.079999923706055
"Jan 29, 2020",12.970000267028809,13.180000305175781,13.180000305175781,12.949999809265137
"Jan 30, 2020",13.079999923706055,12.890000343322754,13.079999923706055,12.779999732971191
"Jan 31, 2020",12.859999656677246,12.920000076293945,12.979999542236328,12.720000267028809
"Feb 03, 2020",12.850000381469727,12.880000114440918,12.979999542236328,12.8100004196167
"Feb 04, 2020",12.880000114440918,13.010000228881836,13.050000190734863,12.859999656677246
"Feb 05, 2020",12.949999809265137,13.050000190734863,13.1899995803833,12.920000076293945
"Feb 06, 2020",12.819999694824219,13.09000015258789,13.09000015258789,12.789999961853027
"Feb 07, 2020",12.789999961853027,12.800000190734863,12.960000038146973,12.739999771118164
"Feb 10, 2020",13.050000190734863,12.850000381469727,13.15999984741211,12.75
"Feb 11, 2020",13.279999732971191,13.220000267028809,13.390000343322754,13.09000015258789
"Feb 12, 2020",13.369999885559082,13.319999694824219,13.510000228881836,13.25
"Feb 13, 2020",13.170000076293945,13.270000457763672,13.359999656677246,13.130000114440918
"Feb 14, 2020",13.0,13.149999618530273,13.170000076293945,13.0
"Feb 17, 2020",13.0,13.100000381469727,13.170000076293945,13.0
"Feb 18, 2020",13.1899995803833,13.010000228881836,13.1899995803833,12.880000114440918
"Feb 19, 2020",13.34000015258789,13.1899995803833,13.470000267028809,13.149999618530273
"Feb 20, 2020",13.25,13.380000114440918,13.430000305175781,13.170000076293945
"Feb 21, 2020",12.8100004196167,12.720000267028809,12.8100004196167,12.569999694824219
"Feb 27, 2020",11.869999885559082,11.979999542236328,12.1899995803833,11.869999885559082
"Feb 28, 2020",12.010000228881836,11.859999656677246,12.039999961853027,11.699999809265137
"Mar 02, 2020",12.3100004196167,12.0600004196167,12.319999694824219,11.979999542236328
"Mar 03, 2020",12.130000114440918,12.239999771118164,12.390000343322754,11.930000305175781
"Mar 04, 2020",12.199999809265137,12.279999732971191,12.289999961853027,12.020000457763672
"Mar 05, 2020",11.829999923706055,12.170000076293945,12.199999809265137,11.680000305175781
"Mar 06, 2020",11.5600004196167,11.550000190734863,11.739999771118164,11.420000076293945
"Mar 09, 2020",10.829999923706055,10.949999809265137,11.0,10.720000267028809
"Mar 10, 2020",11.0600004196167,11.329999923706055,11.569999694824219,10.779999732971191
"Mar 11, 2020",10.399999618530273,10.890000343322754,11.0,9.869999885559082
"Mar 12, 2020",9.270000457763672,9.25,9.850000381469727,9.069999694824219
"Mar 13, 2020",10.199999809265137,10.5,10.5600004196167,9.270000457763672
"Mar 16, 2020",9.100000381469727,9.149999618530273,9.789999961853027,9.100000381469727
"Mar 17, 2020",9.539999961853027,9.359999656677246,9.90999984741211,9.069999694824219
"Mar 18, 2020",9.069999694824219,8.949999809265137,9.300000190734863,8.5600004196167
"Mar 19, 2020",8.760000228881836,8.800000190734863,9.09000015258789,8.3100004196167
"Mar 20, 2020",8.3100004196167,9.079999923706055,9.15999984741211,8.279999732971191
"Mar 23, 2020",7.53000020980835,8.399999618530273,8.449999809265137,7.440000057220459
"Mar 24, 2020",8.069999694824219,8.0600004196167,8.40999984741211,7.940000057220459
"Mar 25, 2020",8.609999656677246,8.0600004196167,8.930000305175781,8.010000228881836
"Mar 26, 2020",8.979999542236328,8.65999984741211,9.109999656677246,8.65999984741211
"Mar 27, 2020",8.5,8.609999656677246,8.84000015258789,8.5
"Mar 30, 2020",8.819999694824219,8.569999694824219,8.869999885559082,8.470000267028809
"Mar 31, 2020",8.770000457763672,8.8100004196167,8.989999771118164,8.609999656677246
"Apr 01, 2020",8.260000228881836,8.5,8.5,8.25
"Apr 02, 2020",8.369999885559082,8.279999732971191,8.5600004196167,8.220000267028809
"Apr 03, 2020",8.109999656677246,8.300000190734863,8.300000190734863,7.909999847412109
"Apr 06, 2020",8.710000038146973,8.520000457763672,8.829999923706055,8.5
"Apr 07, 2020",8.970000267028809,9.09000015258789,9.319999694824219,8.970000267028809
"Apr 08, 2020",9.319999694824219,9.029999732971191,9.460000038146973,8.9399995803833
"Apr 09, 2020",9.239999771118164,9.449999809265137,9.600000381469727,9.220000267028809
"Apr 13, 2020",9.489999771118164,9.210000038146973,9.489999771118164,9.0600004196167
"Apr 14, 2020",9.600000381469727,9.649999618530273,9.880000114440918,9.550000190734863
"Apr 15, 2020",9.300000190734863,9.420000076293945,9.59000015258789,9.300000190734863
"Apr 16, 2020",9.020000457763672,9.40999984741211,9.5,9.0
"Apr 17, 2020",9.140000343322754,9.25,9.289999961853027,8.960000038146973
"Apr 20, 2020",8.970000267028809,8.960000038146973,9.100000381469727,8.899999618530273
"Apr 22, 2020",8.960000038146973,9.0,9.149999618530273,8.869999885559082
"Apr 23, 2020",8.84000015258789,9.039999961853027,9.09000015258789,8.75
"Apr 24, 2020",8.399999618530273,8.720000267028809,8.729999542236328,8.15999984741211
"Apr 27, 2020",8.670000076293945,8.6899995803833,8.930000305175781,8.529999732971191
"Apr 28, 2020",9.279999732971191,9.100000381469727,9.350000381469727,9.050000190734863
"Apr 29, 2020",9.260000228881836,9.460000038146973,9.529999732971191,9.119999885559082
"Apr 30, 2020",9.0,8.9399995803833,9.130000114440918,8.84000015258789
"May 04, 2020",8.699999809265137,8.699999809265137,8.739999771118164,8.630000114440918
"May 05, 2020",8.90999984741211,8.800000190734863,9.079999923706055,8.729999542236328
"May 06, 2020",8.699999809265137,8.90999984741211,8.9399995803833,8.649999618530273
"May 07, 2020",8.289999961853027,8.800000190734863,8.829999923706055,8.239999771118164
"May 08, 2020",8.489999771118164,8.489999771118164,8.720000267028809,8.4399995803833
"May 11, 2020",8.420000076293945,8.479999542236328,8.699999809265137,8.420000076293945
"May 12, 2020",8.180000305175781,8.40999984741211,8.489999771118164,8.15999984741211
"May 13, 2020",8.220000267028809,8.260000228881836,8.300000190734863,7.96999979019165
"May 14, 2020",8.520000457763672,8.100000381469727,8.550000190734863,7.840000152587891
"May 15, 2020",8.140000343322754,8.449999809265137,8.539999961853027,8.140000343322754
"May 18, 2020",8.539999961853027,8.430000305175781,8.579999923706055,8.260000228881836
"May 19, 2020",8.239999771118164,8.5,8.520000457763672,8.199999809265137
"May 20, 2020",8.25,8.260000228881836,8.350000381469727,8.199999809265137
"May 21, 2020",8.6899995803833,8.279999732971191,8.720000267028809,8.279999732971191
"May 22, 2020",8.859999656677246,8.600000381469727,9.020000457763672,8.510000228881836
"May 25, 2020",9.239999771118164,9.180000305175781,9.25,9.050000190734863
"May 26, 2020",8.920000076293945,9.300000190734863,9.430000305175781,8.829999923706055
"May 27, 2020",9.109999656677246,9.09000015258789,9.149999618530273,8.979999542236328
"May 28, 2020",9.0,9.069999694824219,9.210000038146973,9.0
"May 29, 2020",8.859999656677246,8.960000038146973,8.970000267028809,8.779999732971191
"Jun 01, 2020",9.069999694824219,8.84000015258789,9.149999618530273,8.760000228881836
"Jun 02, 2020",9.539999961853027,9.180000305175781,9.579999923706055,9.149999618530273
"Jun 03, 2020",9.8100004196167,9.869999885559082,9.989999771118164,9.779999732971191
"Jun 04, 2020",9.920000076293945,9.739999771118164,10.029999732971191,9.630000114440918
"Jun 05, 2020",10.039999961853027,10.289999961853027,10.59000015258789,10.0
"Jun 08, 2020",10.399999618530273,10.170000076293945,10.449999809265137,10.15999984741211
"Jun 09, 2020",10.359999656677246,10.180000305175781,10.520000457763672,10.069999694824219
"Jun 10, 2020",10.029999732971191,10.5,10.5,10.010000228881836
"Jun 12, 2020",9.789999961853027,9.699999809265137,9.869999885559082,9.550000190734863
"Jun 15, 2020",9.5600004196167,9.460000038146973,9.729999542236328,9.40999984741211
"Jun 16, 2020",9.760000228881836,9.890000343322754,9.920000076293945,9.649999618530273
"Jun 17, 2020",9.930000305175781,9.8100004196167,10.0600004196167,9.760000228881836
"Jun 18, 2020",10.25,9.890000343322754,10.350000381469727,9.859999656677246
"Jun 19, 2020",10.40999984741211,10.430000305175781,10.470000267028809,10.210000038146973
"Jun 22, 2020",10.149999618530273,10.369999885559082,10.399999618530273,10.039999961853027
"Jun 23, 2020",10.0600004196167,10.279999732971191,10.329999923706055,9.9399995803833
"Jun 24, 2020",9.770000457763672,10.029999732971191,10.050000190734863,9.729999542236328
"Jun 25, 2020",9.960000038146973,9.829999923706055,10.0,9.710000038146973
"Jun 26, 2020",9.65999984741211,9.829999923706055,9.90999984741211,9.59000015258789
"Jun 29, 2020",9.890000343322754,9.739999771118164,9.899999618530273,9.65999984741211
"Jun 30, 2020",9.59000015258789,9.800000190734863,9.850000381469727,9.579999923706055
"Jul 01, 2020",9.789999961853027,9.670000076293945,9.869999885559082,9.640000343322754
"Jul 02, 2020",9.949999809265137,9.9399995803833,10.1899995803833,9.90999984741211
"Jul 03, 2020",9.970000267028809,9.949999809265137,10.039999961853027,9.84000015258789
"Jul 06, 2020",10.359999656677246,10.180000305175781,10.390000343322754,10.109999656677246
"Jul 07, 2020",9.989999771118164,10.279999732971191,10.3100004196167,9.970000267028809
"Jul 08, 2020",10.170000076293945,10.079999923706055,10.220000267028809,10.039999961853027
"Jul 09, 2020",10.199999809265137,10.1899995803833,10.239999771118164,10.069999694824219
"Jul 10, 2020",10.229999542236328,10.149999618530273,10.260000228881836,10.069999694824219
"Jul 13, 2020",10.039999961853027,10.25,10.319999694824219,10.039999961853027
"Jul 14, 2020",10.15999984741211,10.050000190734863,10.180000305175781,9.949999809265137
"Jul 15, 2020",10.270000457763672,10.25,10.350000381469727,10.180000305175781
"Jul 16, 2020",10.149999618530273,10.199999809265137,10.25,10.130000114440918
"Jul 17, 2020",10.270000457763672,10.1899995803833,10.329999923706055,10.15999984741211
"Jul 20, 2020",10.420000076293945,10.300000190734863,10.479999542236328,10.220000267028809
"Jul 21, 2020",10.520000457763672,10.5,10.630000114440918,10.470000267028809
"Jul 22, 2020",10.520000457763672,10.569999694824219,10.739999771118164,10.420000076293945
"Jul 23, 2020",10.369999885559082,10.529999732971191,10.579999923706055,10.350000381469727
"Jul 24, 2020",10.449999809265137,10.329999923706055,10.609999656677246,10.220000267028809
"Jul 27, 2020",11.020000457763672,10.470000267028809,11.09000015258789,10.4399995803833
"Jul 28, 2020",10.880000114440918,10.949999809265137,11.100000381469727,10.880000114440918
"Jul 29, 2020",11.130000114440918,11.069999694824219,11.15999984741211,10.90999984741211
"Jul 30, 2020",10.90999984741211,10.970000267028809,11.029999732971191,10.760000228881836
"Jul 31, 2020",10.670000076293945,10.960000038146973,10.970000267028809,10.609999656677246
"Aug 03, 2020",10.699999809265137,10.729999542236328,10.899999618530273,10.529999732971191
"Aug 04, 2020",10.210000038146973,10.40999984741211,10.59000015258789,10.130000114440918
"Aug 05, 2020",10.199999809265137,10.34000015258789,10.390000343322754,10.0600004196167
"Aug 06, 2020",10.319999694824219,10.220000267028809,10.380000114440918,10.140000343322754
"Aug 07, 2020",10.210000038146973,10.199999809265137,10.489999771118164,10.130000114440918
"Aug 10, 2020",10.359999656677246,10.25,10.420000076293945,10.15999984741211
"Aug 11, 2020",10.199999809265137,10.420000076293945,10.470000267028809,10.199999809265137
"Aug 12, 2020",10.109999656677246,10.260000228881836,10.279999732971191,9.970000267028809
"Aug 13, 2020",9.859999656677246,10.170000076293945,10.25,9.850000381469727
"Aug 14, 2020",9.930000305175781,9.90999984741211,10.050000190734863,9.84000015258789
"Aug 17, 2020",9.630000114440918,9.890000343322754,9.90999984741211,9.5600004196167
"Aug 18, 2020",9.800000190734863,9.829999923706055,9.850000381469727,9.710000038146973
"Aug 19, 2020",9.729999542236328,9.850000381469727,9.859999656677246,9.729999542236328
"Aug 20, 2020",9.670000076293945,9.579999923706055,9.75,9.520000457763672
"Aug 21, 2020",9.729999542236328,9.649999618530273,9.729999542236328,9.59000015258789
"Aug 24, 2020",9.829999923706055,9.779999732971191,9.970000267028809,9.779999732971191
"Aug 25, 2020",9.75,9.899999618530273,9.920000076293945,9.699999809265137
"Aug 26, 2020",9.609999656677246,9.75,9.770000457763672,9.470000267028809
"Aug 27, 2020",9.6899995803833,9.600000381469727,9.850000381469727,9.579999923706055
"Aug 28, 2020",9.779999732971191,9.770000457763672,9.8100004196167,9.680000305175781
"Aug 31, 2020",9.430000305175781,9.729999542236328,9.729999542236328,9.430000305175781
