Date,Price,Open,High,Low
"Jun 03, 2019",6.730000019073486,6.710000038146973,6.789999961853027,6.579999923706055
"Jun 04, 2019",6.599999904632568,6.820000171661377,6.900000095367432,6.599999904632568
"Jun 05, 2019",6.659999847412109,6.659999847412109,6.739999771118164,6.53000020980835
"Jun 06, 2019",6.900000095367432,6.730000019073486,6.940000057220459,6.659999847412109
"Jun 07, 2019",6.699999809265137,6.960000038146973,6.989999771118164,6.650000095367432
"Jun 10, 2019",6.570000171661377,6.730000019073486,6.75,6.46999979019165
"Jun 11, 2019",6.599999904632568,6.599999904632568,6.630000114440918,6.489999771118164
"Jun 12, 2019",6.400000095367432,6.570000171661377,6.570000171661377,6.25
"Jun 13, 2019",6.659999847412109,6.360000133514404,6.789999961853027,6.320000171661377
"Jun 14, 2019",6.599999904632568,6.659999847412109,6.75,6.460000038146973
"Jun 17, 2019",6.619999885559082,6.590000152587891,6.800000190734863,6.489999771118164
"Jun 18, 2019",6.75,6.670000076293945,6.760000228881836,6.650000095367432
"Jun 19, 2019",6.849999904632568,6.800000190734863,6.889999866485596,6.699999809265137
"Jun 21, 2019",7.28000020980835,6.869999885559082,7.28000020980835,6.860000133514404
"Jun 24, 2019",7.170000076293945,7.300000190734863,7.300000190734863,7.079999923706055
"Jun 25, 2019",6.949999809265137,7.119999885559082,7.139999866485596,6.869999885559082
"Jun 26, 2019",6.940000057220459,6.989999771118164,7.039999961853027,6.809999942779541
"Jun 27, 2019",6.889999866485596,6.900000095367432,6.929999828338623,6.789999961853027
"Jun 28, 2019",6.71999979019165,6.900000095367432,6.940000057220459,6.679999828338623
"Jul 01, 2019",6.679999828338623,6.809999942779541,6.829999923706055,6.679999828338623
"Jul 02, 2019",6.550000190734863,6.71999979019165,6.800000190734863,6.539999961853027
"Jul 03, 2019",6.869999885559082,6.610000133514404,6.880000114440918,6.550000190734863
"Jul 04, 2019",7.0,6.880000114440918,7.059999942779541,6.880000114440918
"Jul 05, 2019",6.869999885559082,7.010000228881836,7.010000228881836,6.829999923706055
"Jul 08, 2019",7.010000228881836,6.869999885559082,7.050000190734863,6.809999942779541
"Jul 10, 2019",7.300000190734863,7.070000171661377,7.300000190734863,7.059999942779541
"Jul 11, 2019",7.460000038146973,7.320000171661377,7.730000019073486,7.21999979019165
"Jul 12, 2019",7.230000019073486,7.539999961853027,7.579999923706055,7.230000019073486
"Jul 15, 2019",7.039999961853027,7.230000019073486,7.289999961853027,7.039999961853027
"Jul 16, 2019",7.010000228881836,7.070000171661377,7.099999904632568,6.869999885559082
"Jul 17, 2019",6.949999809265137,7.099999904632568,7.130000114440918,6.820000171661377
"Jul 18, 2019",6.699999809265137,6.949999809265137,6.989999771118164,6.699999809265137
"Jul 19, 2019",6.679999828338623,6.730000019073486,6.769999980926514,6.650000095367432
"Jul 22, 2019",7.0,6.71999979019165,7.0,6.650000095367432
"Jul 23, 2019",6.75,7.050000190734863,7.28000020980835,6.75
"Jul 24, 2019",7.619999885559082,6.75,7.619999885559082,6.610000133514404
"Jul 25, 2019",7.510000228881836,7.5,7.96999979019165,7.28000020980835
"Jul 26, 2019",7.380000114440918,7.510000228881836,7.590000152587891,7.300000190734863
"Jul 29, 2019",7.300000190734863,7.380000114440918,7.400000095367432,7.21999979019165
"Jul 30, 2019",7.389999866485596,7.300000190734863,7.480000019073486,7.260000228881836
"Jul 31, 2019",7.239999771118164,7.440000057220459,7.460000038146973,7.170000076293945
"Aug 01, 2019",8.350000381469727,7.28000020980835,8.350000381469727,7.130000114440918
"Aug 02, 2019",7.989999771118164,8.09000015258789,8.289999961853027,7.829999923706055
"Aug 05, 2019",7.789999961853027,7.75,7.880000114440918,7.670000076293945
"Aug 06, 2019",7.929999828338623,7.760000228881836,8.0600004196167,7.590000152587891
"Aug 07, 2019",7.909999847412109,7.849999904632568,7.929999828338623,7.599999904632568
"Aug 08, 2019",7.670000076293945,7.960000038146973,7.989999771118164,7.5
"Aug 09, 2019",7.710000038146973,7.670000076293945,7.900000095367432,7.659999847412109
"Aug 12, 2019",7.519999980926514,7.590000152587891,7.670000076293945,7.519999980926514
"Aug 13, 2019",7.630000114440918,7.539999961853027,7.71999979019165,7.510000228881836
"Aug 14, 2019",7.510000228881836,7.599999904632568,7.599999904632568,7.449999809265137
"Aug 15, 2019",7.400000095367432,7.550000190734863,7.570000171661377,7.210000038146973
"Aug 16, 2019",7.329999923706055,7.389999866485596,7.440000057220459,7.28000020980835
"Aug 19, 2019",7.260000228881836,7.400000095367432,7.550000190734863,7.260000228881836
"Aug 20, 2019",7.590000152587891,7.260000228881836,7.71999979019165,7.139999866485596
"Aug 21, 2019",7.949999809265137,7.659999847412109,8.050000190734863,7.610000133514404
"Aug 22, 2019",7.619999885559082,8.079999923706055,8.079999923706055,7.559999942779541
"Aug 23, 2019",7.239999771118164,7.539999961853027,7.570000171661377,7.210000038146973
"Aug 26, 2019",7.300000190734863,7.300000190734863,7.489999771118164,7.199999809265137
"Aug 27, 2019",7.21999979019165,7.369999885559082,7.429999828338623,7.170000076293945
"Aug 28, 2019",7.260000228881836,7.230000019073486,7.289999961853027,7.159999847412109
"Aug 29, 2019",7.489999771118164,7.269999980926514,7.539999961853027,7.21999979019165
"Aug 30, 2019",7.75,7.53000020980835,7.75,7.5
"Sep 02, 2019",7.590000152587891,7.730000019073486,7.75,7.5
"Sep 03, 2019",7.699999809265137,7.539999961853027,7.78000020980835,7.420000076293945
"Sep 04, 2019",7.909999847412109,7.789999961853027,7.960000038146973,7.71999979019165
"Sep 05, 2019",7.75,7.949999809265137,8.119999885559082,7.739999771118164
"Sep 06, 2019",7.75,7.75,7.880000114440918,7.670000076293945
"Sep 09, 2019",7.489999771118164,7.809999942779541,7.829999923706055,7.480000019073486
"Sep 10, 2019",7.519999980926514,7.5,7.599999904632568,7.409999847412109
"Sep 11, 2019",7.699999809265137,7.53000020980835,7.75,7.46999979019165
"Sep 12, 2019",7.710000038146973,7.75,7.880000114440918,7.570000171661377
"Sep 13, 2019",7.639999866485596,7.769999980926514,7.769999980926514,7.619999885559082
"Sep 16, 2019",8.100000381469727,7.71999979019165,8.279999732971191,7.679999828338623
"Sep 17, 2019",8.220000267028809,8.069999694824219,8.229999542236328,7.940000057220459
"Sep 18, 2019",8.960000038146973,8.109999656677246,8.960000038146973,8.0600004196167
"Sep 19, 2019",8.5,8.90999984741211,8.970000267028809,8.5
"Sep 20, 2019",8.390000343322754,8.600000381469727,8.850000381469727,8.329999923706055
"Sep 23, 2019",8.609999656677246,8.369999885559082,8.680000305175781,8.350000381469727
"Sep 24, 2019",8.579999923706055,8.720000267028809,8.789999961853027,8.220000267028809
"Sep 25, 2019",8.369999885559082,8.5,8.600000381469727,8.289999961853027
"Sep 26, 2019",8.300000190734863,8.420000076293945,8.449999809265137,8.15999984741211
"Sep 27, 2019",7.929999828338623,8.279999732971191,8.359999656677246,7.869999885559082
"Sep 30, 2019",8.0,7.949999809265137,8.149999618530273,7.940000057220459
"Oct 01, 2019",7.860000133514404,8.0600004196167,8.149999618530273,7.800000190734863
"Oct 02, 2019",7.510000228881836,7.829999923706055,7.829999923706055,7.510000228881836
"Oct 03, 2019",7.820000171661377,7.559999942779541,7.920000076293945,7.480000019073486
"Oct 04, 2019",7.710000038146973,7.860000133514404,7.869999885559082,7.619999885559082
"Oct 07, 2019",7.639999866485596,7.699999809265137,7.809999942779541,7.559999942779541
"Oct 08, 2019",7.5,7.679999828338623,7.679999828338623,7.460000038146973
"Oct 09, 2019",7.650000095367432,7.550000190734863,7.739999771118164,7.5
"Oct 10, 2019",7.46999979019165,7.71999979019165,7.71999979019165,7.400000095367432
"Oct 11, 2019",7.75,7.53000020980835,7.809999942779541,7.5
"Oct 14, 2019",7.78000020980835,7.730000019073486,7.889999866485596,7.679999828338623
"Oct 15, 2019",7.579999923706055,7.78000020980835,7.789999961853027,7.550000190734863
"Oct 16, 2019",7.650000095367432,7.599999904632568,7.659999847412109,7.519999980926514
"Oct 17, 2019",7.599999904632568,7.659999847412109,7.800000190734863,7.579999923706055
"Oct 18, 2019",7.650000095367432,7.599999904632568,7.690000057220459,7.510000228881836
"Oct 21, 2019",7.699999809265137,7.679999828338623,7.730000019073486,7.599999904632568
"Oct 22, 2019",7.889999866485596,7.75,7.989999771118164,7.710000038146973
"Oct 23, 2019",7.829999923706055,7.900000095367432,7.940000057220459,7.730000019073486
"Oct 24, 2019",7.639999866485596,7.889999866485596,7.889999866485596,7.570000171661377
"Oct 25, 2019",7.889999866485596,7.650000095367432,8.039999961853027,7.650000095367432
"Oct 28, 2019",7.809999942779541,7.920000076293945,8.069999694824219,7.760000228881836
"Oct 29, 2019",7.940000057220459,7.78000020980835,8.020000457763672,7.78000020980835
"Oct 30, 2019",7.650000095367432,7.760000228881836,7.869999885559082,7.449999809265137
"Oct 31, 2019",7.559999942779541,7.639999866485596,7.659999847412109,7.46999979019165
"Nov 01, 2019",7.400000095367432,7.590000152587891,7.630000114440918,7.380000114440918
"Nov 04, 2019",7.519999980926514,7.440000057220459,7.550000190734863,7.420000076293945
"Nov 05, 2019",7.400000095367432,7.53000020980835,7.539999961853027,7.309999942779541
"Nov 06, 2019",7.360000133514404,7.389999866485596,7.420000076293945,7.25
"Nov 07, 2019",7.630000114440918,7.409999847412109,7.630000114440918,7.349999904632568
"Nov 08, 2019",7.739999771118164,7.610000133514404,7.949999809265137,7.5
"Nov 11, 2019",8.020000457763672,7.739999771118164,8.029999732971191,7.590000152587891
"Nov 12, 2019",7.949999809265137,7.96999979019165,8.0600004196167,7.730000019073486
"Nov 13, 2019",8.010000228881836,7.960000038146973,8.029999732971191,7.809999942779541
"Nov 14, 2019",7.889999866485596,8.050000190734863,8.1899995803833,7.880000114440918
"Nov 18, 2019",7.650000095367432,7.980000019073486,7.980000019073486,7.590000152587891
"Nov 19, 2019",7.650000095367432,7.710000038146973,7.809999942779541,7.630000114440918
"Nov 21, 2019",7.639999866485596,7.679999828338623,7.730000019073486,7.559999942779541
"Nov 22, 2019",7.53000020980835,7.670000076293945,7.699999809265137,7.480000019073486
"Nov 25, 2019",7.820000171661377,7.53000020980835,7.889999866485596,7.480000019073486
"Nov 26, 2019",7.579999923706055,7.789999961853027,7.889999866485596,7.480000019073486
"Nov 27, 2019",7.460000038146973,7.639999866485596,7.670000076293945,7.409999847412109
"Nov 28, 2019",7.739999771118164,7.489999771118164,7.75,7.460000038146973
"Nov 29, 2019",7.800000190734863,7.75,7.829999923706055,7.650000095367432
"Dec 02, 2019",7.769999980926514,7.820000171661377,7.869999885559082,7.710000038146973
"Dec 03, 2019",7.829999923706055,7.829999923706055,7.889999866485596,7.690000057220459
"Dec 04, 2019",7.679999828338623,7.840000152587891,7.840000152587891,7.670000076293945
"Dec 05, 2019",8.079999923706055,7.710000038146973,8.119999885559082,7.679999828338623
"Dec 06, 2019",8.069999694824219,8.09000015258789,8.180000305175781,7.940000057220459
"Dec 09, 2019",8.140000343322754,8.0600004196167,8.289999961853027,7.989999771118164
"Dec 10, 2019",8.100000381469727,8.100000381469727,8.210000038146973,8.0
"Dec 11, 2019",8.25,8.140000343322754,8.25,8.109999656677246
"Dec 12, 2019",8.399999618530273,8.289999961853027,8.449999809265137,8.25
"Dec 13, 2019",8.779999732971191,8.470000267028809,8.789999961853027,8.470000267028809
"Dec 16, 2019",8.329999923706055,8.75,8.930000305175781,8.239999771118164
"Dec 17, 2019",8.789999961853027,8.270000457763672,8.800000190734863,8.270000457763672
"Dec 18, 2019",8.739999771118164,8.829999923706055,9.069999694824219,8.65999984741211
"Dec 19, 2019",8.539999961853027,8.760000228881836,8.789999961853027,8.449999809265137
"Dec 20, 2019",8.470000267028809,8.550000190734863,8.550000190734863,8.430000305175781
"Dec 23, 2019",8.529999732971191,8.520000457763672,8.569999694824219,8.380000114440918
"Dec 26, 2019",8.699999809265137,8.539999961853027,8.729999542236328,8.4399995803833
"Dec 27, 2019",8.539999961853027,8.789999961853027,8.880000114440918,8.5
"Dec 30, 2019",8.369999885559082,8.569999694824219,8.670000076293945,8.369999885559082
"Jan 02, 2020",8.569999694824219,8.5,8.569999694824219,8.25
"Jan 03, 2020",8.460000038146973,8.430000305175781,8.539999961853027,8.369999885559082
"Jan 06, 2020",8.25,8.399999618530273,8.4399995803833,8.149999618530273
"Jan 07, 2020",8.010000228881836,8.279999732971191,8.3100004196167,8.010000228881836
"Jan 08, 2020",7.829999923706055,8.039999961853027,8.079999923706055,7.820000171661377
"Jan 09, 2020",7.349999904632568,7.75,7.760000228881836,7.289999961853027
"Jan 10, 2020",7.400000095367432,7.369999885559082,7.53000020980835,7.309999942779541
"Jan 13, 2020",7.429999828338623,7.429999828338623,7.570000171661377,7.389999866485596
"Jan 14, 2020",7.489999771118164,7.449999809265137,7.5,7.329999923706055
"Jan 15, 2020",7.269999980926514,7.489999771118164,7.489999771118164,7.25
"Jan 16, 2020",7.300000190734863,7.300000190734863,7.380000114440918,7.179999828338623
"Jan 17, 2020",7.230000019073486,7.300000190734863,7.369999885559082,7.190000057220459
"Jan 20, 2020",7.050000190734863,7.139999866485596,7.210000038146973,7.050000190734863
"Jan 21, 2020",6.900000095367432,7.050000190734863,7.090000152587891,6.900000095367432
"Jan 22, 2020",7.159999847412109,6.940000057220459,7.230000019073486,6.900000095367432
"Jan 23, 2020",7.119999885559082,7.150000095367432,7.269999980926514,7.090000152587891
"Jan 24, 2020",7.0,7.110000133514404,7.150000095367432,6.980000019073486
"Jan 27, 2020",7.0,6.940000057220459,7.130000114440918,6.860000133514404
"Jan 28, 2020",7.25,6.699999809265137,7.300000190734863,6.610000133514404
"Jan 29, 2020",6.960000038146973,7.300000190734863,7.380000114440918,6.940000057220459
"Jan 30, 2020",7.090000152587891,6.900000095367432,7.099999904632568,6.760000228881836
"Jan 31, 2020",7.070000171661377,7.0,7.199999809265137,6.900000095367432
"Feb 03, 2020",7.159999847412109,7.059999942779541,7.25,7.059999942779541
"Feb 04, 2020",6.960000038146973,7.25,7.289999961853027,6.960000038146973
"Feb 05, 2020",7.039999961853027,7.03000020980835,7.179999828338623,6.96999979019165
"Feb 06, 2020",7.369999885559082,7.070000171661377,7.369999885559082,7.0
"Feb 07, 2020",7.360000133514404,7.320000171661377,7.489999771118164,7.239999771118164
"Feb 10, 2020",7.239999771118164,7.349999904632568,7.400000095367432,7.210000038146973
"Feb 11, 2020",7.130000114440918,7.300000190734863,7.389999866485596,7.099999904632568
"Feb 12, 2020",7.320000171661377,7.179999828338623,7.679999828338623,7.179999828338623
"Feb 13, 2020",7.199999809265137,7.28000020980835,7.340000152587891,7.130000114440918
"Feb 14, 2020",7.289999961853027,7.21999979019165,7.400000095367432,7.139999866485596
"Feb 17, 2020",7.239999771118164,7.320000171661377,7.420000076293945,7.21999979019165
"Feb 18, 2020",7.400000095367432,7.239999771118164,7.400000095367432,7.199999809265137
"Feb 19, 2020",7.449999809265137,7.360000133514404,7.46999979019165,7.320000171661377
"Feb 20, 2020",7.199999809265137,7.5,7.510000228881836,7.199999809265137
"Feb 21, 2020",7.050000190734863,7.170000076293945,7.179999828338623,6.940000057220459
"Feb 27, 2020",6.489999771118164,6.809999942779541,6.940000057220459,6.489999771118164
"Feb 28, 2020",6.849999904632568,6.5,6.849999904632568,6.380000114440918
"Mar 02, 2020",7.079999923706055,6.900000095367432,7.119999885559082,6.670000076293945
"Mar 03, 2020",7.199999809265137,7.130000114440918,7.46999979019165,7.019999980926514
"Mar 04, 2020",7.369999885559082,7.320000171661377,7.46999979019165,7.21999979019165
"Mar 05, 2020",6.880000114440918,7.340000152587891,7.340000152587891,6.789999961853027
"Mar 06, 2020",6.559999942779541,6.730000019073486,6.789999961853027,6.460000038146973
"Mar 09, 2020",6.019999980926514,5.920000076293945,6.360000133514404,5.920000076293945
"Mar 10, 2020",6.340000152587891,6.389999866485596,6.460000038146973,5.96999979019165
"Mar 11, 2020",5.949999809265137,6.179999828338623,6.230000019073486,5.53000020980835
"Mar 12, 2020",4.690000057220459,5.5,5.539999961853027,4.659999847412109
"Mar 13, 2020",5.670000076293945,5.230000019073486,5.670000076293945,4.849999904632568
"Mar 16, 2020",5.0,5.0,5.369999885559082,4.71999979019165
"Mar 17, 2020",5.460000038146973,5.150000095367432,5.679999828338623,5.110000133514404
"Mar 18, 2020",5.090000152587891,5.130000114440918,5.46999979019165,4.860000133514404
"Mar 19, 2020",4.650000095367432,5.019999980926514,5.039999961853027,4.519999980926514
"Mar 20, 2020",4.429999828338623,4.829999923706055,5.03000020980835,4.309999942779541
"Mar 23, 2020",4.139999866485596,4.449999809265137,4.53000020980835,3.9700000286102295
"Mar 24, 2020",4.050000190734863,4.349999904632568,4.449999809265137,4.050000190734863
"Mar 25, 2020",5.0,4.090000152587891,5.0,4.070000171661377
"Mar 26, 2020",5.0,4.889999866485596,5.199999809265137,4.710000038146973
"Mar 27, 2020",4.610000133514404,4.659999847412109,4.889999866485596,4.610000133514404
"Mar 30, 2020",4.760000228881836,4.650000095367432,4.789999961853027,4.46999979019165
"Mar 31, 2020",4.440000057220459,4.789999961853027,4.889999866485596,4.369999885559082
"Apr 01, 2020",4.28000020980835,4.289999961853027,4.449999809265137,4.079999923706055
"Apr 02, 2020",4.230000019073486,4.360000133514404,4.380000114440918,4.159999847412109
"Apr 03, 2020",3.9800000190734863,4.21999979019165,4.239999771118164,3.940000057220459
"Apr 06, 2020",4.050000190734863,4.210000038146973,4.269999980926514,3.9800000190734863
"Apr 07, 2020",4.110000133514404,4.199999809265137,4.440000057220459,4.110000133514404
"Apr 08, 2020",5.019999980926514,4.139999866485596,5.03000020980835,4.110000133514404
"Apr 09, 2020",4.829999923706055,5.099999904632568,5.119999885559082,4.599999904632568
"Apr 13, 2020",4.949999809265137,4.820000171661377,5.03000020980835,4.659999847412109
"Apr 14, 2020",4.829999923706055,5.070000171661377,5.190000057220459,4.829999923706055
"Apr 15, 2020",4.809999942779541,4.730000019073486,4.889999866485596,4.659999847412109
"Apr 16, 2020",4.619999885559082,4.880000114440918,4.980000019073486,4.559999942779541
"Apr 17, 2020",4.53000020980835,4.760000228881836,4.769999980926514,4.449999809265137
"Apr 20, 2020",4.400000095367432,4.400000095367432,4.53000020980835,4.320000171661377
"Apr 22, 2020",4.409999847412109,4.409999847412109,4.480000019073486,4.340000152587891
"Apr 23, 2020",4.260000228881836,4.5,4.5,4.25
"Apr 24, 2020",4.079999923706055,4.21999979019165,4.21999979019165,3.8399999141693115
"Apr 27, 2020",4.110000133514404,4.139999866485596,4.230000019073486,3.9800000190734863
"Apr 28, 2020",4.179999828338623,4.239999771118164,4.449999809265137,4.150000095367432
"Apr 29, 2020",4.230000019073486,4.110000133514404,4.340000152587891,4.050000190734863
"Apr 30, 2020",4.059999942779541,4.159999847412109,4.210000038146973,4.059999942779541
"May 04, 2020",3.940000057220459,4.010000228881836,4.059999942779541,3.859999895095825
"May 05, 2020",3.9100000858306885,4.010000228881836,4.059999942779541,3.9100000858306885
"May 06, 2020",3.809999942779541,3.930000066757202,3.9700000286102295,3.7799999713897705
"May 07, 2020",3.5999999046325684,3.8499999046325684,3.880000114440918,3.5999999046325684
"May 08, 2020",3.759999990463257,3.6500000953674316,3.859999895095825,3.549999952316284
"May 11, 2020",3.640000104904175,3.7100000381469727,3.7899999618530273,3.630000114440918
"May 12, 2020",3.5399999618530273,3.6600000858306885,3.7100000381469727,3.5
"May 13, 2020",3.3299999237060547,3.549999952316284,3.5999999046325684,3.2699999809265137
"May 14, 2020",3.549999952316284,3.2799999713897705,3.5799999237060547,3.2300000190734863
"May 15, 2020",3.4700000286102295,3.509999990463257,3.640000104904175,3.430000066757202
"May 18, 2020",3.700000047683716,3.5999999046325684,3.8299999237060547,3.5299999713897705
"May 19, 2020",3.5999999046325684,3.7200000286102295,3.7899999618530273,3.5999999046325684
"May 20, 2020",3.559999942779541,3.6500000953674316,3.680000066757202,3.5299999713897705
"May 21, 2020",3.4800000190734863,3.569999933242798,3.630000114440918,3.4700000286102295
"May 22, 2020",3.4100000858306885,3.4700000286102295,3.559999942779541,3.390000104904175
"May 25, 2020",3.680000066757202,3.509999990463257,3.680000066757202,3.4800000190734863
"May 26, 2020",3.809999942779541,3.759999990463257,3.9000000953674316,3.75
"May 27, 2020",4.0,3.8499999046325684,4.0,3.7799999713897705
"May 28, 2020",4.050000190734863,4.0,4.079999923706055,3.9100000858306885
"May 29, 2020",4.090000152587891,4.019999980926514,4.260000228881836,3.930000066757202
"Jun 01, 2020",4.170000076293945,4.130000114440918,4.21999979019165,4.079999923706055
"Jun 02, 2020",4.400000095367432,4.230000019073486,4.449999809265137,4.179999828338623
"Jun 03, 2020",4.539999961853027,4.579999923706055,4.800000190734863,4.46999979019165
"Jun 04, 2020",4.380000114440918,4.510000228881836,4.570000171661377,4.349999904632568
"Jun 05, 2020",4.5,4.570000171661377,4.579999923706055,4.409999847412109
"Jun 08, 2020",4.639999866485596,4.550000190734863,4.659999847412109,4.53000020980835
"Jun 09, 2020",4.840000152587891,4.550000190734863,4.989999771118164,4.489999771118164
"Jun 10, 2020",4.559999942779541,4.949999809265137,4.949999809265137,4.539999961853027
"Jun 12, 2020",4.210000038146973,4.360000133514404,4.53000020980835,4.199999809265137
"Jun 15, 2020",4.800000190734863,4.900000095367432,5.670000076293945,4.739999771118164
"Jun 16, 2020",4.960000038146973,5.190000057220459,5.320000171661377,4.949999809265137
"Jun 17, 2020",5.179999828338623,4.96999979019165,5.239999771118164,4.590000152587891
"Jun 18, 2020",5.630000114440918,5.119999885559082,5.739999771118164,5.050000190734863
"Jun 19, 2020",5.699999809265137,5.880000114440918,5.929999828338623,5.460000038146973
"Jun 22, 2020",5.510000228881836,5.730000019073486,5.800000190734863,5.5
"Jun 23, 2020",5.400000095367432,5.619999885559082,5.639999866485596,5.360000133514404
"Jun 24, 2020",4.699999809265137,4.909999847412109,5.070000171661377,4.659999847412109
"Jun 25, 2020",4.869999885559082,4.800000190734863,5.0,4.699999809265137
"Jun 26, 2020",4.630000114440918,4.880000114440918,4.909999847412109,4.559999942779541
"Jun 29, 2020",4.619999885559082,4.659999847412109,4.679999828338623,4.429999828338623
"Jun 30, 2020",4.619999885559082,4.579999923706055,4.739999771118164,4.550000190734863
"Jul 01, 2020",4.869999885559082,4.960000038146973,5.090000152587891,4.829999923706055
"Jul 02, 2020",4.849999904632568,5.0,5.0,4.730000019073486
"Jul 03, 2020",4.800000190734863,4.889999866485596,4.889999866485596,4.760000228881836
"Jul 06, 2020",4.829999923706055,4.849999904632568,4.880000114440918,4.809999942779541
"Jul 07, 2020",4.75,4.800000190734863,4.820000171661377,4.699999809265137
"Jul 08, 2020",5.0,4.78000020980835,5.050000190734863,4.739999771118164
"Jul 09, 2020",4.900000095367432,5.03000020980835,5.059999942779541,4.869999885559082
"Jul 10, 2020",4.909999847412109,5.03000020980835,5.130000114440918,4.789999961853027
"Jul 13, 2020",4.980000019073486,4.96999979019165,5.170000076293945,4.929999828338623
"Jul 14, 2020",4.900000095367432,4.96999979019165,5.0,4.730000019073486
"Jul 15, 2020",4.900000095367432,4.929999828338623,5.0,4.860000133514404
"Jul 16, 2020",4.820000171661377,4.880000114440918,4.889999866485596,4.75
"Jul 17, 2020",5.260000228881836,4.860000133514404,5.320000171661377,4.829999923706055
"Jul 20, 2020",5.239999771118164,5.329999923706055,5.420000076293945,5.199999809265137
"Jul 21, 2020",5.329999923706055,5.329999923706055,5.429999828338623,5.079999923706055
"Jul 22, 2020",5.519999980926514,5.349999904632568,5.760000228881836,5.349999904632568
"Jul 23, 2020",5.21999979019165,5.53000020980835,5.53000020980835,5.210000038146973
"Jul 24, 2020",5.269999980926514,5.170000076293945,5.360000133514404,5.010000228881836
"Jul 27, 2020",5.239999771118164,5.340000152587891,5.429999828338623,5.190000057220459
"Jul 28, 2020",5.119999885559082,5.199999809265137,5.28000020980835,5.090000152587891
"Jul 29, 2020",4.940000057220459,4.880000114440918,5.070000171661377,4.800000190734863
"Jul 30, 2020",4.840000152587891,4.900000095367432,4.929999828338623,4.800000190734863
"Jul 31, 2020",5.369999885559082,4.880000114440918,5.420000076293945,4.849999904632568
"Aug 03, 2020",5.400000095367432,5.380000114440918,5.570000171661377,5.139999866485596
"Aug 04, 2020",5.130000114440918,5.300000190734863,5.480000019073486,5.079999923706055
"Aug 05, 2020",5.059999942779541,5.199999809265137,5.289999961853027,5.019999980926514
"Aug 06, 2020",5.599999904632568,5.070000171661377,5.630000114440918,5.070000171661377
"Aug 07, 2020",5.25,5.489999771118164,5.550000190734863,5.179999828338623
"Aug 10, 2020",5.150000095367432,5.25,5.269999980926514,5.050000190734863
"Aug 11, 2020",5.059999942779541,5.199999809265137,5.289999961853027,5.039999961853027
"Aug 12, 2020",5.03000020980835,5.099999904632568,5.130000114440918,4.940000057220459
"Aug 13, 2020",4.989999771118164,5.050000190734863,5.090000152587891,4.929999828338623
"Aug 14, 2020",4.949999809265137,4.980000019073486,4.989999771118164,4.840000152587891
"Aug 17, 2020",4.800000190734863,4.889999866485596,4.940000057220459,4.71999979019165
"Aug 18, 2020",4.840000152587891,4.869999885559082,4.940000057220459,4.789999961853027
"Aug 19, 2020",4.900000095367432,4.840000152587891,5.0,4.710000038146973
"Aug 20, 2020",4.880000114440918,4.809999942779541,4.940000057220459,4.739999771118164
"Aug 21, 2020",4.940000057220459,4.880000114440918,5.110000133514404,4.849999904632568
"Aug 24, 2020",5.03000020980835,5.0,5.130000114440918,4.980000019073486
"Aug 25, 2020",4.860000133514404,5.070000171661377,5.079999923706055,4.829999923706055
"Aug 26, 2020",4.739999771118164,4.860000133514404,4.909999847412109,4.679999828338623
"Aug 27, 2020",4.650000095367432,4.75,4.769999980926514,4.650000095367432
"Aug 28, 2020",4.659999847412109,4.670000076293945,4.690000057220459,4.610000133514404
"Aug 31, 2020",4.559999942779541,4.630000114440918,4.670000076293945,4.559999942779541
