result,data,num_ativos,lista_ativos,oper_ativos,volatilidade
0.9558974711276896,"Jan 04, 2010","9","['TRPL4', 'MMXM3', 'CCRO3', 'MRVE3', 'LREN3', 'VALE3', 'BRFS3', 'BRKM5', 'DTEX3']","[2.5, 2.0, 2.0, 1.75, 1.5, 1.25, 1.25, 0.75, 0.5]","nan"
0.9710270171878163,"Feb 01, 2010","9","['CMIG4', 'BTOW3', 'ELET3', 'EMBR3', 'VALE3', 'BRAP4', 'USIM3', 'JBSS3', 'CPFE3']","[1.75, 0.375, 0.25, 0.25, 0.0, 0.0, 0.0, 0.0, 0.0]","0.0006853076555948518"
1.0048798207256138,"Mar 01, 2010","9","['DTEX3', 'RSID3', 'LREN3', 'RDCD3', 'CSNA3', 'BBAS3', 'CYRE3', 'GFSA3', 'MMXM3']","[2.0, 1.25, 1.25, 1.0, 0.25, 0.25, 0.25, 0.25, 0.25]","0.0008184423954361834"
0.9393267695779633,"Apr 01, 2010","9","['GGBR4', 'CSNA3', 'VALE3', 'BRAP4', 'EMBR3', 'MMXM3', 'LAME4', 'TRPL4', 'PETR4']","[1.75, 0.625, 0.375, 0.25, 0.25, 0.0, 0.0, 0.0, -0.125]","0.0023445799202879906"
0.9357090759879791,"May 03, 2010","9","['ABEV3', 'GGBR4', 'GOAU4', 'GOLL4', 'DTEX3', 'SBSP3', 'VALE3', 'PETR4', 'PETR3']","[0.25, 0.0, 0.0, 0.0, 0.0, 0.0, -0.125, -0.25, -0.25]","0.00039545665051301143"
1.0024481309799447,"Jun 01, 2010","9","['VALE3', 'BRFS3', 'GFSA3', 'BRAP4', 'MMXM3', 'RSID3', 'JBSS3', 'CSAN3', 'PDGR3']","[1.75, 1.75, 1.75, 1.75, 1.5, 1.5, 1.5, 1.5, 1.0]","0.0018352876541412278"
1.0480319795891004,"Jul 01, 2010","9","['CPFE3', 'TRPL4', 'LIGT3', 'TIMP3', 'KLBN4', 'LAME4', 'PETR3', 'PETR4', 'BRAP4']","[0.5, 0.25, 0.25, 0.25, 0.25, 0.25, 0.0, 0.0, -1.5]","0.0023264719993596156"
0.9883069795425757,"Aug 02, 2010","9","['GGBR4', 'DTEX3', 'CMIG4', 'ABEV3', 'CPFE3', 'BRKM5', 'RSID3', 'ITSA4', 'SBSP3']","[1.25, 1.0, 1.0, 0.25, 0.25, 0.25, 0.25, 0.25, 0.0]","0.0003082296844275661"
1.0516978074761558,"Sep 01, 2010","9","['PETR4', 'PDGR3', 'BTOW3', 'CSAN3', 'RDCD3', 'GGBR4', 'CSNA3', 'GOAU4', 'USIM5']","[0.25, 0.0, -0.25, -0.25, -0.25, -0.25, -0.375, -0.75, -0.875]","0.0007744100705659606"
1.0401212638016788,"Oct 01, 2010","9","['CESP6', 'LREN3', 'PETR4', 'USIM3', 'BRAP4', 'TIMP3', 'CSAN3', 'GOLL4', 'BRKM5']","[1.5, 1.0, 0.75, 0.25, 0.25, 0.25, 0.25, 0.25, 0.25]","0.0002991489860516946"
0.9958234867817787,"Nov 01, 2010","9","['BTOW3', 'PETR3', 'PETR4', 'KLBN4', 'CPFE3', 'TRPL4', 'CESP6', 'MRVE3', 'BRAP4']","[1.75, 1.75, 1.75, 1.5, 1.25, 1.0, 1.0, 1.0, 0.75]","0.003170975233199049"
1.002724818504952,"Dec 01, 2010","9","['ABEV3', 'BTOW3', 'BRKM5', 'TRPL4', 'TIMP3', 'VALE3', 'GOLL4', 'BBAS3', 'BBDC4']","[0.25, 0.25, 0.25, 0.0, 0.0, 0.0, -0.25, -0.25, -0.25]","0.003060123688771664"
0.9135945254630513,"Jan 03, 2011","9","['SANB11', 'RSID3', 'MRVE3', 'MMXM3', 'BBAS3', 'BBDC4', 'BRKM5', 'GFSA3', 'CMIG4']","[1.75, 1.75, 1.75, 1.75, 1.5, 1.5, 1.0, 1.0, 0.75]","0.00023967849270136642"
1.0550380593297983,"Feb 01, 2011","9","['SANB11', 'GOAU4', 'MMXM3', 'GFSA3', 'LREN3', 'TIMP3', 'EMBR3', 'CPFE3', 'ELET6']","[1.625, 1.0, 1.0, 0.625, 0.375, 0.25, 0.25, 0.0, 0.0]","0.00013531314662872053"
1.045505271843548,"Mar 01, 2011","9","['BRFS3', 'PETR3', 'LIGT3', 'DTEX3', 'PETR4', 'KLBN4', 'SBSP3', 'CPLE6', 'TIMP3']","[2.0, 0.625, 0.5, 0.5, 0.25, 0.125, 0.0, 0.0, 0.0]","8.443904227551056e-05"
0.9476384394013058,"Apr 04, 2011","9","['CCRO3', 'BBDC4', 'PETR4', 'VALE3', 'TIMP3', 'ELET6', 'CSAN3', 'ELET3', 'RDCD3']","[1.75, 1.75, 1.25, 1.0, 0.25, 0.25, 0.25, 0.25, 0.25]","6.797686963717334e-05"
0.9955378561960277,"May 02, 2011","9","['CPFE3', 'VALE3', 'BBAS3', 'ITUB4', 'PDGR3', 'TRPL4', 'JBSS3', 'USIM5', 'TIMP3']","[1.75, 1.5, 1.25, 1.25, 1.25, 1.0, 0.625, 0.375, 0.25]","0.0034217811398930546"
0.9754832296572032,"Jun 01, 2011","9","['LREN3', 'ITUB4', 'MMXM3', 'CIEL3', 'GFSA3', 'JBSS3', 'ITSA4', 'BBDC4', 'CPFE3']","[1.75, 1.75, 1.75, 1.75, 1.75, 1.75, 1.75, 1.5, 1.0]","0.00015130178659656998"
0.8862649609322728,"Jul 01, 2011","9","['RDCD3', 'ITUB4', 'SANB11', 'CPFE3', 'TIMP3', 'LREN3', 'GOLL4', 'KLBN4', 'BBAS3']","[3.0, 2.75, 2.0, 1.75, 1.75, 1.75, 1.75, 1.75, 1.75]","6.31723801829384e-05"
0.9571022501721169,"Aug 01, 2011","9","['PETR4', 'JBSS3', 'CPLE6', 'BRKM5', 'BRFS3', 'CPFE3', 'PETR3', 'MMXM3', 'LREN3']","[1.5, 0.75, 0.625, 0.25, 0.25, 0.0, 0.0, 0.0, -0.25]","0.00012910491265778065"
0.8515563650146654,"Sep 01, 2011","9","['CSAN3', 'BBAS3', 'GFSA3', 'HYPE3', 'BBDC4', 'ITUB4', 'CYRE3', 'PDGR3', 'CIEL3']","[2.0, 2.0, 2.0, 1.75, 1.75, 1.75, 1.75, 1.75, 1.5]","0.0003293955651301312"
1.074915553539768,"Oct 03, 2011","9","['ITSA4', 'ITUB4', 'TRPL4', 'EMBR3', 'SBSP3', 'CPLE6', 'LIGT3', 'ELET6', 'BRAP4']","[2.0, 1.75, 0.25, 0.25, 0.0, 0.0, 0.0, 0.0, 0.0]","0.00381369157051434"
1.1631285386566343,"Jun 01, 2016","9","['LAME4', 'ABEV3', 'BRKM5', 'PCAR4', 'LREN3', 'OIBR3', 'CYRE3', 'KLBN11', 'RADL3']","[2.0, 1.5, 1.5, 1.375, 1.0, 1.0, 0.75, 0.25, 0.25]","9.071404204693362e-05"
1.09992182844916,"Jul 01, 2016","9","['MRVE3', 'ITUB4', 'CSAN3', 'ABEV3', 'UGPA3', 'BBDC3', 'BBDC4', 'PETR4', 'CIEL3']","[2.0, 1.75, 1.75, 1.5, 1.25, 1.25, 0.25, 0.25, 0.25]","0.0003554471396301405"
1.0371572755632787,"Aug 01, 2016","9","['WEGE3', 'GGBR4', 'CSNA3', 'BBAS3', 'ENBR3', 'TIMP3', 'BRAP4', 'GOAU4', 'LREN3']","[1.875, 1.125, 1.125, 1.0, 0.75, 0.625, 0.5, 0.5, 0.25]","0.0007022889383527628"
1.0013771135761145,"Sep 01, 2016","9","['VIVT4', 'BRFS3', 'ABEV3', 'KLBN11', 'GOAU4', 'UGPA3', 'HYPE3', 'WEGE3', 'TIMP3']","[2.0, 1.25, 1.0, 0.25, 0.25, 0.0, 0.0, 0.0, 0.0]","0.0001981695814548143"
1.1498744655324382,"Oct 03, 2016","9","['SANB11', 'TIMP3', 'GGBR4', 'ABEV3', 'MULT3', 'BRAP4', 'PETR4', 'BBSE3', 'SBSP3']","[1.5, 1.5, 1.5, 1.25, 1.25, 1.0, 0.25, 0.25, 0.25]","0.000611206308527742"
0.9678214283202583,"Nov 01, 2016","9","['BRAP4', 'PETR4', 'ECOR3', 'UGPA3', 'VALE3', 'LREN3', 'TIMP3', 'BRKM5', 'CSAN3']","[1.125, 1.0, 0.375, 0.25, 0.25, 0.25, 0.25, 0.25, 0.25]","0.0005368683051702437"
0.9394818334415211,"Dec 01, 2016","9","['BBDC4', 'VIVT4', 'CSAN3', 'BBDC3', 'SBSP3', 'PCAR4', 'GOAU4', 'GGBR4', 'CSNA3']","[1.75, 1.75, 1.75, 1.5, 1.5, 1.5, 1.0, 0.5, 0.5]","0.0008176710556774659"
1.0424756721292843,"Jan 02, 2017","9","['KLBN11', 'BBDC4', 'LREN3', 'EMBR3', 'CSNA3', 'ELET3', 'RENT3', 'MULT3', 'MRFG3']","[2.0, 1.75, 1.75, 1.75, 1.75, 1.75, 1.75, 1.75, 1.75]","0.00016248291704864905"
1.0199383119119418,"Feb 01, 2017","9","['BBSE3', 'BBDC4', 'PETR3', 'BBDC3', 'HYPE3', 'ITUB4', 'SBSP3', 'TIMP3', 'ABEV3']","[1.75, 1.0, 1.0, 1.0, 1.0, 0.75, 0.75, 0.75, 0.25]","0.0003644677864790599"
0.9725543277522353,"Mar 01, 2017","9","['BBAS3', 'CMIG4', 'ITSA4', 'ABEV3', 'BRML3', 'BBDC3', 'CCRO3', 'ITUB4', 'BBDC4']","[1.25, 1.25, 1.125, 0.75, 0.75, 0.5, 0.5, 0.25, 0.25]","0.00039057612090531236"
0.9919817399030826,"Apr 03, 2017","9","['MULT3', 'VIVT4', 'BRFS3', 'ENBR3', 'BBDC4', 'PETR4', 'PETR3', 'CCRO3', 'EQTL3']","[2.75, 2.0, 1.5, 1.5, 1.0, 1.0, 1.0, 1.0, 1.0]","0.0002548427859122284"
0.9945659740658555,"Jul 01, 2015","9","['BBDC3', 'ABEV3', 'SANB11', 'KLBN11', 'BRKM5', 'CYRE3', 'VIVT4', 'MULT3', 'MRVE3']","[2.0, 1.75, 1.75, 1.5, 1.5, 1.5, 1.0, 1.0, 1.0]","9.27237115691086e-05"
0.9081796179549433,"Aug 03, 2015","9","['VALE3', 'VIVT4', 'PCAR4', 'BRPR3', 'ENBR3', 'KLBN11', 'CIEL3', 'LAME4', 'BBDC4']","[1.75, 1.75, 1.75, 1.0, 0.375, 0.25, 0.0, 0.0, -0.25]","7.12822134298202e-05"
1.0093542976232246,"Sep 01, 2015","9","['SANB11', 'POMO4', 'CMIG4', 'MRFG3', 'OIBR4', 'CIEL3', 'JBSS3', 'EMBR3', 'VIVT4']","[1.75, 1.5, 0.75, 0.25, 0.25, -0.25, -0.25, -0.25, -0.25]","0.0001326168862839688"
1.0160586803678504,"Oct 01, 2015","9","['BRFS3', 'HYPE3', 'RENT3', 'ABEV3', 'ITSA4', 'BBDC4', 'BBSE3', 'BBDC3', 'SANB11']","[2.0, 1.75, 1.75, 1.25, 1.0, 0.75, 0.75, 0.75, 0.75]","0.00018347344257583692"
1.0370217947569798,"Nov 03, 2015","9","['MRFG3', 'HYPE3', 'POMO4', 'BRKM5', 'BRML3', 'BRPR3', 'PETR4', 'PETR3', 'ITSA4']","[1.5, 1.25, 1.25, 1.0, 0.25, 0.25, 0.0, 0.0, 0.0]","0.0003139197286583907"
0.9430067580740189,"Dec 01, 2015","9","['HYPE3', 'GOAU4', 'SBSP3', 'BBDC3', 'KLBN11', 'SANB11', 'BRML3', 'CPFE3', 'RENT3']","[0.875, 0.75, 0.5, 0.25, 0.25, 0.25, 0.25, 0.25, 0.25]","0.0002395812461657392"
0.8738440889054877,"Jan 04, 2016","9","['CMIG4', 'CSAN3', 'MRFG3', 'SBSP3', 'GOAU4', 'SANB11', 'USIM5', 'JBSS3', 'VALE3']","[1.75, 1.75, 1.75, 1.0, 1.0, 0.75, 0.75, 0.0, 0.0]","0.0002256856870915545"
1.1229087728234033,"Feb 01, 2016","9","['BBDC3', 'CESP6', 'MRFG3', 'VIVT4', 'HYPE3', 'CSAN3', 'SBSP3', 'USIM5', 'CSNA3']","[1.75, 1.5, 1.5, 1.0, 1.0, 1.0, 0.75, 0.375, 0.0]","0.0002471787561895226"
1.1558092532271587,"Mar 01, 2016","9","['ITSA4', 'BBAS3', 'BRKM5', 'PETR3', 'UGPA3', 'BRFS3', 'LAME4', 'TIMP3', 'ITUB4']","[2.0, 1.75, 1.75, 1.25, 0.75, 0.5, 0.5, 0.5, 0.25]","0.00016925817864430016"
1.0276678765892397,"Apr 01, 2016","9","['UGPA3', 'QUAL3', 'CSAN3', 'OIBR3', 'ABEV3', 'RADL3', 'GGBR4', 'BBDC4', 'PETR4']","[1.25, 1.25, 0.75, 0.75, 0.375, 0.375, 0.375, 0.25, 0.25]","0.0004389999440585176"
0.8797297069208776,"May 02, 2016","9","['BRKM5', 'LAME4', 'CPFE3', 'ELET3', 'ENBR3', 'PETR3', 'PETR4', 'ITSA4', 'VALE3']","[2.0, 1.75, 1.75, 1.25, 1.0, 0.625, 0.25, 0.25, 0.25]","0.0003448523856809603"
1.016884079829534,"Nov 01, 2011","9","['LREN3', 'LAME4', 'CYRE3', 'USIM3', 'MRFG3', 'VALE3', 'PDGR3', 'CPLE6', 'BRAP4']","[2.0, 2.0, 1.875, 1.75, 1.75, 1.75, 1.75, 1.5, 1.5]","0.0003449810780485967"
1.0017266937878997,"Dec 01, 2011","7","['HYPE3', 'MRVE3', 'TRPL4', 'USIM5', 'CPFE3', 'USIM3', 'BRAP4']","[1.75, 1.75, 1.5, 1.0, 0.25, 0.125, -0.5]","0.006295409921406224"
1.0600126641043117,"Jan 02, 2012","9","['EMBR3', 'MMXM3', 'CPFE3', 'CPLE6', 'BRAP4', 'VALE3', 'USIM5', 'ABEV3', 'ELET6']","[2.0, 1.5, 1.0, 1.0, 1.0, 1.0, 1.0, 0.875, 0.75]","0.00020511428557217854"
1.0597324162587054,"Feb 01, 2012","9","['CPFE3', 'HGTX3', 'BRKM5', 'CCRO3', 'PCAR4', 'LREN3', 'PDGR3', 'BRML3', 'CSNA3']","[1.75, 1.25, 1.125, 1.0, 0.75, 0.75, 0.75, 0.5, 0.5]","0.00015340559695443354"
0.9525294765165137,"Mar 01, 2012","9","['BBAS3', 'TRPL4', 'CESP6', 'BTOW3', 'CSAN3', 'ELET3', 'GOLL4', 'CCRO3', 'SANB11']","[1.75, 0.25, 0.25, 0.25, 0.25, 0.25, 0.25, 0.25, 0.25]","0.004069312471275622"
1.0123040264087324,"Apr 02, 2012","9","['LAME4', 'CCRO3', 'PCAR4', 'ABEV3', 'PETR4', 'UGPA3', 'VIVT4', 'HYPE3', 'SBSP3']","[1.5, 1.0, 0.75, 0.75, 0.75, 0.25, 0.25, 0.25, 0.125]","0.0002674671335801361"
0.7947021763661883,"May 02, 2012","9","['HGTX3', 'CPFE3', 'CSAN3', 'LAME4', 'RSID3', 'MMXM3', 'JBSS3', 'TESA3', 'USIM3']","[1.75, 1.75, 1.75, 1.75, 1.75, 1.75, 1.75, 1.75, 1.5]","0.0001785046419154494"
1.052022157037687,"Jun 01, 2012","9","['GOAU4', 'BBDC4', 'GGBR4', 'GOLL4', 'RSID3', 'MRVE3', 'GFSA3', 'SANB11', 'CSNA3']","[1.75, 1.5, 1.25, 0.75, 0.625, 0.625, 0.625, 0.5, 0.25]","0.00048101993144674104"
1.0253818186424062,"Jul 02, 2012","9","['ABEV3', 'OIBR3', 'UGPA3', 'LIGT3', 'BRAP4', 'RDCD3', 'VALE3', 'VIVT4', 'CSAN3']","[2.0, 0.5, 0.25, 0.25, 0.25, 0.25, 0.25, 0.0, 0.0]","0.00010913018995113237"
1.0493337416941895,"Aug 01, 2012","8","['KLBN4', 'BBAS3', 'UGPA3', 'USIM3', 'GOAU4', 'BRFS3', 'BTOW3', 'BRKM5']","[2.0, 2.0, 1.875, 1.75, 1.75, 1.75, 1.75, 1.75]","0.00011147302416214986"
1.0649677469974559,"Sep 03, 2012","9","['LAME4', 'MRVE3', 'PCAR4', 'GFSA3', 'MRFG3', 'USIM3', 'LREN3', 'RENT3', 'BRML3']","[2.0, 1.25, 0.75, 0.5, 0.375, 0.25, 0.25, 0.25, 0.25]","0.0002554569384343886"
0.9626693583280274,"May 02, 2017","9","['BBAS3', 'UGPA3', 'VIVT4', 'BRKM5', 'BBDC4', 'BBDC3', 'BRAP4', 'GOAU4', 'WEGE3']","[1.75, 1.75, 1.75, 1.75, 1.5, 1.5, 1.5, 1.5, 1.25]","0.0003404686851588466"
1.0021900106950985,"Jun 01, 2017","9","['TIMP3', 'ENBR3', 'CPFE3', 'EQTL3', 'QUAL3', 'KLBN11', 'UGPA3', 'ABEV3', 'PETR4']","[1.75, 1.5, 1.125, 1.0, 1.0, 0.75, 0.25, 0.0, 0.0]","9.19235334968568e-05"
1.0610196195860808,"Jul 03, 2017","9","['GGBR4', 'ITUB4', 'ITSA4', 'BRAP4', 'ELET6', 'BRKM5', 'CYRE3', 'BRML3', 'CSAN3']","[2.0, 1.75, 1.75, 1.75, 1.75, 1.5, 1.5, 1.0, 1.0]","0.0003246896861876307"
1.0548175766047319,"Aug 01, 2017","9","['BBSE3', 'RENT3', 'MULT3', 'BBDC4', 'ABEV3', 'PETR4', 'PETR3', 'ITSA4', 'LREN3']","[2.0, 0.625, 0.375, 0.25, 0.25, 0.25, 0.25, 0.25, 0.25]","0.0001109798014726308"
1.0258082243855933,"Sep 01, 2017","9","['CCRO3', 'ECOR3', 'SBSP3', 'BRKM5', 'RENT3', 'ABEV3', 'CPFE3', 'PETR4', 'VALE3']","[2.25, 1.75, 1.5, 1.5, 1.5, 1.125, 1.125, 0.5, 0.5]","0.00014136973550959487"
1.0445047980492617,"Oct 02, 2017","9","['BBAS3', 'MRFG3', 'PETR4', 'PETR3', 'BRKM5', 'BBSE3', 'EQTL3', 'WEGE3', 'SANB11']","[0.75, 0.375, 0.25, 0.25, 0.25, 0.0, 0.0, 0.0, 0.0]","0.00012589454242073163"
0.9575293252406771,"Nov 01, 2017","9","['BRAP4', 'EQTL3', 'PETR4', 'VALE3', 'ABEV3', 'ELET3', 'PETR3', 'UGPA3', 'BRML3']","[2.0, 1.75, 1.25, 1.25, 1.0, 0.75, 0.625, 0.25, 0.25]","0.00016632315264752815"
1.0751296219956532,"Dec 01, 2017","9","['ECOR3', 'SANB11', 'RADL3', 'ITSA4', 'BRFS3', 'WEGE3', 'JBSS3', 'MRFG3', 'CYRE3']","[2.0, 1.25, 1.125, 0.25, 0.25, 0.25, 0.25, 0.25, 0.25]","0.00011258966195688983"
1.0750203893288393,"Jan 02, 2018","9","['BBDC4', 'PETR3', 'BBDC3', 'EQTL3', 'ENBR3', 'IGTA3', 'PCAR4', 'BRFS3', 'CCRO3']","[2.0, 2.0, 2.0, 2.0, 1.75, 1.5, 1.25, 1.0, 1.0]","0.00014293175527287398"
1.011353744796485,"Feb 01, 2018","9","['PETR4', 'PETR3', 'CSAN3', 'CYRE3', 'CPLE6', 'MGLU3', 'LREN3', 'BRKM5', 'MULT3']","[1.0, 1.0, 1.0, 1.0, 1.0, 0.625, 0.25, 0.25, 0.25]","0.00023639293165295529"
0.9788456221004471,"Mar 01, 2018","9","['BRKM5', 'CPFE3', 'LREN3', 'MULT3', 'ELET6', 'EQTL3', 'PETR4', 'PETR3', 'USIM5']","[1.5, 1.125, 1.0, 1.0, 1.0, 0.75, 0.625, 0.5, 0.5]","0.0002757100074522076"
0.986627430639416,"Oct 01, 2012","9","['SBSP3', 'CSAN3', 'UGPA3', 'OIBR3', 'DTEX3', 'LAME4', 'GOLL4', 'MRFG3', 'JBSS3']","[1.75, 0.375, 0.25, 0.25, 0.25, 0.25, 0.25, 0.25, 0.25]","0.00023579317169534185"
1.0425804172951048,"Nov 01, 2012","9","['VALE3', 'BRAP4', 'ITUB4', 'ITSA4', 'DASA3', 'BBDC4', 'CPLE6', 'USIM3', 'CPFE3']","[3.75, 2.75, 1.5, 1.5, 1.0, 1.0, 0.75, 0.75, 0.25]","0.0001742906179259888"
1.0239582592362662,"Dec 03, 2012","9","['VALE3', 'BRKM5', 'RENT3', 'PCAR4', 'BRML3', 'KLBN4', 'SANB11', 'TIMP3', 'CYRE3']","[1.75, 1.5, 0.25, 0.0, 0.0, 0.0, 0.0, 0.0, 0.0]","0.00015255270511076128"
1.019050547995329,"Dec 28, 2012","9","['ELET6', 'TRPL4', 'USIM3', 'MRFG3', 'BRFS3', 'MRVE3', 'USIM5', 'UGPA3', 'BBAS3']","[2.25, 2.0, 1.75, 1.5, 1.375, 1.25, 1.25, 1.0, 1.0]","0.002623318600162706"
0.9677496109403521,"Feb 01, 2013","9","['TRPL4', 'UGPA3', 'LREN3', 'PETR3', 'PETR4', 'SBSP3', 'ABEV3', 'ELET3', 'MRFG3']","[1.75, 1.25, 1.0, 0.75, 0.75, 0.25, 0.25, 0.25, 0.25]","0.0018836228531795337"
0.9735737858063324,"Mar 01, 2013","9","['TRPL4', 'BRKM5', 'CMIG4', 'CYRE3', 'VIVT4', 'ELET6', 'TIMP3', 'PDGR3', 'CIEL3']","[2.0, 2.0, 1.75, 1.75, 1.5, 1.5, 1.5, 1.5, 0.5]","0.0023861043936609172"
1.00788185453813,"Mar 28, 2013","9","['BRFS3', 'TIMP3', 'BBAS3', 'EMBR3', 'UGPA3', 'VIVT4', 'USIM3', 'CMIG4', 'SANB11']","[2.0, 2.0, 1.25, 0.25, 0.0, 0.0, 0.0, 0.0, 0.0]","0.00011231374934812306"
0.9171919342414006,"May 02, 2013","9","['GOLL4', 'PETR3', 'MRVE3', 'VALE3', 'BRAP4', 'UGPA3', 'RENT3', 'BRML3', 'RSID3']","[1.75, 1.75, 1.75, 1.5, 1.0, 0.5, 0.0, 0.0, 0.0]","0.0001479114855408128"
0.917588980876768,"Jun 03, 2013","9","['CIEL3', 'ELET6', 'TIMP3', 'CSNA3', 'BBDC4', 'ITUB4', 'USIM5', 'GGBR4', 'UGPA3']","[2.0, 1.75, 1.75, 0.625, 0.25, 0.25, 0.0, -0.25, -1.0]","4.210930913235415e-05"
0.9932790828974584,"Jul 01, 2013","9","['RENT3', 'BRPR3', 'MRFG3', 'CIEL3', 'MMXM3', 'BRFS3', 'BRKM5', 'LREN3', 'EMBR3']","[1.75, 1.75, 1.75, 1.5, 1.5, 1.0, 1.0, 0.75, 0.25]","4.854560055073844e-05"
1.0879964317928938,"Aug 01, 2013","9","['SANB11', 'PETR4', 'USIM3', 'BBDC4', 'CSNA3', 'USIM5', 'CCRO3', 'KLBN4', 'PETR3']","[2.0, 2.0, 1.75, 1.75, 1.75, 1.75, 1.375, 1.25, 1.25]","0.000311731613990652"
0.9985229729639987,"Apr 02, 2018","9","['TAEE11', 'MRFG3', 'BRML3', 'CYRE3', 'BBSE3', 'EMBR3', 'IGTA3', 'CPFE3', 'ABEV3']","[3.0, 1.75, 1.5, 1.5, 1.0, 1.0, 1.0, 0.875, 0.25]","6.26851169589786e-05"
0.8656495238017529,"May 02, 2018","9","['SMLS3', 'ENBR3', 'BRFS3', 'CIEL3', 'QUAL3', 'BBDC4', 'ITSA4', 'BBDC3', 'CSAN3']","[3.0, 2.0, 1.75, 1.75, 1.75, 1.5, 1.5, 1.5, 1.5]","0.00011082730905878131"
0.9521118091494962,"Jun 01, 2018","9","['MRFG3', 'BRAP4', 'BBDC3', 'JBSS3', 'GGBR4', 'ENBR3', 'ITSA4', 'BRFS3', 'CIEL3']","[1.25, 0.75, 0.375, 0.25, 0.0, 0.0, -0.25, -0.25, -0.25]","0.00010560549654875172"
1.0897663862836247,"Jul 02, 2018","9","['FLRY3', 'BTOW3', 'ENBR3', 'ITUB4', 'BBDC4', 'ITSA4', 'BBDC3', 'CVCB3', 'WEGE3']","[2.0, 2.0, 2.0, 1.75, 1.75, 1.75, 1.75, 1.75, 1.5]","0.00017428800663322783"
0.9782119430941938,"Aug 01, 2018","9","['SUZB3', 'CVCB3', 'GGBR4', 'SANB11', 'VALE3', 'BBDC4', 'PETR4', 'PETR3', 'B3SA3']","[1.75, 1.75, 0.75, 0.375, 0.25, 0.25, 0.25, 0.25, 0.25]","0.0003451218721657227"
1.0346504311095326,"Sep 03, 2018","9","['EMBR3', 'KLBN11', 'JBSS3', 'PETR4', 'BBSE3', 'BBDC3', 'BRFS3', 'PETR3', 'MULT3']","[2.5, 2.25, 2.0, 1.75, 1.75, 1.75, 1.75, 1.5, 1.5]","0.00010715410457478939"
1.1539976613121905,"Oct 01, 2018","9","['BBDC4', 'ITSA4', 'EMBR3', 'BBDC3', 'JBSS3', 'BTOW3', 'ITUB4', 'B3SA3', 'RENT3']","[2.0, 1.75, 1.75, 1.75, 1.75, 1.75, 1.25, 1.25, 1.25]","0.0002463440036478724"
0.9974002174143306,"Nov 01, 2018","9","['LAME4', 'GGBR4', 'GOAU4', 'RAIL3', 'PETR4', 'PETR3', 'CMIG4', 'QUAL3', 'B3SA3']","[2.0, 1.75, 1.75, 1.0, 0.75, 0.75, 0.75, 0.5, 0.25]","0.0002982104004010505"
0.96654773478634,"Dec 03, 2018","9","['ABEV3', 'TIMP3', 'PETR3', 'MRVE3', 'CPFE3', 'FLRY3', 'EQTL3', 'EGIE3', 'SBSP3']","[2.0, 2.0, 1.75, 1.75, 1.75, 1.5, 1.25, 1.125, 1.0]","0.00012124578305335406"
1.115646732666927,"Dec 28, 2018","8","['RENT3', 'BRAP4', 'LREN3', 'RAIL3', 'BRKM5', 'MGLU3', 'SBSP3', 'CVCB3']","[1.75, 1.5, 1.25, 1.0, 0.875, 0.625, 0.25, 0.25]","0.0001926235584435569"
0.9759492523423137,"Feb 01, 2019","9","['VIVT4', 'EGIE3', 'CCRO3', 'SBSP3', 'CPLE6', 'UGPA3', 'B3SA3', 'ITSA4', 'PETR4']","[1.75, 1.25, 1.125, 1.0, 1.0, 0.875, 0.75, 0.75, 0.25]","0.0002921898331418329"
0.9450555253671092,"Mar 01, 2019","9","['BTOW3', 'CMIG4', 'CIEL3', 'CCRO3', 'GOAU4', 'RADL3', 'SBSP3', 'RENT3', 'CSAN3']","[2.5, 2.0, 1.75, 1.5, 1.25, 1.0, 1.0, 0.25, 0.25]","0.00019533569707413172"
1.0092458187853124,"Apr 01, 2019","9","['BRFS3', 'SUZB3', 'SANB11', 'BRKM5', 'EGIE3', 'UGPA3', 'WEGE3', 'BBDC4', 'BBDC3']","[2.0, 1.5, 0.75, 0.75, 0.75, 0.5, 0.5, 0.0, 0.0]","0.00015421139480882703"
1.0278096756755917,"May 02, 2019","9","['RENT3', 'LREN3', 'PETR4', 'LAME4', 'ITUB4', 'SBSP3', 'HYPE3', 'BBDC4', 'BBDC3']","[2.375, 2.0, 1.75, 1.75, 1.5, 1.25, 1.125, 1.0, 1.0]","0.0003726091746137796"
1.0565882911890578,"Jun 03, 2019","9","['CVCB3', 'VVAR3', 'GGBR4', 'SBSP3', 'MRVE3', 'PETR3', 'RADL3', 'TIMP3', 'CCRO3']","[1.75, 1.75, 1.5, 1.5, 1.125, 1.0, 1.0, 1.0, 0.375]","0.00012946423882689642"
0.9615633813977894,"Jul 01, 2019","9","['PCAR4', 'TAEE11', 'ITSA4', 'ITUB4', 'VALE3', 'BBDC4', 'PETR4', 'PETR3', 'B3SA3']","[1.75, 1.25, 0.5, 0.25, 0.25, 0.25, 0.25, 0.25, 0.25]","0.0002662193403626273"
0.9651176807149271,"Aug 01, 2019","9","['PCAR4', 'MRVE3', 'ECOR3', 'RADL3', 'GOLL4', 'ABEV3', 'EGIE3', 'BBSE3', 'CSAN3']","[2.0, 2.0, 2.0, 1.5, 1.25, 1.125, 1.125, 1.0, 0.75]","0.000296938330197738"
1.029777734976892,"Sep 02, 2019","9","['PETR4', 'PETR3', 'TIMP3', 'RADL3', 'JBSS3', 'HYPE3', 'BTOW3', 'CCRO3', 'ELET3']","[1.75, 1.75, 1.75, 1.25, 1.0, 1.0, 0.75, 0.25, 0.25]","0.0003056155897026453"
0.9953385890599786,"Oct 01, 2019","9","['SANB11', 'BBDC4', 'BRFS3', 'BRML3', 'LREN3', 'CSNA3', 'GOLL4', 'GOAU4', 'JBSS3']","[1.75, 1.25, 1.25, 1.25, 1.0, 1.0, 1.0, 1.0, 0.75]","0.000302231144588768"
0.9964810877346115,"Nov 01, 2019","9","['EGIE3', 'MRVE3', 'EQTL3', 'CCRO3', 'ELET6', 'B3SA3', 'SBSP3', 'IRBR3', 'BRML3']","[2.0, 1.75, 1.5, 1.0, 0.5, 0.25, 0.25, 0.25, 0.25]","0.0004067644335298431"
1.0702035576333992,"Sep 02, 2013","9","['CCRO3', 'CIEL3', 'MRVE3', 'USIM5', 'BTOW3', 'JBSS3', 'RSID3', 'GFSA3', 'LREN3']","[1.75, 0.25, 0.25, 0.25, 0.0, 0.0, 0.0, 0.0, -0.25]","0.00029493978669415706"
1.0244483827750095,"Oct 01, 2013","9","['CPLE6', 'LIGT3', 'USIM3', 'CSAN3', 'ELET3', 'TRPL4', 'ENBR3', 'TIMP3', 'RSID3']","[1.75, 1.75, 1.75, 1.25, 0.375, 0.25, 0.25, 0.25, 0.25]","0.0001916150312992453"
0.9822354475718289,"Nov 01, 2013","9","['CSAN3', 'ITUB4', 'LREN3', 'UGPA3', 'RENT3', 'LIGT3', 'BRAP4', 'DTEX3', 'BRKM5']","[2.0, 0.5, 0.25, 0.25, 0.25, 0.25, 0.25, 0.25, 0.25]","7.645671117059834e-05"
1.0118427378572188,"Dec 02, 2013","9","['CIEL3', 'CMIG4', 'MMXM3', 'CCRO3', 'ABEV3', 'BRKM5', 'EMBR3', 'JBSS3', 'GFSA3']","[1.0, 1.0, 1.0, 0.5, 0.25, 0.25, 0.25, 0.25, 0.25]","6.750905514558307e-05"
0.917552992811808,"Jan 02, 2014","9","['SBSP3', 'JBSS3', 'BBDC3', 'VALE3', 'MRFG3', 'PDGR3', 'MMXM3', 'BRKM5', 'BRPR3']","[2.375, 2.0, 1.75, 1.5, 1.5, 1.25, 1.25, 1.0, 1.0]","0.00024117791520768123"
0.9643902014854865,"Feb 03, 2014","9","['USIM5', 'BRAP4', 'CSNA3', 'BTOW3', 'BRML3', 'HYPE3', 'LIGT3', 'DASA3', 'CMIG4']","[1.75, 1.75, 1.125, 1.0, 0.625, 0.625, 0.5, 0.25, 0.0]","0.00024929850079782824"
1.066104669834774,"Mar 05, 2014","9","['CMIG4', 'BBDC3', 'MRFG3', 'ABEV3', 'GGBR4', 'GOAU4', 'BBDC4', 'BRML3', 'PCAR4']","[1.75, 1.75, 1.5, 1.25, 0.75, 0.75, 0.25, 0.25, 0.25]","0.00014395489214090245"
0.9689479429667944,"Apr 01, 2014","9","['JBSS3', 'RENT3', 'UGPA3', 'PDGR3', 'MRVE3', 'DASA3', 'EMBR3', 'BRML3', 'CSAN3']","[2.0, 2.0, 1.875, 1.75, 1.5, 1.5, 1.5, 1.25, 1.0]","7.426370107005467e-05"
0.9792755097186754,"May 02, 2014","9","['PETR3', 'BRML3', 'CESP6', 'OIBR4', 'CSAN3', 'PETR4', 'BBDC4', 'ITSA4', 'CCRO3']","[0.75, 0.75, 0.75, 0.625, 0.5, 0.25, 0.25, 0.25, 0.25]","0.0002491327940582095"
1.019534457982353,"Jun 02, 2014","9","['SANB11', 'USIM5', 'DTEX3', 'USIM3', 'CIEL3', 'HYPE3', 'SBSP3', 'CSNA3', 'PDGR3']","[1.0, 0.75, 0.75, 0.625, 0.25, 0.25, 0.25, 0.0, 0.0]","0.00022370770000023355"
0.9996292751647914,"Jul 01, 2014","9","['CESP6', 'CPLE6', 'BRAP4', 'CYRE3', 'PCAR4', 'RSID3', 'CIEL3', 'JBSS3', 'BBSE3']","[1.75, 1.5, 1.25, 1.25, 1.0, 1.0, 0.875, 0.75, 0.25]","9.103044062906797e-05"
1.0540658481534027,"Aug 01, 2014","9","['VIVT4', 'ECOR3', 'MMXM3', 'RSID3', 'BBDC4', 'UGPA3', 'BBDC3', 'EGIE3', 'MRVE3']","[2.25, 0.75, 0.75, 0.375, 0.25, 0.25, 0.25, 0.25, 0.25]","0.00024001295701968041"
0.8987016944637182,"Sep 01, 2014","9","['USIM5', 'ABEV3', 'HYPE3', 'BRPR3', 'CYRE3', 'SANB11', 'BRAP4', 'RENT3', 'MRVE3']","[2.25, 2.0, 2.0, 2.0, 2.0, 1.25, 0.625, 0.5, 0.375]","0.00014515304316479582"
0.9696300920211826,"Oct 01, 2014","9","['LREN3', 'EVEN3', 'EMBR3', 'SANB11', 'OIBR4', 'BRKM5', 'ABEV3', 'KLBN11', 'PETR4']","[1.75, 0.75, 0.25, 0.25, 0.25, 0.25, 0.0, 0.0, -0.25]","nan"
1.1022591635268264,"Nov 03, 2014","9","['GOLL4', 'BBSE3', 'QUAL3', 'MMXM3', 'ITUB4', 'PETR4', 'BBDC4', 'PETR3', 'ITSA4']","[1.75, 1.5, 1.5, 0.75, -0.25, -0.25, -0.25, -0.25, -0.25]","0.00023695500965074197"
0.9452984652962434,"Dec 01, 2014","9","['HYPE3', 'ENBR3', 'BRPR3', 'PETR4', 'VALE3', 'CMIG4', 'ELET3', 'CIEL3', 'UGPA3']","[2.0, 2.0, 1.5, 1.0, 1.0, 1.0, 1.0, 0.75, 0.75]","0.00022369313295393246"
0.9017625735241167,"Jan 02, 2015","9","['QUAL3', 'PETR4', 'SANB11', 'CYRE3', 'MRVE3', 'EVEN3', 'GFSA3', 'ITUB4', 'PETR3']","[2.0, 1.75, 1.75, 1.75, 1.75, 1.75, 1.75, 1.5, 1.5]","0.0002321000582513533"
1.1012608290148935,"Feb 02, 2015","9","['UGPA3', 'USIM5', 'CIEL3', 'JBSS3', 'EMBR3', 'CYRE3', 'OIBR4', 'ITUB4', 'QUAL3']","[0.75, 0.625, 0.0, 0.0, 0.0, 0.0, 0.0, -0.25, -0.25]","4.3955618498359043e-05"
0.942578654139975,"Mar 02, 2015","9","['BRAP4', 'CSNA3', 'RSID3', 'QUAL3', 'RENT3', 'VALE3', 'PETR3', 'VIVT4', 'CMIG4']","[1.75, 1.25, 1.25, 1.0, 1.0, 0.25, 0.25, 0.25, 0.25]","0.0003470079664867531"
1.0692749913615374,"Apr 01, 2015","9","['BBSE3', 'CMIG4', 'LIGT3', 'BRML3', 'KLBN11', 'BRPR3', 'CYRE3', 'ELET3', 'GFSA3']","[2.0, 2.0, 2.0, 1.75, 1.75, 1.0, 0.75, 0.75, 0.5]","0.00032255223188422735"
0.9534325042552638,"May 04, 2015","9","['PCAR4', 'CIEL3', 'KLBN11', 'SANB11', 'OIBR4', 'USIM5', 'TIMP3', 'BBAS3', 'ENBR3']","[2.0, 1.75, 1.25, 1.25, 1.0, 0.75, 0.625, 0.5, 0.375]","0.00023218088659388025"
1.0091614110884093,"Jun 01, 2015","9","['CCRO3', 'EMBR3', 'HYPE3', 'BRFS3', 'PETR3', 'CMIG4', 'TIMP3', 'LAME4', 'KLBN11']","[1.75, 0.25, 0.25, 0.0, 0.0, 0.0, 0.0, 0.0, 0.0]","6.054937657801055e-05"