Date,Price,Open,High,Low
"Jun 03, 2019",45.29999923706055,45.68000030517578,45.849998474121094,44.81999969482422
"Jun 04, 2019",45.31999969482422,45.25,45.7400016784668,44.779998779296875
"Jun 05, 2019",44.349998474121094,45.38999938964844,45.47999954223633,44.290000915527344
"Jun 06, 2019",44.72999954223633,45.0,45.06999969482422,44.34000015258789
"Jun 07, 2019",45.099998474121094,44.43000030517578,45.279998779296875,44.43000030517578
"Jun 10, 2019",44.20000076293945,44.97999954223633,44.97999954223633,43.88999938964844
"Jun 11, 2019",44.40999984741211,44.38999938964844,44.72999954223633,44.099998474121094
"Jun 12, 2019",44.11000061035156,44.130001068115234,45.16999816894531,43.79999923706055
"Jun 13, 2019",43.52000045776367,44.40999984741211,44.40999984741211,43.45000076293945
"Jun 14, 2019",43.380001068115234,43.5099983215332,43.65999984741211,42.900001525878906
"Jun 17, 2019",43.34000015258789,43.29999923706055,43.93000030517578,43.0099983215332
"Jun 18, 2019",44.16999816894531,43.540000915527344,44.470001220703125,43.29999923706055
"Jun 19, 2019",44.599998474121094,44.400001525878906,44.880001068115234,43.97999954223633
"Jun 21, 2019",45.70000076293945,44.900001525878906,45.939998626708984,44.79999923706055
"Jun 24, 2019",45.88999938964844,45.790000915527344,46.689998626708984,45.45000076293945
"Jun 25, 2019",45.15999984741211,45.900001525878906,46.08000183105469,45.040000915527344
"Jun 26, 2019",45.75,45.650001525878906,45.900001525878906,45.290000915527344
"Jun 27, 2019",45.58000183105469,45.400001525878906,45.93000030517578,44.66999816894531
"Jun 28, 2019",45.459999084472656,46.08000183105469,46.2400016784668,45.459999084472656
"Jul 01, 2019",45.720001220703125,46.369998931884766,46.45000076293945,45.720001220703125
"Jul 02, 2019",45.959999084472656,46.13999938964844,46.380001068115234,45.40999984741211
"Jul 03, 2019",46.5,45.58000183105469,47.25,45.58000183105469
"Jul 04, 2019",47.68000030517578,47.2599983215332,48.18000030517578,46.88999938964844
"Jul 05, 2019",47.40999984741211,47.279998779296875,48.04999923706055,47.279998779296875
"Jul 08, 2019",46.52000045776367,47.40999984741211,47.41999816894531,46.43000030517578
"Jul 10, 2019",46.59000015258789,46.86000061035156,47.599998474121094,46.540000915527344
"Jul 11, 2019",46.5,46.689998626708984,46.88999938964844,46.11000061035156
"Jul 12, 2019",46.04999923706055,46.84000015258789,47.02000045776367,45.939998626708984
"Jul 15, 2019",46.279998779296875,46.400001525878906,46.52000045776367,45.79999923706055
"Jul 16, 2019",46.369998931884766,46.400001525878906,46.83000183105469,46.11000061035156
"Jul 17, 2019",46.79999923706055,46.470001220703125,47.4900016784668,46.470001220703125
"Jul 18, 2019",48.0,47.0099983215332,48.13999938964844,46.9900016784668
"Jul 19, 2019",46.65999984741211,47.560001373291016,48.36000061035156,46.65999984741211
"Jul 22, 2019",46.66999816894531,47.130001068115234,47.70000076293945,46.369998931884766
"Jul 23, 2019",46.43000030517578,47.25,47.790000915527344,46.43000030517578
"Jul 24, 2019",45.93000030517578,46.779998779296875,47.08000183105469,45.70000076293945
"Jul 25, 2019",45.0,46.040000915527344,46.31999969482422,44.70000076293945
"Jul 26, 2019",45.5,45.0,45.650001525878906,44.779998779296875
"Jul 29, 2019",45.150001525878906,45.060001373291016,45.369998931884766,44.79999923706055
"Jul 30, 2019",43.75,45.0,45.08000183105469,43.75
"Jul 31, 2019",42.849998474121094,44.099998474121094,44.11000061035156,42.849998474121094
"Aug 01, 2019",42.7599983215332,42.70000076293945,44.150001525878906,42.52000045776367
"Aug 02, 2019",42.4900016784668,42.650001525878906,42.90999984741211,42.0099983215332
"Aug 05, 2019",41.880001068115234,42.0,42.0099983215332,41.27000045776367
"Aug 06, 2019",42.279998779296875,42.11000061035156,42.81999969482422,41.810001373291016
"Aug 07, 2019",43.4900016784668,42.2599983215332,43.56999969482422,41.970001220703125
"Aug 08, 2019",44.689998626708984,43.75,45.09000015258789,43.70000076293945
"Aug 09, 2019",44.130001068115234,44.40999984741211,44.63999938964844,43.79999923706055
"Aug 12, 2019",43.459999084472656,43.279998779296875,43.66999816894531,42.47999954223633
"Aug 13, 2019",43.63999938964844,43.0,44.150001525878906,42.95000076293945
"Aug 14, 2019",42.33000183105469,43.0099983215332,43.43000030517578,41.84000015258789
"Aug 15, 2019",42.400001525878906,42.70000076293945,42.959999084472656,42.130001068115234
"Aug 16, 2019",42.650001525878906,42.40999984741211,43.119998931884766,42.119998931884766
"Aug 19, 2019",42.33000183105469,42.900001525878906,43.29999923706055,41.65999984741211
"Aug 20, 2019",41.75,42.61000061035156,42.619998931884766,41.43000030517578
"Aug 21, 2019",42.189998626708984,42.630001068115234,42.810001373291016,41.86000061035156
"Aug 22, 2019",41.66999816894531,42.38999938964844,42.5099983215332,41.66999816894531
"Aug 23, 2019",41.029998779296875,41.08000183105469,42.11000061035156,40.54999923706055
"Aug 26, 2019",40.66999816894531,41.20000076293945,41.459999084472656,40.619998931884766
"Aug 27, 2019",40.81999969482422,40.900001525878906,41.36000061035156,40.349998474121094
"Aug 28, 2019",41.25,40.400001525878906,41.630001068115234,40.380001068115234
"Aug 29, 2019",42.470001220703125,41.5099983215332,42.65999984741211,41.5
"Aug 30, 2019",42.5099983215332,42.95000076293945,42.95000076293945,42.220001220703125
"Sep 02, 2019",42.0099983215332,42.5,42.790000915527344,42.0099983215332
"Sep 03, 2019",41.11000061035156,42.0099983215332,42.47999954223633,41.11000061035156
"Sep 04, 2019",41.790000915527344,41.900001525878906,41.970001220703125,41.18000030517578
"Sep 05, 2019",42.970001220703125,42.0,43.45000076293945,42.0
"Sep 06, 2019",44.0,43.31999969482422,44.470001220703125,43.16999816894531
"Sep 09, 2019",44.689998626708984,44.099998474121094,45.25,44.099998474121094
"Sep 10, 2019",44.880001068115234,44.900001525878906,45.36000061035156,44.459999084472656
"Sep 11, 2019",44.22999954223633,44.880001068115234,45.25,44.220001220703125
"Sep 12, 2019",44.599998474121094,44.61000061035156,45.029998779296875,44.029998779296875
"Sep 13, 2019",45.20000076293945,44.650001525878906,45.70000076293945,44.189998626708984
"Sep 16, 2019",44.47999954223633,44.93000030517578,45.040000915527344,44.02000045776367
"Sep 17, 2019",45.08000183105469,44.02000045776367,45.08000183105469,44.02000045776367
"Sep 18, 2019",44.70000076293945,44.79999923706055,45.15999984741211,44.33000183105469
"Sep 19, 2019",44.290000915527344,44.75,45.619998931884766,44.290000915527344
"Sep 20, 2019",44.29999923706055,44.31999969482422,44.84000015258789,43.970001220703125
"Sep 23, 2019",43.90999984741211,44.0,44.18000030517578,43.290000915527344
"Sep 24, 2019",44.0,43.77000045776367,44.5,43.31999969482422
"Sep 25, 2019",44.560001373291016,43.9900016784668,44.66999816894531,43.560001373291016
"Sep 26, 2019",45.0,44.65999984741211,45.369998931884766,44.25
"Sep 27, 2019",45.83000183105469,44.79999923706055,46.400001525878906,44.79999923706055
"Sep 30, 2019",45.459999084472656,46.0,46.09000015258789,45.369998931884766
"Oct 01, 2019",45.0099983215332,45.45000076293945,45.75,45.0099983215332
"Oct 02, 2019",43.7599983215332,44.900001525878906,44.939998626708984,43.650001525878906
"Oct 03, 2019",44.400001525878906,43.599998474121094,44.5099983215332,42.970001220703125
"Oct 04, 2019",44.59000015258789,44.20000076293945,44.72999954223633,43.849998474121094
"Oct 07, 2019",43.52000045776367,44.400001525878906,44.59000015258789,43.5099983215332
"Oct 08, 2019",43.59000015258789,43.599998474121094,44.27000045776367,43.5099983215332
"Oct 09, 2019",44.720001220703125,43.65999984741211,45.040000915527344,43.65999984741211
"Oct 10, 2019",45.619998931884766,44.84000015258789,45.810001373291016,44.439998626708984
"Oct 11, 2019",45.91999816894531,46.0,46.900001525878906,45.900001525878906
"Oct 14, 2019",46.630001068115234,46.58000183105469,46.970001220703125,46.15999984741211
"Oct 15, 2019",46.099998474121094,46.529998779296875,46.95000076293945,46.029998779296875
"Oct 16, 2019",46.95000076293945,46.0,46.95000076293945,45.83000183105469
"Oct 17, 2019",46.33000183105469,46.900001525878906,47.2599983215332,46.29999923706055
"Oct 18, 2019",45.720001220703125,46.33000183105469,46.83000183105469,45.720001220703125
"Oct 21, 2019",46.08000183105469,45.400001525878906,46.380001068115234,45.380001068115234
"Oct 22, 2019",47.61000061035156,46.29999923706055,47.63999938964844,46.04999923706055
"Oct 23, 2019",48.75,47.68000030517578,48.95000076293945,47.4900016784668
"Oct 24, 2019",48.939998626708984,48.75,49.41999816894531,48.709999084472656
"Oct 25, 2019",49.529998779296875,48.95000076293945,49.849998474121094,48.84000015258789
"Oct 28, 2019",49.7400016784668,49.45000076293945,49.779998779296875,49.0099983215332
"Oct 29, 2019",48.91999816894531,49.349998474121094,49.86000061035156,48.849998474121094
"Oct 30, 2019",48.02000045776367,49.56999969482422,49.56999969482422,47.43000030517578
"Oct 31, 2019",47.15999984741211,48.25,48.25,46.34000015258789
"Nov 01, 2019",47.18000030517578,47.16999816894531,47.959999084472656,46.56999969482422
"Nov 04, 2019",47.36000061035156,47.119998931884766,47.81999969482422,47.119998931884766
"Nov 05, 2019",47.959999084472656,47.220001220703125,48.0,47.209999084472656
"Nov 06, 2019",47.4900016784668,48.0,48.59000015258789,47.31999969482422
"Nov 07, 2019",47.540000915527344,47.7400016784668,47.9900016784668,47.29999923706055
"Nov 08, 2019",46.75,47.70000076293945,47.70000076293945,46.63999938964844
"Nov 11, 2019",46.619998931884766,46.0099983215332,46.66999816894531,45.91999816894531
"Nov 12, 2019",45.779998779296875,46.220001220703125,46.54999923706055,45.439998626708984
"Nov 13, 2019",44.91999816894531,45.720001220703125,45.900001525878906,44.810001373291016
"Nov 14, 2019",45.439998626708984,45.0,45.58000183105469,44.93000030517578
"Nov 18, 2019",45.88999938964844,46.119998931884766,46.599998474121094,45.84000015258789
"Nov 19, 2019",45.349998474121094,45.7400016784668,45.959999084472656,44.939998626708984
"Nov 21, 2019",45.779998779296875,45.47999954223633,46.040000915527344,45.150001525878906
"Nov 22, 2019",46.099998474121094,45.91999816894531,46.400001525878906,45.540000915527344
"Nov 25, 2019",45.84000015258789,46.54999923706055,46.54999923706055,45.34000015258789
"Nov 26, 2019",45.040000915527344,45.4900016784668,45.58000183105469,44.58000183105469
"Nov 27, 2019",44.540000915527344,45.5,45.5,43.900001525878906
"Nov 28, 2019",44.279998779296875,44.459999084472656,44.72999954223633,44.04999923706055
"Nov 29, 2019",44.20000076293945,44.0099983215332,44.34000015258789,43.90999984741211
"Dec 02, 2019",44.58000183105469,44.20000076293945,44.75,44.06999969482422
"Dec 03, 2019",44.459999084472656,44.400001525878906,44.709999084472656,44.0
"Dec 04, 2019",44.900001525878906,44.5099983215332,45.119998931884766,44.400001525878906
"Dec 05, 2019",45.400001525878906,45.20000076293945,45.56999969482422,45.09000015258789
"Dec 06, 2019",44.630001068115234,45.400001525878906,45.58000183105469,44.5
"Dec 09, 2019",44.470001220703125,44.81999969482422,44.81999969482422,44.2599983215332
"Dec 10, 2019",44.54999923706055,44.29999923706055,44.7400016784668,44.189998626708984
"Dec 11, 2019",44.31999969482422,44.54999923706055,44.88999938964844,44.25
"Dec 12, 2019",44.25,44.31999969482422,44.720001220703125,44.189998626708984
"Dec 13, 2019",44.529998779296875,44.459999084472656,44.86000061035156,44.27000045776367
"Dec 16, 2019",45.25,44.880001068115234,45.689998626708984,44.83000183105469
"Dec 17, 2019",45.09000015258789,44.779998779296875,45.45000076293945,44.52000045776367
"Dec 18, 2019",46.58000183105469,44.95000076293945,46.65999984741211,44.790000915527344
"Dec 19, 2019",46.810001373291016,45.93000030517578,46.84000015258789,45.900001525878906
"Dec 20, 2019",47.2599983215332,47.029998779296875,47.529998779296875,46.54999923706055
"Dec 23, 2019",47.209999084472656,47.40999984741211,47.41999816894531,46.779998779296875
"Dec 26, 2019",48.040000915527344,47.599998474121094,48.18000030517578,47.33000183105469
"Dec 27, 2019",48.310001373291016,48.099998474121094,48.56999969482422,48.06999969482422
"Dec 30, 2019",49.29999923706055,48.880001068115234,50.16999816894531,48.86000061035156
"Jan 02, 2020",51.040000915527344,50.0,51.54999923706055,49.81999969482422
"Jan 03, 2020",51.0099983215332,50.52000045776367,51.33000183105469,50.5099983215332
"Jan 06, 2020",47.5099983215332,48.310001373291016,48.65999984741211,47.349998474121094
"Jan 07, 2020",47.40999984741211,47.599998474121094,47.97999954223633,47.060001373291016
"Jan 08, 2020",47.040000915527344,47.560001373291016,47.7400016784668,46.599998474121094
"Jan 09, 2020",46.150001525878906,46.880001068115234,47.36000061035156,46.0099983215332
"Jan 10, 2020",45.95000076293945,46.400001525878906,46.77000045776367,45.90999984741211
"Jan 13, 2020",46.52000045776367,46.22999954223633,46.880001068115234,45.7400016784668
"Jan 14, 2020",45.880001068115234,46.529998779296875,46.83000183105469,45.54999923706055
"Jan 15, 2020",45.2599983215332,45.790000915527344,45.86000061035156,44.86000061035156
"Jan 16, 2020",45.16999816894531,45.439998626708984,45.439998626708984,44.84000015258789
"Jan 17, 2020",46.11000061035156,45.36000061035156,46.5099983215332,45.34000015258789
"Jan 20, 2020",45.709999084472656,45.93000030517578,46.4900016784668,45.54999923706055
"Jan 21, 2020",43.939998626708984,45.619998931884766,46.0,43.65999984741211
"Jan 22, 2020",43.5099983215332,44.189998626708984,44.36000061035156,43.439998626708984
"Jan 23, 2020",44.459999084472656,43.439998626708984,44.5,43.20000076293945
"Jan 24, 2020",44.13999938964844,44.849998474121094,44.970001220703125,44.04999923706055
"Jan 27, 2020",43.97999954223633,43.20000076293945,44.27000045776367,43.20000076293945
"Jan 28, 2020",43.41999816894531,43.959999084472656,44.349998474121094,43.099998474121094
"Jan 29, 2020",42.43000030517578,44.16999816894531,44.900001525878906,42.38999938964844
"Jan 30, 2020",42.209999084472656,42.29999923706055,42.599998474121094,41.810001373291016
"Jan 31, 2020",41.79999923706055,42.900001525878906,43.13999938964844,41.720001220703125
"Feb 03, 2020",42.09000015258789,42.43000030517578,43.0,41.900001525878906
"Feb 04, 2020",42.04999923706055,42.5,42.97999954223633,41.709999084472656
"Feb 05, 2020",42.400001525878906,42.790000915527344,42.9900016784668,41.83000183105469
"Feb 06, 2020",41.75,42.95000076293945,42.9900016784668,41.650001525878906
"Feb 07, 2020",41.599998474121094,41.4900016784668,42.099998474121094,41.130001068115234
"Feb 10, 2020",42.630001068115234,42.0,42.86000061035156,41.68000030517578
"Feb 11, 2020",43.34000015258789,42.779998779296875,43.41999816894531,42.54999923706055
"Feb 12, 2020",43.0099983215332,42.91999816894531,43.2599983215332,42.38999938964844
"Feb 13, 2020",41.5,42.27000045776367,42.599998474121094,41.43000030517578
"Feb 14, 2020",41.060001373291016,41.650001525878906,41.95000076293945,41.029998779296875
"Feb 17, 2020",40.90999984741211,40.880001068115234,41.119998931884766,40.77000045776367
"Feb 18, 2020",40.709999084472656,40.720001220703125,40.81999969482422,40.189998626708984
"Feb 19, 2020",41.34000015258789,40.93000030517578,41.709999084472656,40.52000045776367
"Feb 20, 2020",41.400001525878906,41.41999816894531,41.63999938964844,41.029998779296875
"Feb 21, 2020",40.47999954223633,40.97999954223633,41.09000015258789,40.34000015258789
"Feb 27, 2020",38.779998779296875,38.099998474121094,39.09000015258789,37.81999969482422
"Feb 28, 2020",38.869998931884766,38.459999084472656,39.27000045776367,37.61000061035156
"Mar 02, 2020",38.93000030517578,39.75,39.790000915527344,38.70000076293945
"Mar 03, 2020",38.529998779296875,39.150001525878906,39.630001068115234,38.400001525878906
"Mar 04, 2020",38.369998931884766,39.119998931884766,39.20000076293945,37.79999923706055
"Mar 05, 2020",37.65999984741211,38.02000045776367,38.59000015258789,37.619998931884766
"Mar 06, 2020",36.349998474121094,36.0,37.47999954223633,35.869998931884766
"Mar 09, 2020",32.45000076293945,33.29999923706055,34.88999938964844,32.11000061035156
"Mar 10, 2020",33.59000015258789,33.0,34.06999969482422,32.5099983215332
"Mar 11, 2020",30.799999237060547,32.79999923706055,33.15999984741211,30.020000457763672
"Mar 12, 2020",26.649999618530273,26.299999237060547,28.0,25.0
"Mar 13, 2020",29.969999313354492,30.959999084472656,30.959999084472656,26.040000915527344
"Mar 16, 2020",26.389999389648438,26.6200008392334,28.600000381469727,25.0
"Mar 17, 2020",27.600000381469727,26.700000762939453,29.030000686645508,25.270000457763672
"Mar 18, 2020",25.790000915527344,25.899999618530273,26.600000381469727,24.510000228881836
"Mar 19, 2020",25.360000610351562,25.200000762939453,25.989999771118164,23.450000762939453
"Mar 20, 2020",25.600000381469727,26.31999969482422,27.200000762939453,25.0
"Mar 23, 2020",24.309999465942383,26.049999237060547,26.469999313354492,23.34000015258789
"Mar 24, 2020",27.56999969482422,26.0,28.290000915527344,25.3700008392334
"Mar 25, 2020",29.530000686645508,27.299999237060547,31.200000762939453,26.68000030517578
"Mar 26, 2020",30.170000076293945,29.920000076293945,31.110000610351562,29.149999618530273
"Mar 27, 2020",27.229999542236328,28.450000762939453,28.969999313354492,27.229999542236328
"Mar 30, 2020",28.200000762939453,27.3799991607666,28.350000381469727,26.709999084472656
"Mar 31, 2020",27.0,27.799999237060547,28.110000610351562,26.18000030517578
"Apr 01, 2020",24.739999771118164,25.700000762939453,26.1200008392334,24.510000228881836
"Apr 02, 2020",25.510000228881836,24.989999771118164,25.729999542236328,24.649999618530273
"Apr 03, 2020",23.860000610351562,25.239999771118164,25.309999465942383,23.459999084472656
"Apr 06, 2020",26.139999389648438,25.239999771118164,26.6200008392334,24.8700008392334
"Apr 07, 2020",27.360000610351562,28.530000686645508,28.8799991607666,27.260000228881836
"Apr 08, 2020",27.729999542236328,27.530000686645508,28.219999313354492,27.110000610351562
"Apr 09, 2020",27.579999923706055,27.899999618530273,28.6200008392334,27.469999313354492
"Apr 13, 2020",28.290000915527344,27.510000228881836,28.290000915527344,26.520000457763672
"Apr 14, 2020",28.200000762939453,28.68000030517578,29.110000610351562,28.06999969482422
"Apr 15, 2020",26.920000076293945,27.600000381469727,27.600000381469727,26.90999984741211
"Apr 16, 2020",25.8799991607666,27.149999618530273,27.31999969482422,25.719999313354492
"Apr 17, 2020",26.5,26.530000686645508,26.989999771118164,26.100000381469727
"Apr 20, 2020",25.950000762939453,26.0,26.200000762939453,25.670000076293945
"Apr 22, 2020",25.399999618530273,25.780000686645508,26.219999313354492,25.34000015258789
"Apr 23, 2020",25.030000686645508,25.639999389648438,25.8799991607666,24.8700008392334
"Apr 24, 2020",23.440000534057617,24.719999313354492,24.790000915527344,22.739999771118164
"Apr 27, 2020",24.459999084472656,24.100000381469727,24.989999771118164,23.84000015258789
"Apr 28, 2020",27.219999313354492,25.600000381469727,27.219999313354492,25.600000381469727
"Apr 29, 2020",28.219999313354492,27.329999923706055,28.350000381469727,26.709999084472656
"Apr 30, 2020",27.0,27.200000762939453,27.420000076293945,26.700000762939453
"May 04, 2020",25.739999771118164,26.0,26.139999389648438,25.239999771118164
"May 05, 2020",25.139999389648438,25.8700008392334,26.360000610351562,25.100000381469727
"May 06, 2020",24.90999984741211,25.1200008392334,25.329999923706055,24.34000015258789
"May 07, 2020",23.90999984741211,25.110000610351562,25.209999084472656,23.889999389648438
"May 08, 2020",24.43000030517578,24.170000076293945,25.079999923706055,23.8700008392334
"May 11, 2020",24.690000534057617,24.18000030517578,25.549999237060547,24.18000030517578
"May 12, 2020",23.239999771118164,24.649999618530273,24.84000015258789,23.239999771118164
"May 13, 2020",22.979999542236328,23.459999084472656,23.8799991607666,22.639999389648438
"May 14, 2020",23.940000534057617,22.700000762939453,23.979999542236328,21.8700008392334
"May 15, 2020",22.959999084472656,23.93000030517578,24.25,22.959999084472656
"May 18, 2020",24.540000915527344,24.0,24.639999389648438,23.520000457763672
"May 19, 2020",23.510000228881836,24.649999618530273,24.84000015258789,23.510000228881836
"May 20, 2020",23.770000457763672,23.93000030517578,24.149999618530273,23.360000610351562
"May 21, 2020",25.049999237060547,23.899999618530273,25.18000030517578,23.799999237060547
"May 22, 2020",24.610000610351562,25.0,25.1200008392334,24.200000762939453
"May 25, 2020",25.90999984741211,25.40999984741211,26.0,25.40999984741211
"May 26, 2020",25.139999389648438,26.34000015258789,26.639999389648438,25.1299991607666
"May 27, 2020",25.899999618530273,25.799999237060547,26.110000610351562,25.25
"May 28, 2020",25.229999542236328,25.899999618530273,26.190000534057617,25.0
"May 29, 2020",25.18000030517578,25.149999618530273,25.600000381469727,24.34000015258789
"Jun 01, 2020",26.610000610351562,25.489999771118164,26.719999313354492,25.219999313354492
"Jun 02, 2020",28.1299991607666,27.0,28.139999389648438,27.0
"Jun 03, 2020",29.389999389648438,29.639999389648438,29.739999771118164,28.950000762939453
"Jun 04, 2020",30.440000534057617,29.0,30.799999237060547,28.34000015258789
"Jun 05, 2020",31.1299991607666,31.700000762939453,32.970001220703125,31.06999969482422
"Jun 08, 2020",32.33000183105469,31.690000534057617,32.599998474121094,31.540000915527344
"Jun 09, 2020",31.889999389648438,31.799999237060547,32.529998779296875,31.219999313354492
"Jun 10, 2020",30.329999923706055,32.5,32.5,30.329999923706055
"Jun 12, 2020",29.920000076293945,29.18000030517578,30.5,28.8700008392334
"Jun 15, 2020",29.299999237060547,28.790000915527344,29.81999969482422,28.420000076293945
"Jun 16, 2020",30.3700008392334,30.559999465942383,31.0,30.0
"Jun 17, 2020",30.979999542236328,30.690000534057617,31.450000762939453,30.0
"Jun 18, 2020",30.709999084472656,30.700000762939453,31.520000457763672,30.5
"Jun 19, 2020",30.649999618530273,31.299999237060547,31.780000686645508,30.600000381469727
"Jun 22, 2020",30.790000915527344,31.25,31.450000762939453,30.520000457763672
"Jun 23, 2020",30.25,31.399999618530273,31.670000076293945,30.149999618530273
"Jun 24, 2020",28.850000381469727,30.010000228881836,30.34000015258789,28.610000610351562
"Jun 25, 2020",29.40999984741211,28.600000381469727,29.40999984741211,28.540000915527344
"Jun 26, 2020",28.34000015258789,28.989999771118164,29.260000228881836,28.1200008392334
"Jun 29, 2020",29.049999237060547,28.860000610351562,29.309999465942383,28.530000686645508
"Jun 30, 2020",28.020000457763672,28.780000686645508,29.100000381469727,28.010000228881836
"Jul 01, 2020",28.469999313354492,28.309999465942383,29.040000915527344,28.209999084472656
"Jul 02, 2020",28.690000534057617,29.049999237060547,29.719999313354492,28.549999237060547
"Jul 03, 2020",28.450000762939453,28.700000762939453,28.799999237060547,28.079999923706055
"Jul 06, 2020",29.770000457763672,28.950000762939453,29.829999923706055,28.889999389648438
"Jul 07, 2020",28.520000457763672,29.399999618530273,29.649999618530273,28.5
"Jul 08, 2020",29.5,28.850000381469727,29.600000381469727,28.719999313354492
"Jul 09, 2020",29.0,29.489999771118164,29.639999389648438,28.829999923706055
"Jul 10, 2020",29.030000686645508,28.950000762939453,29.1299991607666,28.559999465942383
"Jul 13, 2020",28.389999389648438,29.170000076293945,29.389999389648438,28.389999389648438
"Jul 14, 2020",28.799999237060547,28.43000030517578,28.809999465942383,28.18000030517578
"Jul 15, 2020",29.399999618530273,29.049999237060547,29.56999969482422,28.959999084472656
"Jul 16, 2020",29.25,29.299999237060547,29.520000457763672,29.020000457763672
"Jul 17, 2020",29.809999465942383,29.309999465942383,30.280000686645508,29.25
"Jul 20, 2020",29.850000381469727,29.93000030517578,30.260000228881836,29.6200008392334
"Jul 21, 2020",30.690000534057617,30.299999237060547,30.989999771118164,30.100000381469727
"Jul 22, 2020",29.56999969482422,30.860000610351562,30.8700008392334,29.5
"Jul 23, 2020",28.959999084472656,29.649999618530273,29.780000686645508,28.93000030517578
"Jul 24, 2020",29.030000686645508,28.940000534057617,29.43000030517578,28.610000610351562
"Jul 27, 2020",29.670000076293945,29.219999313354492,29.809999465942383,28.93000030517578
"Jul 28, 2020",30.0,29.530000686645508,30.530000686645508,29.260000228881836
"Jul 29, 2020",30.959999084472656,30.299999237060547,31.899999618530273,30.299999237060547
"Jul 30, 2020",31.049999237060547,30.40999984741211,31.5,30.40999984741211
"Jul 31, 2020",30.010000228881836,31.15999984741211,31.31999969482422,29.959999084472656
"Aug 03, 2020",29.639999389648438,30.200000762939453,30.3700008392334,29.25
"Aug 04, 2020",28.809999465942383,29.489999771118164,30.059999465942383,28.549999237060547
"Aug 05, 2020",28.899999618530273,29.239999771118164,29.5,28.549999237060547
"Aug 06, 2020",29.799999237060547,29.0,30.09000015258789,28.889999389648438
"Aug 07, 2020",29.25,29.40999984741211,29.989999771118164,28.760000228881836
"Aug 10, 2020",30.34000015258789,29.40999984741211,30.34000015258789,29.239999771118164
"Aug 11, 2020",29.969999313354492,30.489999771118164,31.049999237060547,29.969999313354492
"Aug 12, 2020",29.950000762939453,30.049999237060547,30.75,29.270000457763672
"Aug 13, 2020",28.860000610351562,30.079999923706055,30.239999771118164,28.799999237060547
"Aug 14, 2020",29.09000015258789,28.899999618530273,29.399999618530273,28.459999084472656
"Aug 17, 2020",28.559999465942383,29.100000381469727,29.239999771118164,28.010000228881836
"Aug 18, 2020",29.1299991607666,29.15999984741211,29.3799991607666,28.829999923706055
"Aug 19, 2020",29.0,29.100000381469727,29.350000381469727,28.68000030517578
"Aug 20, 2020",28.899999618530273,28.450000762939453,29.049999237060547,28.25
"Aug 21, 2020",28.899999618530273,28.889999389648438,29.0,28.559999465942383
"Aug 24, 2020",29.350000381469727,29.020000457763672,29.850000381469727,28.989999771118164
"Aug 25, 2020",29.139999389648438,29.350000381469727,29.809999465942383,28.829999923706055
"Aug 26, 2020",28.389999389648438,28.940000534057617,29.18000030517578,28.139999389648438
"Aug 27, 2020",28.81999969482422,28.600000381469727,29.219999313354492,28.3700008392334
"Aug 28, 2020",29.280000686645508,28.84000015258789,29.280000686645508,28.790000915527344
"Aug 31, 2020",28.280000686645508,29.200000762939453,29.209999084472656,28.280000686645508
