result,data,num_ativos,lista_ativos,oper_ativos,volatilidade
0.9322293821885065,"Jan 04, 2010","9","['CYRE3', 'LREN3', 'MRVE3', 'USIM5', 'BRKM5', 'VALE3', 'ITSA4', 'DTEX3', 'TRPL4']","[1.5, 1.5, 1.25, 1.0, 0.75, 0.5, 0.5, 0.5, 0.5]","nan"
1.0195012366709482,"Feb 01, 2010","9","['BTOW3', 'MMXM3', 'ELET3', 'CPFE3', 'USIM3', 'MRVE3', 'CSAN3', 'LREN3', 'BRKM5']","[0.375, 0.25, 0.25, 0.25, 0.0, 0.0, 0.0, -0.125, -0.125]","0.0008780983526844927"
1.096449694077481,"Mar 01, 2010","9","['PETR3', 'RDCD3', 'BRAP4', 'GOAU4', 'PETR4', 'USIM5', 'VALE3', 'MMXM3', 'EMBR3']","[1.75, 1.75, 1.75, 1.75, 1.5, 1.5, 1.25, 0.25, 0.25]","0.0005177991209484406"
0.9609179378809161,"Apr 01, 2010","9","['CSNA3', 'GGBR4', 'BRAP4', 'EMBR3', 'BBAS3', 'GFSA3', 'MMXM3', 'RSID3', 'DTEX3']","[0.625, 0.25, 0.25, 0.25, 0.0, 0.0, 0.0, 0.0, 0.0]","0.000738618342224143"
0.9351500022973188,"May 03, 2010","9","['GGBR4', 'SBSP3', 'RDCD3', 'ELET3', 'GOAU4', 'ABEV3', 'ELET6', 'JBSS3', 'KLBN4']","[0.25, 0.25, 0.0, 0.0, 0.0, 0.0, 0.0, 0.0, 0.0]","nan"
1.0588064045448,"Jun 01, 2010","9","['RSID3', 'MRVE3', 'BRFS3', 'LIGT3', 'LREN3', 'CMIG4', 'ABEV3', 'CPFE3', 'TIMP3']","[1.75, 1.5, 1.0, 0.75, 0.25, 0.0, 0.0, 0.0, 0.0]","0.00032870975569065865"
1.1023461964828458,"Jul 01, 2010","9","['PDGR3', 'TRPL4', 'TIMP3', 'LIGT3', 'BRAP4', 'CSNA3', 'KLBN4', 'CYRE3', 'JBSS3']","[2.0, 0.25, 0.25, 0.0, 0.0, 0.0, 0.0, 0.0, 0.0]","0.0037088427206755075"
0.973690182293999,"Aug 02, 2010","6","['PETR4', 'ABEV3', 'BRKM5', 'GGBR4', 'SBSP3', 'GFSA3']","[1.0, 0.25, 0.25, 0.25, 0.0, -0.5]","0.00022314178049889172"
1.0638553090394367,"Sep 01, 2010","9","['BTOW3', 'GOAU4', 'PETR4', 'CSAN3', 'GOLL4', 'VALE3', 'EMBR3', 'GGBR4', 'CSNA3']","[1.75, 0.5, 0.5, 0.0, 0.0, 0.0, 0.0, 0.0, -0.125]","0.00017984570729853152"
1.0512057742165706,"Oct 01, 2010","9","['USIM5', 'BRAP4', 'GOLL4', 'MRVE3', 'RSID3', 'LAME4', 'EMBR3', 'MMXM3', 'PDGR3']","[1.5, 0.25, 0.25, 0.25, 0.25, 0.25, 0.25, 0.25, 0.25]","0.0012539566682263207"
0.9820407990490025,"Nov 01, 2010","9","['BRAP4', 'CCRO3', 'ELET6', 'DTEX3', 'ELET3', 'GOLL4', 'BRKM5', 'CMIG4', 'VALE3']","[0.75, 0.25, 0.25, 0.25, 0.25, 0.25, 0.25, 0.25, 0.25]","nan"
0.9781922517740742,"Dec 01, 2010","9","['ABEV3', 'BRKM5', 'USIM5', 'BTOW3', 'LREN3', 'TIMP3', 'GOLL4', 'BBAS3', 'LAME4']","[0.25, 0.25, 0.25, 0.0, 0.0, 0.0, 0.0, 0.0, 0.0]","0.000175978776846817"
0.9624679196845776,"Jan 03, 2011","9","['CCRO3', 'GOAU4', 'CSAN3', 'BRKM5', 'CMIG4', 'GGBR4', 'BRFS3', 'KLBN4', 'SBSP3']","[2.0, 2.0, 1.0, 1.0, 0.75, 0.75, 0.375, 0.375, 0.25]","9.764612164190628e-05"
1.0285741391225731,"Feb 01, 2011","9","['CESP6', 'SANB11', 'GOAU4', 'CPLE6', 'LREN3', 'BTOW3', 'CPFE3', 'TIMP3', 'LIGT3']","[2.0, 1.625, 1.0, 0.75, 0.375, 0.375, 0.25, 0.25, 0.25]","9.048714112653058e-05"
1.0234083143472577,"Mar 01, 2011","9","['ITSA4', 'SANB11', 'LIGT3', 'DTEX3', 'TIMP3', 'USIM3', 'BRFS3', 'EMBR3', 'PETR4']","[1.75, 1.5, 0.75, 0.5, 0.25, 0.25, 0.25, 0.25, 0.25]","0.00010140112136775896"
0.9751013947098672,"Apr 04, 2011","9","['CCRO3', 'DTEX3', 'GOLL4', 'MMXM3', 'LREN3', 'TIMP3', 'USIM3', 'ELET6', 'ELET3']","[2.75, 1.875, 1.75, 1.75, 0.25, 0.25, 0.25, 0.25, 0.25]","0.0001441771629605024"
1.0150192700724803,"May 02, 2011","9","['BBAS3', 'JBSS3', 'USIM5', 'SBSP3', 'CPFE3', 'TIMP3', 'CCRO3', 'CESP6', 'BRKM5']","[1.5, 0.625, 0.375, 0.25, 0.25, 0.25, 0.25, 0.25, 0.25]","0.00012817938014288076"
0.9822532522281849,"Jun 01, 2011","9","['LREN3', 'CSAN3', 'CYRE3', 'TIMP3', 'MRVE3', 'CIEL3', 'ABEV3', 'BTOW3', 'MRFG3']","[2.0, 1.75, 1.75, 0.25, 0.25, 0.25, 0.0, 0.0, 0.0]","0.00011318815537518048"
0.9332874151888266,"Jul 01, 2011","9","['RDCD3', 'ITUB4', 'TIMP3', 'LREN3', 'BBDC4', 'ITSA4', 'LIGT3', 'CSAN3', 'CMIG4']","[2.0, 1.5, 1.25, 1.25, 1.0, 1.0, 0.5, 0.25, 0.25]","5.7929297995137186e-05"
0.904876167268567,"Aug 01, 2011","9","['PETR3', 'JBSS3', 'CPLE6', 'BRKM5', 'MRFG3', 'BRFS3', 'PETR4', 'CPFE3', 'LREN3']","[1.5, 0.75, 0.625, 0.25, 0.25, 0.0, 0.0, -0.25, -0.25]","0.00013899176219794702"
0.8992736303891788,"Sep 01, 2011","9","['TIMP3', 'SANB11', 'RSID3', 'GGBR4', 'BTOW3', 'USIM3', 'TRPL4', 'LREN3', 'CSAN3']","[2.0, 1.75, 1.75, 1.75, 1.5, 0.25, 0.0, 0.0, 0.0]","0.003935459802872677"
1.1249209574999504,"Oct 03, 2011","9","['PCAR4', 'EMBR3', 'LIGT3', 'CSAN3', 'GOAU4', 'BRFS3', 'RDCD3', 'GGBR4', 'TRPL4']","[1.75, 1.25, 0.25, 0.25, 0.25, 0.25, 0.25, 0.25, 0.0]","0.0037932461836594888"
1.039311301953488,"Nov 01, 2011","9","['BBAS3', 'CESP6', 'TIMP3', 'CMIG4', 'GOAU4', 'CPFE3', 'KLBN4', 'ITUB4', 'SANB11']","[1.75, 1.5, 1.25, 1.0, 0.875, 0.75, 0.625, 0.625, 0.5]","8.03926546190352e-05"
1,"0","0","0","0","0"
1.0649185301172928,"Jan 02, 2012","9","['BBAS3', 'CSNA3', 'CPFE3', 'EMBR3', 'ELET6', 'GFSA3', 'CMIG4', 'SBSP3', 'LIGT3']","[1.75, 1.5, 1.0, 1.0, 0.75, 0.625, 0.5, 0.25, 0.25]","0.00014650244241049565"
1.0336618435699119,"Feb 01, 2012","9","['BRKM5', 'PDGR3', 'JBSS3', 'USIM5', 'HGTX3', 'PCAR4', 'LREN3', 'CSNA3', 'DTEX3']","[2.875, 2.5, 2.0, 2.0, 1.0, 0.75, 0.75, 0.5, 0.25]","0.0002940193014323957"
0.9900765199766837,"Mar 01, 2012","9","['ABEV3', 'RDCD3', 'CESP6', 'BRAP4', 'BTOW3', 'CSAN3', 'BRKM5', 'ELET3', 'DTEX3']","[1.25, 0.5, 0.25, 0.25, 0.25, 0.25, 0.25, 0.25, 0.25]","0.0001036583015413325"
0.9689481873975682,"Apr 02, 2012","9","['CCRO3', 'SANB11', 'ABEV3', 'PETR4', 'UGPA3', 'VIVT4', 'MRFG3', 'HYPE3', 'USIM5']","[1.0, 1.0, 0.75, 0.75, 0.25, 0.25, 0.25, 0.25, 0.25]","0.00022598774142849304"
0.7912187760082847,"May 02, 2012","9","['BRML3', 'RSID3', 'MRVE3', 'PDGR3', 'GFSA3', 'SBSP3', 'UGPA3', 'DTEX3', 'USIM3']","[1.75, 1.75, 0.75, 0.75, 0.625, 0.5, 0.25, 0.25, 0.0]","0.00025950635992160235"
1.0189553898488377,"Jun 01, 2012","9","['RSID3', 'MRVE3', 'GFSA3', 'CSNA3', 'SBSP3', 'CMIG4', 'EMBR3', 'CCRO3', 'SANB11']","[0.625, 0.625, 0.625, 0.25, 0.0, 0.0, 0.0, 0.0, 0.0]","0.0002227818387769647"
1.041631374374347,"Jul 02, 2012","9","['UGPA3', 'OIBR4', 'CCRO3', 'ABEV3', 'LIGT3', 'BRAP4', 'ELET6', 'ELET3', 'RDCD3']","[2.0, 1.0, 0.25, 0.0, 0.0, 0.0, 0.0, 0.0, 0.0]","0.00010629356345541078"
1.020389981400177,"Aug 01, 2012","8","['BBDC4', 'LREN3', 'LAME4', 'GOAU4', 'BTOW3', 'HYPE3', 'BRAP4', 'BRKM5']","[2.0, 1.5, 0.625, 0.25, 0.25, 0.25, 0.0, 0.0]","0.00024191090859356862"
1.0736606170478655,"Sep 03, 2012","9","['PCAR4', 'GFSA3', 'MRFG3', 'USIM3', 'LREN3', 'RENT3', 'BRML3', 'BRKM5', 'LAME4']","[0.75, 0.5, 0.375, 0.25, 0.25, 0.25, 0.25, 0.25, 0.25]","0.00021358211693348544"
1.145255782608884,"Jun 01, 2016","9","['ELET3', 'PCAR4', 'EQTL3', 'CSAN3', 'QUAL3', 'ABEV3', 'CIEL3', 'JBSS3', 'VALE3']","[1.75, 1.375, 0.25, 0.25, 0.25, 0.0, 0.0, 0.0, 0.0]","0.00030699771059095705"
1.151145772774627,"Jul 01, 2016","9","['CPFE3', 'VIVT4', 'MRVE3', 'LREN3', 'SBSP3', 'LAME4', 'QUAL3', 'BBDC4', 'PETR4']","[2.0, 1.0, 1.0, 0.25, 0.25, 0.25, 0.25, 0.0, 0.0]","0.0003377408470551341"
1.04002518532337,"Aug 01, 2016","9","['HYPE3', 'GGBR4', 'CSNA3', 'BBAS3', 'ENBR3', 'WEGE3', 'TIMP3', 'BRAP4', 'GOAU4']","[1.125, 1.125, 1.125, 1.0, 0.75, 0.625, 0.625, 0.5, 0.5]","0.0006259739491477832"
0.9660880733830141,"Sep 01, 2016","9","['BRFS3', 'UGPA3', 'VIVT4', 'PCAR4', 'KLBN11', 'TIMP3', 'QUAL3', 'GOAU4', 'CIEL3']","[0.25, 0.25, 0.25, 0.25, 0.25, 0.25, 0.25, 0.25, 0.0]","0.0003272489967898529"
1.1510629710575042,"Oct 03, 2016","9","['CSNA3', 'VALE3', 'ITUB4', 'ABEV3', 'BBAS3', 'BBSE3', 'CESP6', 'BBDC4', 'PETR4']","[1.75, 1.5, 1.25, 1.25, 1.25, 1.25, 1.25, 0.25, 0.25]","0.0007748506383349612"
0.9447025712082573,"Nov 01, 2016","9","['BRAP4', 'TIMP3', 'MRVE3', 'ECOR3', 'VALE3', 'LREN3', 'LAME4', 'BRML3', 'BRKM5']","[2.125, 2.0, 1.25, 0.375, 0.25, 0.25, 0.25, 0.25, 0.25]","0.0004554628829594727"
1.0049336175390229,"Dec 01, 2016","9","['GOAU4', 'BRAP4', 'BBAS3', 'SANB11', 'USIM5', 'ITSA4', 'UGPA3', 'SBSP3', 'EQTL3']","[1.0, 0.5, 0.25, 0.25, 0.25, 0.0, 0.0, 0.0, 0.0]","0.0008810096061575408"
1.0590498604692542,"Jan 02, 2017","9","['BBAS3', 'PCAR4', 'MULT3', 'ECOR3', 'JBSS3', 'LAME4', 'CYRE3', 'BRKM5', 'MRFG3']","[1.75, 1.5, 1.5, 1.5, 1.25, 1.0, 0.5, 0.25, 0.25]","0.0002697935181605968"
1.026743808739285,"Feb 01, 2017","9","['WEGE3', 'TIMP3', 'BBDC3', 'HYPE3', 'ITUB4', 'SBSP3', 'VALE3', 'BBAS3', 'JBSS3']","[2.0, 1.75, 1.0, 1.0, 0.75, 0.75, 0.25, 0.25, 0.25]","0.00041791563263014764"
0.949780349522267,"Mar 01, 2017","9","['CMIG4', 'ITSA4', 'BRML3', 'CCRO3', 'ITUB4', 'BBDC4', 'SANB11', 'SBSP3', 'CPFE3']","[1.25, 1.125, 0.75, 0.5, 0.25, 0.25, 0.25, 0.25, 0.25]","0.0003943668582102137"
1.0532381309771728,"Apr 03, 2017","9","['MULT3', 'PCAR4', 'EGIE3', 'JBSS3', 'ABEV3', 'TIMP3', 'RENT3', 'MRVE3', 'ITUB4']","[1.75, 1.25, 1.0, 0.75, 0.25, 0.25, 0.25, 0.25, 0.0]","0.00019938803243510015"
0.960503827049401,"Jul 01, 2015","9","['ITUB4', 'BBDC4', 'ITSA4', 'TIMP3', 'BRFS3', 'ABEV3', 'PETR4', 'JBSS3', 'BBDC3']","[1.75, 1.75, 1.75, 1.25, 0.25, 0.0, 0.0, 0.0, 0.0]","0.00014671020269935075"
0.901159232474436,"Aug 03, 2015","9","['ENBR3', 'CIEL3', 'BBDC3', 'TIMP3', 'SANB11', 'SBSP3', 'BBDC4', 'PETR4', 'PETR3']","[0.375, 0.25, 0.0, 0.0, 0.0, 0.0, -0.25, -0.25, -0.25]","0.0002878302687284871"
1.007227931224253,"Sep 01, 2015","9","['OIBR4', 'KLBN11', 'ENBR3', 'GFSA3', 'JBSS3', 'EMBR3', 'VIVT4', 'PCAR4', 'TIMP3']","[0.25, 0.0, 0.0, 0.0, -0.25, -0.25, -0.25, -0.25, -0.25]","8.042747516006924e-05"
1.0277151961078541,"Oct 01, 2015","9","['BRFS3', 'EMBR3', 'CSNA3', 'BBDC4', 'ITSA4', 'BBSE3', 'BBDC3', 'SANB11', 'BRML3']","[1.75, 1.75, 1.75, 0.75, 0.75, 0.75, 0.75, 0.75, 0.75]","0.0002481231800706555"
1.040629389409844,"Nov 03, 2015","9","['HYPE3', 'UGPA3', 'KLBN11', 'CSNA3', 'MULT3', 'BRPR3', 'DTEX3', 'ELET6', 'ITUB4']","[1.75, 0.25, 0.25, 0.25, 0.25, 0.25, 0.25, 0.25, 0.0]","0.0002386851509502582"
0.9342657926618309,"Dec 01, 2015","9","['GGBR4', 'HYPE3', 'GOAU4', 'SANB11', 'BRML3', 'CPFE3', 'ENBR3', 'ELET3', 'BBDC4']","[1.0, 0.875, 0.75, 0.25, 0.25, 0.25, 0.25, 0.25, 0.0]","0.00030435459441564453"
0.9782979434496067,"Jan 04, 2016","9","['USIM5', 'SANB11', 'CCRO3', 'EQTL3', 'SBSP3', 'BRML3', 'CPFE3', 'ENBR3', 'ITUB4']","[0.75, 0.25, 0.0, 0.0, 0.0, 0.0, 0.0, 0.0, -0.125]","0.00023377899881599717"
1.1204720681750089,"Feb 01, 2016","9","['HYPE3', 'USIM5', 'BRKM5', 'VIVT4', 'CSAN3', 'CSNA3', 'CESP6', 'MRFG3', 'CYRE3']","[1.75, 0.375, 0.0, -0.25, -0.25, -0.25, -0.25, -0.25, -0.25]","0.00017659526277142944"
1.1580284568586654,"Mar 01, 2016","9","['ABEV3', 'ELET3', 'UGPA3', 'BBAS3', 'LAME4', 'SBSP3', 'ITUB4', 'ITSA4', 'BBSE3']","[2.0, 1.25, 0.5, 0.25, 0.25, 0.25, 0.0, 0.0, 0.0]","0.00022232397831477594"
1.0368569778393442,"Apr 01, 2016","9","['UGPA3', 'CSAN3', 'OIBR3', 'ABEV3', 'RADL3', 'GGBR4', 'ITUB4', 'BBDC4', 'PETR4']","[1.25, 0.75, 0.75, 0.375, 0.375, 0.375, 0.25, 0.25, 0.25]","0.0004156197284445429"
0.8748048290250298,"May 02, 2016","9","['TIMP3', 'PETR3', 'BBDC4', 'ITSA4', 'VALE3', 'BBSE3', 'BBAS3', 'WEGE3', 'EQTL3']","[2.0, 0.625, 0.25, 0.25, 0.25, 0.25, 0.25, 0.25, 0.25]","0.0006287936492647896"
0.9925152093296442,"Oct 01, 2012","9","['CSAN3', 'LREN3', 'GOAU4', 'DTEX3', 'BRKM5', 'LAME4', 'GOLL4', 'MRFG3', 'CSNA3']","[0.375, 0.25, 0.25, 0.25, 0.25, 0.25, 0.25, 0.25, 0.25]","0.00027155205941513226"
1.0323338634586725,"Nov 01, 2012","9","['BRAP4', 'DASA3', 'USIM3', 'CYRE3', 'CPLE6', 'MRVE3', 'CPFE3', 'BRFS3', 'DTEX3']","[1.75, 1.25, 1.0, 1.0, 0.75, 0.375, 0.25, 0.25, 0.25]","0.0001760112942390359"
1.0298271134275048,"Dec 03, 2012","9","['CYRE3', 'BRML3', 'SANB11', 'KLBN4', 'CCRO3', 'RENT3', 'EMBR3', 'BRKM5', 'VALE3']","[1.75, 1.5, 1.0, 0.25, 0.25, 0.0, 0.0, -0.25, -0.25]","0.00017125191914390306"
1.0516466916558613,"Dec 28, 2012","9","['BBAS3', 'UGPA3', 'ELET6', 'SANB11', 'SBSP3', 'EMBR3', 'CYRE3', 'BRFS3', 'VIVT4']","[2.75, 1.75, 1.75, 1.75, 1.5, 1.5, 1.5, 1.375, 1.125]","7.685082059434468e-05"
0.9587912988708982,"Feb 01, 2013","9","['PETR3', 'PETR4', 'TRPL4', 'SBSP3', 'VIVT4', 'BRFS3', 'BRKM5', 'KLBN4', 'GOLL4']","[1.0, 1.0, 0.25, 0.25, 0.25, 0.25, 0.25, 0.25, 0.25]","0.0019032200831893174"
0.9974132881251137,"Mar 01, 2013","9","['BBAS3', 'CIEL3', 'ITSA4', 'UGPA3', 'BRKM5', 'CESP6', 'RENT3', 'VIVT4', 'ELET6']","[1.875, 1.5, 0.5, 0.25, 0.25, 0.0, 0.0, 0.0, 0.0]","9.3382483545064e-05"
0.9945882590587453,"Mar 28, 2013","9","['TIMP3', 'PCAR4', 'VIVT4', 'EMBR3', 'BBAS3', 'ITUB4', 'CESP6', 'UGPA3', 'RENT3']","[1.5, 0.25, 0.25, 0.25, 0.25, 0.25, 0.0, 0.0, 0.0]","7.647499488016072e-05"
0.9566910216035547,"May 02, 2013","9","['UGPA3', 'PETR3', 'PDGR3', 'ELET6', 'BRML3', 'VALE3', 'BBAS3', 'CSNA3', 'MRVE3']","[0.5, 0.25, -0.125, -0.25, -0.25, -0.25, -0.25, -0.25, -0.25]","0.00020219017992373527"
0.9246086840847665,"Jun 03, 2013","4","['ELET6', 'ITUB4', 'TIMP3', 'GGBR4']","[0.0, 0.0, 0.0, -0.25]","0.0001607162371256916"
0.9787922678152111,"Jul 01, 2013","9","['LREN3', 'EMBR3', 'TRPL4', 'ENBR3', 'ELET6', 'MRFG3', 'ELET3', 'RSID3', 'CPLE6']","[0.75, 0.25, 0.0, 0.0, 0.0, 0.0, 0.0, 0.0, -0.25]","0.0002553974053540432"
1.0441161961770793,"Aug 01, 2013","9","['TRPL4', 'KLBN4', 'TIMP3', 'RSID3', 'CIEL3', 'DASA3', 'CCRO3', 'MMXM3', 'PCAR4']","[1.5, 1.5, 1.25, 1.0, 0.25, 0.25, 0.125, 0.125, 0.0]","9.282140421805682e-05"
0.9447101974956129,"May 02, 2017","9","['ITSA4', 'BBDC4', 'VIVT4', 'WEGE3', 'ITUB4', 'ABEV3', 'CIEL3', 'HYPE3', 'MRVE3']","[1.75, 1.5, 1.25, 1.25, 1.0, 0.25, 0.25, 0.25, 0.25]","0.00011066529002075597"
1.0144643412091827,"Jun 01, 2017","9","['BRKM5', 'GGBR4', 'ITSA4', 'PCAR4', 'CPFE3', 'GOAU4', 'KLBN11', 'ABEV3', 'UGPA3']","[2.0, 1.75, 1.5, 1.25, 1.125, 1.0, 0.75, 0.25, 0.25]","0.00016726968273416063"
1.0632357610206067,"Jul 03, 2017","9","['VALE3', 'ITUB4', 'GGBR4', 'QUAL3', 'GOAU4', 'BBDC4', 'CIEL3', 'BBDC3', 'EMBR3']","[1.25, 1.0, 1.0, 0.25, 0.25, 0.0, 0.0, 0.0, 0.0]","0.00023396990559754224"
1.0725288516083185,"Aug 01, 2017","9","['LAME4', 'CSAN3', 'CCRO3', 'RENT3', 'MULT3', 'ITUB4', 'ITSA4', 'LREN3', 'EQTL3']","[2.0, 2.0, 1.25, 0.625, 0.375, 0.25, 0.25, 0.25, 0.25]","0.00013469201122773362"
1.000736098139031,"Sep 01, 2017","9","['CMIG4', 'RENT3', 'ABEV3', 'CPFE3', 'UGPA3', 'CCRO3', 'VALE3', 'LAME4', 'BBDC4']","[1.75, 1.5, 1.125, 1.125, 1.0, 0.75, 0.5, 0.375, 0.25]","0.00010745546910131172"
1.018447318520625,"Oct 02, 2017","9","['BBAS3', 'MRFG3', 'CMIG4', 'ITUB4', 'BBDC4', 'PETR4', 'PETR3', 'BRFS3', 'UGPA3']","[0.75, 0.625, 0.5, 0.25, 0.25, 0.25, 0.25, 0.25, 0.25]","0.00011000163975402752"
0.9362681297067668,"Nov 01, 2017","9","['PETR4', 'PETR3', 'UGPA3', 'CCRO3', 'HYPE3', 'PCAR4', 'USIM5', 'ECOR3', 'VALE3']","[1.25, 0.625, 0.25, 0.25, 0.25, 0.25, 0.25, 0.25, 0.0]","0.0002148045756702098"
1.0456531417225856,"Dec 01, 2017","9","['GGBR4', 'RADL3', 'QUAL3', 'CIEL3', 'SANB11', 'ECOR3', 'WEGE3', 'BRKM5', 'BBDC4']","[1.875, 1.125, 0.625, 0.25, 0.25, 0.25, 0.0, 0.0, -0.25]","0.00014387955742574212"
1.063727935772251,"Jan 02, 2018","9","['USIM5', 'EQTL3', 'TAEE11', 'CYRE3', 'BRML3', 'ELET6', 'LREN3', 'MULT3', 'ABEV3']","[3.0, 2.0, 2.0, 2.0, 1.75, 1.75, 1.5, 1.5, 1.25]","0.0001978710095333391"
1.0211730937222008,"Feb 01, 2018","9","['SMLS3', 'CPLE6', 'PETR4', 'PETR3', 'CYRE3', 'MGLU3', 'LREN3', 'MULT3', 'MRVE3']","[2.0, 2.0, 1.0, 1.0, 1.0, 0.625, 0.25, 0.25, 0.25]","0.00023791903797711013"
1.0239518583807332,"Mar 01, 2018","9","['CPFE3', 'PETR4', 'PETR3', 'ABEV3', 'ITSA4', 'JBSS3', 'RAIL3', 'RENT3', 'MGLU3']","[1.125, 0.625, 0.5, 0.25, 0.25, 0.25, 0.25, 0.25, 0.25]","0.00026249952073837963"
0.9523142633221803,"Feb 01, 2019","9","['VIVT4', 'FLRY3', 'EGIE3', 'CCRO3', 'SBSP3', 'CPLE6', 'UGPA3', 'B3SA3', 'BRFS3']","[1.75, 1.75, 1.25, 1.125, 1.0, 1.0, 0.875, 0.75, 0.25]","0.00025429776712770376"
0.9494117740216186,"Mar 01, 2019","9","['EMBR3', 'MGLU3', 'RAIL3', 'RENT3', 'CMIG4', 'PCAR4', 'CIEL3', 'BTOW3', 'CSAN3']","[1.5, 1.5, 0.25, 0.25, 0.25, 0.25, 0.25, 0.25, 0.25]","0.00018629450668364794"
1.0369901544608906,"Apr 01, 2019","9","['SANB11', 'WEGE3', 'PETR4', 'PETR3', 'RADL3', 'BBAS3', 'BRFS3', 'SUZB3', 'SBSP3']","[0.75, 0.5, 0.25, 0.25, 0.25, 0.0, 0.0, 0.0, 0.0]","0.0002251731019502028"
1.051453855884135,"May 02, 2019","9","['BBDC4', 'BBAS3', 'EQTL3', 'BRML3', 'CVCB3', 'ENBR3', 'RENT3', 'EGIE3', 'JBSS3']","[2.0, 1.5, 1.5, 1.5, 1.5, 1.5, 0.625, 0.375, 0.25]","0.00040646635802523155"
1.041235476789782,"Jun 03, 2019","9","['VVAR3', 'SANB11', 'RADL3', 'CMIG4', 'CSAN3', 'BRML3', 'CCRO3', 'LREN3', 'BBSE3']","[2.0, 1.75, 1.75, 1.5, 1.25, 1.0, 0.375, 0.25, 0.25]","0.00016286736370050458"
0.9657645536228632,"Jul 01, 2019","9","['VALE3', 'BRAP4', 'CIEL3', 'ITSA4', 'ITUB4', 'BBDC4', 'B3SA3', 'BBAS3', 'LREN3']","[2.0, 2.0, 1.0, 0.5, 0.25, 0.25, 0.25, 0.25, 0.25]","0.00012441027079162552"
1.0455305135346846,"Aug 01, 2019","9","['MRVE3', 'EGIE3', 'VVAR3', 'RADL3', 'JBSS3', 'BRFS3', 'EQTL3', 'SBSP3', 'ELET3']","[2.0, 1.125, 0.625, 0.5, 0.25, 0.25, 0.25, 0.25, 0.25]","0.0003688004225691059"
1.0168412186947897,"Sep 02, 2019","9","['B3SA3', 'JBSS3', 'RADL3', 'CCRO3', 'HYPE3', 'ELET3', 'ELET6', 'CVCB3', 'FLRY3']","[0.25, 0.25, 0.25, 0.25, 0.25, 0.25, 0.25, 0.25, 0.25]","0.00031441082853202407"
1.05152829360063,"Oct 01, 2019","9","['PETR4', 'PETR3', 'AZUL4', 'GOAU4', 'JBSS3', 'MGLU3', 'LAME4', 'BTOW3', 'B3SA3']","[1.75, 1.25, 1.0, 1.0, 0.75, 0.5, 0.5, 0.5, 0.25]","0.0002516728048698375"
1.006876426057957,"Nov 01, 2019","9","['ELET6', 'FLRY3', 'B3SA3', 'UGPA3', 'BBSE3', 'IRBR3', 'BRML3', 'HYPE3', 'MULT3']","[2.25, 1.75, 0.25, 0.25, 0.25, 0.25, 0.25, 0.25, 0.25]","0.00018929763052995233"
1.0621913795220537,"Aug 01, 2014","9","['USIM5', 'MMXM3', 'BBDC4', 'BBDC3', 'EGIE3', 'ENBR3', 'LIGT3', 'ELET6', 'MRFG3']","[1.0, 0.75, 0.25, 0.25, 0.25, 0.25, 0.25, 0.25, 0.25]","0.00016790899241078653"
0.9351088849841462,"Sep 01, 2014","9","['SANB11', 'SBSP3', 'TIMP3', 'BRAP4', 'RENT3', 'BRPR3', 'MRVE3', 'ABEV3', 'PCAR4']","[1.75, 1.75, 1.5, 0.875, 0.5, 0.5, 0.375, 0.25, 0.25]","9.719980307412122e-05"
0.9789291402132382,"Oct 01, 2014","9","['SBSP3', 'EVEN3', 'CSNA3', 'ABEV3', 'SANB11', 'VIVT4', 'TIMP3', 'OIBR4', 'BRKM5']","[1.0, 1.0, 0.625, 0.25, 0.25, 0.25, 0.25, 0.25, 0.25]","0.00014096761887237555"
1.0870405486812278,"Nov 03, 2014","9","['MMXM3', 'ITUB4', 'PETR4', 'BBDC4', 'PETR3', 'ITSA4', 'BBSE3', 'BBAS3', 'PCAR4']","[0.75, -0.25, -0.25, -0.25, -0.25, -0.25, -0.25, -0.25, -0.25]","0.0002549715852015858"
0.9808850689069795,"Dec 01, 2014","9","['UGPA3', 'CIEL3', 'ABEV3', 'BBSE3', 'GOLL4', 'CSAN3', 'ECOR3', 'ELET3', 'RENT3']","[2.5, 2.25, 2.0, 2.0, 2.0, 1.75, 1.75, 1.75, 1.5]","0.00018457602025747508"
0.8946296116501409,"Jan 02, 2015","9","['MRFG3', 'ABEV3', 'EGIE3', 'CSNA3', 'BRAP4', 'GOLL4', 'ELET3', 'ECOR3', 'DTEX3']","[3.25, 1.75, 1.75, 1.75, 1.75, 1.75, 1.75, 1.5, 1.5]","0.0001595845671180549"
1.117396054941524,"Feb 02, 2015","9","['JBSS3', 'USIM5', 'BBDC4', 'ITSA4', 'CYRE3', 'ITUB4', 'PCAR4', 'CPFE3', 'CSNA3']","[1.0, 0.625, 0.0, 0.0, 0.0, -0.25, -0.25, -0.25, -0.25]","0.00013465530729571594"
1.0397578462826713,"Mar 02, 2015","9","['PETR4', 'PETR3', 'LREN3', 'USIM5', 'VIVT4', 'GGBR4', 'CMIG4', 'EGIE3', 'RENT3']","[2.0, 1.75, 1.75, 1.0, 0.25, 0.25, 0.0, 0.0, 0.0]","0.00028594072040018134"
1.0754053134195622,"Apr 01, 2015","9","['EVEN3', 'BRPR3', 'CYRE3', 'GFSA3', 'ABEV3', 'PETR4', 'CIEL3', 'BBSE3', 'JBSS3']","[1.25, 1.0, 0.75, 0.75, 0.25, 0.25, 0.25, 0.25, 0.25]","0.00015639687624116033"
0.9124627580025406,"May 04, 2015","9","['USIM5', 'ENBR3', 'ITUB4', 'ABEV3', 'BBDC4', 'PETR4', 'PCAR4', 'BRML3', 'KLBN11']","[0.75, 0.375, 0.25, 0.25, 0.25, 0.25, 0.25, 0.25, 0.25]","0.00020851637344041385"
1.0135074799661052,"Jun 01, 2015","9","['BRFS3', 'HYPE3', 'KLBN11', 'LIGT3', 'ABEV3', 'BBDC4', 'VALE3', 'PETR3', 'BBAS3']","[0.25, 0.25, 0.25, 0.25, 0.0, 0.0, 0.0, 0.0, 0.0]","0.00015294094705691882"
1.031468257824434,"Apr 02, 2018","9","['EQTL3', 'ABEV3', 'PETR4', 'PETR3', 'RENT3', 'EGIE3', 'MGLU3', 'CPLE6', 'VALE3']","[2.0, 0.25, 0.25, 0.25, 0.25, 0.25, 0.25, 0.25, 0.0]","0.0002400848936050341"
0.9253410318035185,"May 02, 2018","9","['VALE3', 'CMIG4', 'PETR4', 'PETR3', 'SANB11', 'LAME4', 'TAEE11', 'MRFG3', 'ITUB4']","[2.125, 1.75, 0.25, 0.25, 0.25, 0.25, 0.25, 0.25, 0.0]","0.0001581925361546558"
0.9498128011928224,"Jun 01, 2018","9","['BRAP4', 'CSNA3', 'BBDC3', 'WEGE3', 'SUZB3', 'MRFG3', 'BRFS3', 'GGBR4', 'LAME4']","[1.0, 0.75, 0.375, 0.25, 0.25, 0.25, 0.0, 0.0, 0.0]","0.00016774056626044795"
1.0295900256619603,"Jul 02, 2018","9","['PCAR4', 'FLRY3', 'EMBR3', 'JBSS3', 'BRKM5', 'MGLU3', 'VALE3', 'SUZB3', 'RADL3']","[2.0, 1.0, 0.25, 0.25, 0.25, 0.25, 0.0, 0.0, 0.0]","0.00020577501376735472"
0.9196655716570914,"Aug 01, 2018","9","['WEGE3', 'LAME4', 'BRML3', 'MULT3', 'ELET3', 'LREN3', 'PCAR4', 'QUAL3', 'BBAS3']","[2.0, 2.0, 2.0, 2.0, 2.0, 1.75, 1.75, 1.75, 1.25]","0.0001936996118068177"
0.9895767798723861,"Sep 03, 2018","9","['WEGE3', 'TIMP3', 'CIEL3', 'KLBN11', 'EMBR3', 'BRKM5', 'PCAR4', 'HYPE3', 'GOAU4']","[1.75, 1.75, 1.5, 1.25, 0.5, 0.5, 0.25, 0.25, 0.25]","8.039038615927923e-05"
1.086897786716203,"Oct 01, 2018","9","['LAME4', 'MULT3', 'BBAS3', 'EMBR3', 'BRAP4', 'VALE3', 'JBSS3', 'WEGE3', 'GOAU4']","[1.75, 1.75, 1.0, 1.0, 0.5, 0.25, 0.25, 0.25, 0.25]","0.0001560171943563458"
1.0631961776816143,"Nov 01, 2018","9","['QUAL3', 'PETR4', 'CMIG4', 'EGIE3', 'B3SA3', 'RAIL3', 'JBSS3', 'LAME4', 'CCRO3']","[2.0, 0.75, 0.75, 0.375, 0.25, 0.25, 0.25, 0.25, 0.25]","0.00016099733231272973"
0.9788807498616965,"Dec 03, 2018","9","['MGLU3', 'EQTL3', 'SBSP3', 'EGIE3', 'LAME4', 'RADL3', 'KLBN11', 'SAPR11', 'BBAS3']","[1.75, 1.25, 1.25, 1.125, 0.875, 0.75, 0.75, 0.625, 0.5]","nan"
1.1262760617669907,"Dec 28, 2018","9","['EMBR3', 'BRKM5', 'BBDC4', 'BBAS3', 'LREN3', 'JBSS3', 'BRFS3', 'SANB11', 'RENT3']","[1.75, 0.875, 0.25, 0.25, 0.25, 0.25, 0.25, 0.25, 0.25]","0.00017615589742500735"
1.0397964639625792,"Sep 02, 2013","9","['BTOW3', 'BRAP4', 'CIEL3', 'JBSS3', 'MRVE3', 'USIM5', 'RSID3', 'BRML3', 'CCRO3']","[0.25, 0.25, 0.25, 0.25, 0.25, 0.25, 0.25, 0.0, 0.0]","0.00024074198091230897"
1.0502958665572415,"Oct 01, 2013","9","['LIGT3', 'ELET3', 'USIM3', 'GOLL4', 'CCRO3', 'JBSS3', 'MRVE3', 'USIM5', 'RSID3']","[1.75, 0.375, 0.25, 0.25, 0.25, 0.25, 0.25, 0.25, 0.25]","0.00046183736886072933"
0.9268245070229219,"Nov 01, 2013","9","['VIVT4', 'CPLE6', 'LREN3', 'CSAN3', 'UGPA3', 'BTOW3', 'DTEX3', 'GOLL4', 'BRML3']","[1.25, 0.25, 0.25, 0.25, 0.25, 0.25, 0.25, 0.25, 0.25]","0.0001787429572254069"
1.0308548380873752,"Dec 02, 2013","9","['CCRO3', 'ABEV3', 'SBSP3', 'USIM3', 'GOAU4', 'CIEL3', 'BRKM5', 'JBSS3', 'GGBR4']","[0.75, 0.25, 0.25, 0.25, 0.25, 0.25, 0.25, 0.25, 0.25]","0.00012328460879779522"
0.9387960617376824,"Jan 02, 2014","9","['KLBN4', 'TIMP3', 'BRPR3', 'LAME4', 'CPFE3', 'TESA3', 'DASA3', 'SBSP3', 'USIM5']","[2.0, 1.75, 1.75, 1.5, 1.5, 1.5, 1.0, 0.625, 0.5]","0.0001157382807959427"
0.9321540120055991,"Feb 03, 2014","9","['USIM5', 'CSNA3', 'BTOW3', 'HYPE3', 'LIGT3', 'KLBN4', 'DASA3', 'MRFG3', 'OIBR3']","[2.0, 1.375, 1.0, 0.625, 0.5, 0.25, 0.25, 0.25, 0.25]","0.0002973089231070568"
1.0471682071094655,"Mar 05, 2014","9","['CESP6', 'BBDC3', 'TRPL4', 'GGBR4', 'GOAU4', 'DASA3', 'EMBR3', 'BTOW3', 'VALE3']","[1.75, 1.5, 1.5, 0.75, 0.75, 0.25, 0.25, 0.25, 0.0]","0.00011749398374243468"
1.02098009826063,"Apr 01, 2014","9","['USIM3', 'USIM5', 'BRFS3', 'GOLL4', 'RSID3', 'LAME4', 'CCRO3', 'BBDC3', 'ELET6']","[2.25, 2.0, 2.0, 2.0, 1.75, 0.875, 0.75, 0.75, 0.625]","0.00027629703115688225"
0.9901469136559641,"May 02, 2014","9","['HYPE3', 'CYRE3', 'RSID3', 'TIMP3', 'CESP6', 'OIBR4', 'PETR4', 'BBDC4', 'BBAS3']","[1.75, 1.75, 1.75, 1.5, 0.75, 0.625, 0.25, 0.25, 0.25]","0.00019771624667433898"
1.0096557915451279,"Jun 02, 2014","9","['SANB11', 'BBDC3', 'USIM5', 'DTEX3', 'USIM3', 'CIEL3', 'PDGR3', 'HYPE3', 'SBSP3']","[1.0, 1.0, 0.75, 0.75, 0.625, 0.25, 0.25, 0.25, 0.25]","0.00020349133127669944"
0.9922806770677419,"Jul 01, 2014","9","['MRVE3', 'CYRE3', 'CIEL3', 'BBSE3', 'BBAS3', 'CCRO3', 'CMIG4', 'TIMP3', 'LREN3']","[2.0, 1.75, 0.875, 0.25, 0.25, 0.25, 0.25, 0.25, 0.25]","0.00011699934834690866"