Date,Price,Open,High,Low
"Jun 03, 2019",30.299999237060547,30.049999237060547,30.540000915527344,29.700000762939453
"Jun 04, 2019",30.559999465942383,30.299999237060547,30.6200008392334,30.1299991607666
"Jun 05, 2019",30.790000915527344,30.75,30.899999618530273,30.479999542236328
"Jun 06, 2019",31.25,30.979999542236328,31.389999389648438,30.68000030517578
"Jun 07, 2019",30.989999771118164,31.350000381469727,31.549999237060547,30.920000076293945
"Jun 10, 2019",30.780000686645508,30.989999771118164,31.049999237060547,30.649999618530273
"Jun 11, 2019",31.149999618530273,30.989999771118164,31.469999313354492,30.799999237060547
"Jun 12, 2019",31.079999923706055,31.139999389648438,31.649999618530273,30.84000015258789
"Jun 13, 2019",30.979999542236328,31.200000762939453,31.5,30.899999618530273
"Jun 14, 2019",30.8799991607666,30.969999313354492,31.1299991607666,30.6200008392334
"Jun 17, 2019",30.899999618530273,30.989999771118164,31.110000610351562,30.700000762939453
"Jun 18, 2019",32.04999923706055,31.200000762939453,32.04999923706055,31.0
"Jun 19, 2019",31.729999542236328,32.0099983215332,32.099998474121094,31.600000381469727
"Jun 21, 2019",32.20000076293945,32.029998779296875,32.529998779296875,31.850000381469727
"Jun 24, 2019",32.11000061035156,32.45000076293945,33.099998474121094,32.11000061035156
"Jun 25, 2019",31.75,32.099998474121094,32.33000183105469,31.75
"Jun 26, 2019",32.470001220703125,31.899999618530273,32.470001220703125,31.75
"Jun 27, 2019",32.43000030517578,32.31999969482422,32.70000076293945,32.029998779296875
"Jun 28, 2019",32.380001068115234,32.599998474121094,32.72999954223633,32.380001068115234
"Jul 01, 2019",32.79999923706055,32.66999816894531,33.0,32.5099983215332
"Jul 02, 2019",32.599998474121094,32.79999923706055,32.880001068115234,32.09000015258789
"Jul 03, 2019",32.77000045776367,32.29999923706055,32.900001525878906,32.099998474121094
"Jul 04, 2019",33.09000015258789,33.0,33.349998474121094,32.86000061035156
"Jul 05, 2019",33.849998474121094,33.11000061035156,33.86000061035156,33.02000045776367
"Jul 08, 2019",33.5099983215332,33.849998474121094,33.91999816894531,33.470001220703125
"Jul 10, 2019",33.7400016784668,33.709999084472656,34.58000183105469,33.47999954223633
"Jul 11, 2019",33.16999816894531,33.70000076293945,34.290000915527344,32.97999954223633
"Jul 12, 2019",33.41999816894531,33.310001373291016,33.779998779296875,33.099998474121094
"Jul 15, 2019",33.369998931884766,33.83000183105469,33.83000183105469,33.220001220703125
"Jul 16, 2019",33.38999938964844,33.400001525878906,33.66999816894531,33.08000183105469
"Jul 17, 2019",33.810001373291016,33.400001525878906,33.810001373291016,33.2400016784668
"Jul 18, 2019",33.599998474121094,34.0099983215332,34.38999938964844,33.41999816894531
"Jul 19, 2019",32.70000076293945,33.72999954223633,33.79999923706055,32.70000076293945
"Jul 22, 2019",33.119998931884766,32.599998474121094,33.209999084472656,32.52000045776367
"Jul 23, 2019",32.869998931884766,33.29999923706055,33.52000045776367,32.7400016784668
"Jul 24, 2019",32.529998779296875,32.79999923706055,33.33000183105469,32.529998779296875
"Jul 25, 2019",32.4900016784668,32.619998931884766,32.869998931884766,32.15999984741211
"Jul 26, 2019",32.599998474121094,32.65999984741211,33.25,32.25
"Jul 29, 2019",32.61000061035156,32.599998474121094,32.970001220703125,32.22999954223633
"Jul 30, 2019",32.52000045776367,32.599998474121094,32.779998779296875,32.22999954223633
"Jul 31, 2019",32.45000076293945,32.5099983215332,32.7400016784668,32.02000045776367
"Aug 01, 2019",32.18000030517578,32.45000076293945,33.029998779296875,31.959999084472656
"Aug 02, 2019",32.400001525878906,32.209999084472656,32.4900016784668,31.920000076293945
"Aug 05, 2019",31.59000015258789,31.950000762939453,32.0,31.510000228881836
"Aug 06, 2019",32.36000061035156,31.600000381469727,32.459999084472656,31.549999237060547
"Aug 07, 2019",33.02000045776367,33.97999954223633,33.97999954223633,32.75
"Aug 08, 2019",34.439998626708984,33.400001525878906,34.58000183105469,33.29999923706055
"Aug 09, 2019",35.45000076293945,34.54999923706055,35.45000076293945,34.45000076293945
"Aug 12, 2019",33.70000076293945,34.189998626708984,34.189998626708984,33.41999816894531
"Aug 13, 2019",34.06999969482422,33.5,34.06999969482422,33.189998626708984
"Aug 14, 2019",33.34000015258789,33.58000183105469,33.939998626708984,33.189998626708984
"Aug 15, 2019",33.099998474121094,33.400001525878906,33.599998474121094,32.310001373291016
"Aug 16, 2019",33.2400016784668,33.45000076293945,33.56999969482422,33.0099983215332
"Aug 19, 2019",33.150001525878906,33.2599983215332,33.869998931884766,32.79999923706055
"Aug 20, 2019",33.08000183105469,33.150001525878906,33.22999954223633,32.5
"Aug 21, 2019",33.290000915527344,32.5,33.290000915527344,32.5
"Aug 22, 2019",32.599998474121094,33.27000045776367,33.27000045776367,32.560001373291016
"Aug 23, 2019",32.189998626708984,32.349998474121094,32.869998931884766,31.8700008392334
"Aug 26, 2019",31.8799991607666,32.79999923706055,32.970001220703125,31.809999465942383
"Aug 27, 2019",32.099998474121094,32.29999923706055,32.5,31.8700008392334
"Aug 28, 2019",32.5099983215332,31.739999771118164,32.880001068115234,31.739999771118164
"Aug 29, 2019",32.880001068115234,32.619998931884766,33.2599983215332,32.34000015258789
"Aug 30, 2019",32.66999816894531,33.2400016784668,33.2400016784668,32.619998931884766
"Sep 02, 2019",32.650001525878906,32.70000076293945,32.9900016784668,32.5099983215332
"Sep 03, 2019",32.220001220703125,32.54999923706055,32.88999938964844,32.220001220703125
"Sep 04, 2019",32.619998931884766,32.68000030517578,32.689998626708984,32.220001220703125
"Sep 05, 2019",32.81999969482422,32.720001220703125,33.2400016784668,32.529998779296875
"Sep 06, 2019",32.72999954223633,33.060001373291016,33.09000015258789,32.56999969482422
"Sep 09, 2019",32.43000030517578,32.72999954223633,33.15999984741211,32.220001220703125
"Sep 10, 2019",32.720001220703125,32.40999984741211,33.099998474121094,32.380001068115234
"Sep 11, 2019",33.4900016784668,32.790000915527344,33.4900016784668,32.7400016784668
"Sep 12, 2019",33.88999938964844,33.560001373291016,34.08000183105469,33.40999984741211
"Sep 13, 2019",33.63999938964844,33.939998626708984,33.95000076293945,33.22999954223633
"Sep 16, 2019",33.43000030517578,33.470001220703125,33.470001220703125,32.970001220703125
"Sep 17, 2019",33.720001220703125,33.119998931884766,33.900001525878906,33.029998779296875
"Sep 18, 2019",33.95000076293945,33.439998626708984,34.06999969482422,33.439998626708984
"Sep 19, 2019",34.369998931884766,34.06999969482422,34.630001068115234,34.029998779296875
"Sep 20, 2019",34.650001525878906,34.54999923706055,34.81999969482422,34.0
"Sep 23, 2019",34.529998779296875,34.630001068115234,34.7599983215332,34.060001373291016
"Sep 24, 2019",34.47999954223633,34.5,34.630001068115234,34.189998626708984
"Sep 25, 2019",34.779998779296875,34.5,34.900001525878906,34.189998626708984
"Sep 26, 2019",35.5,35.060001373291016,35.86000061035156,35.04999923706055
"Sep 27, 2019",35.65999984741211,35.5,35.869998931884766,35.349998474121094
"Sep 30, 2019",35.029998779296875,35.4900016784668,35.56999969482422,35.029998779296875
"Oct 01, 2019",34.40999984741211,35.099998474121094,35.20000076293945,34.290000915527344
"Oct 02, 2019",33.599998474121094,34.130001068115234,34.189998626708984,33.38999938964844
"Oct 03, 2019",33.43000030517578,33.720001220703125,33.849998474121094,33.20000076293945
"Oct 04, 2019",33.47999954223633,33.4900016784668,33.599998474121094,32.900001525878906
"Oct 07, 2019",32.5,33.29999923706055,33.529998779296875,32.45000076293945
"Oct 08, 2019",32.2400016784668,32.5,32.900001525878906,31.899999618530273
"Oct 09, 2019",32.79999923706055,32.43000030517578,32.959999084472656,32.310001373291016
"Oct 10, 2019",33.04999923706055,32.81999969482422,33.31999969482422,32.61000061035156
"Oct 11, 2019",34.2599983215332,33.310001373291016,34.2599983215332,33.25
"Oct 14, 2019",34.2599983215332,34.29999923706055,34.439998626708984,33.810001373291016
"Oct 15, 2019",34.40999984741211,34.310001373291016,34.77000045776367,34.16999816894531
"Oct 16, 2019",34.88999938964844,34.45000076293945,34.97999954223633,34.18000030517578
"Oct 17, 2019",35.06999969482422,34.7400016784668,35.5,34.7400016784668
"Oct 18, 2019",34.459999084472656,34.880001068115234,35.18000030517578,34.459999084472656
"Oct 21, 2019",34.79999923706055,34.439998626708984,34.88999938964844,34.31999969482422
"Oct 22, 2019",35.349998474121094,34.83000183105469,35.36000061035156,34.63999938964844
"Oct 23, 2019",35.540000915527344,35.2400016784668,35.810001373291016,35.06999969482422
"Oct 24, 2019",35.650001525878906,35.5,35.790000915527344,35.38999938964844
"Oct 25, 2019",35.189998626708984,35.70000076293945,35.75,35.130001068115234
"Oct 28, 2019",34.779998779296875,35.150001525878906,35.68000030517578,34.779998779296875
"Oct 29, 2019",34.18000030517578,34.779998779296875,34.79999923706055,34.060001373291016
"Oct 30, 2019",34.0,34.15999984741211,34.36000061035156,33.650001525878906
"Oct 31, 2019",33.970001220703125,33.79999923706055,34.150001525878906,33.45000076293945
"Nov 01, 2019",34.31999969482422,34.11000061035156,34.38999938964844,33.90999984741211
"Nov 04, 2019",33.619998931884766,35.13999938964844,35.13999938964844,33.36000061035156
"Nov 05, 2019",34.45000076293945,33.709999084472656,34.599998474121094,33.650001525878906
"Nov 06, 2019",35.369998931884766,34.59000015258789,35.380001068115234,34.11000061035156
"Nov 07, 2019",35.459999084472656,35.470001220703125,35.619998931884766,35.13999938964844
"Nov 08, 2019",34.689998626708984,35.29999923706055,35.31999969482422,34.349998474121094
"Nov 11, 2019",34.58000183105469,34.70000076293945,34.75,34.209999084472656
"Nov 12, 2019",34.15999984741211,34.279998779296875,34.599998474121094,33.779998779296875
"Nov 13, 2019",34.209999084472656,33.84000015258789,34.54999923706055,33.709999084472656
"Nov 14, 2019",34.400001525878906,34.20000076293945,34.40999984741211,33.97999954223633
"Nov 18, 2019",33.900001525878906,34.2599983215332,34.68000030517578,33.75
"Nov 19, 2019",34.029998779296875,33.900001525878906,34.15999984741211,33.81999969482422
"Nov 21, 2019",35.150001525878906,34.0,35.369998931884766,33.959999084472656
"Nov 22, 2019",35.20000076293945,35.150001525878906,35.5,34.97999954223633
"Nov 25, 2019",34.61000061035156,34.54999923706055,34.95000076293945,34.54999923706055
"Nov 26, 2019",33.88999938964844,34.59000015258789,34.61000061035156,33.88999938964844
"Nov 27, 2019",33.95000076293945,33.880001068115234,34.47999954223633,33.61000061035156
"Nov 28, 2019",34.470001220703125,33.95000076293945,34.630001068115234,33.95000076293945
"Nov 29, 2019",34.45000076293945,34.779998779296875,34.79999923706055,34.189998626708984
"Dec 02, 2019",34.52000045776367,34.68000030517578,35.0,34.47999954223633
"Dec 03, 2019",35.86000061035156,34.54999923706055,36.06999969482422,34.54999923706055
"Dec 04, 2019",36.11000061035156,35.900001525878906,36.47999954223633,35.810001373291016
"Dec 05, 2019",36.70000076293945,36.11000061035156,37.0,36.0099983215332
"Dec 06, 2019",36.720001220703125,37.0,37.09000015258789,36.52000045776367
"Dec 09, 2019",36.619998931884766,36.70000076293945,36.97999954223633,36.52000045776367
"Dec 10, 2019",36.189998626708984,36.459999084472656,36.5,35.939998626708984
"Dec 11, 2019",36.349998474121094,36.38999938964844,36.70000076293945,36.209999084472656
"Dec 12, 2019",36.5,36.599998474121094,36.83000183105469,36.22999954223633
"Dec 13, 2019",37.349998474121094,36.7400016784668,37.349998474121094,36.470001220703125
"Dec 16, 2019",36.81999969482422,37.45000076293945,37.599998474121094,36.81999969482422
"Dec 17, 2019",37.54999923706055,36.83000183105469,37.65999984741211,36.83000183105469
"Dec 18, 2019",38.029998779296875,37.5,38.150001525878906,37.40999984741211
"Dec 19, 2019",38.29999923706055,37.5,38.29999923706055,37.4900016784668
"Dec 20, 2019",37.7400016784668,38.29999923706055,38.29999923706055,37.7400016784668
"Dec 23, 2019",37.95000076293945,37.7599983215332,38.18000030517578,37.63999938964844
"Dec 26, 2019",37.7599983215332,37.939998626708984,38.0,37.599998474121094
"Dec 27, 2019",37.84000015258789,37.9900016784668,38.29999923706055,37.56999969482422
"Dec 30, 2019",37.70000076293945,37.90999984741211,38.15999984741211,37.650001525878906
"Jan 02, 2020",38.099998474121094,38.0,38.38999938964844,37.90999984741211
"Jan 03, 2020",37.68000030517578,37.93000030517578,38.880001068115234,37.61000061035156
"Jan 06, 2020",38.29999923706055,37.9900016784668,38.34000015258789,37.7599983215332
"Jan 07, 2020",38.31999969482422,38.70000076293945,38.810001373291016,38.189998626708984
"Jan 08, 2020",38.29999923706055,38.630001068115234,38.650001525878906,38.11000061035156
"Jan 09, 2020",38.189998626708984,38.349998474121094,38.650001525878906,37.869998931884766
"Jan 10, 2020",36.400001525878906,36.93000030517578,37.150001525878906,36.130001068115234
"Jan 13, 2020",36.130001068115234,36.43000030517578,36.66999816894531,35.709999084472656
"Jan 14, 2020",36.560001373291016,36.16999816894531,36.63999938964844,36.119998931884766
"Jan 15, 2020",36.599998474121094,36.650001525878906,36.95000076293945,36.40999984741211
"Jan 16, 2020",36.06999969482422,36.84000015258789,36.869998931884766,36.029998779296875
"Jan 17, 2020",36.13999938964844,36.220001220703125,36.599998474121094,36.04999923706055
"Jan 20, 2020",36.15999984741211,36.25,36.41999816894531,35.93000030517578
"Jan 21, 2020",36.0,36.06999969482422,36.5,35.88999938964844
"Jan 22, 2020",36.189998626708984,35.90999984741211,36.43000030517578,35.900001525878906
"Jan 23, 2020",36.2400016784668,35.95000076293945,36.2599983215332,35.349998474121094
"Jan 24, 2020",35.900001525878906,36.2599983215332,36.34000015258789,35.66999816894531
"Jan 27, 2020",35.0,35.52000045776367,35.79999923706055,34.84000015258789
"Jan 28, 2020",35.0099983215332,35.04999923706055,35.2599983215332,34.77000045776367
"Jan 29, 2020",35.619998931884766,35.15999984741211,35.9900016784668,34.93000030517578
"Jan 30, 2020",35.61000061035156,35.02000045776367,35.880001068115234,34.880001068115234
"Jan 31, 2020",34.779998779296875,35.27000045776367,35.439998626708984,34.599998474121094
"Feb 03, 2020",34.93000030517578,34.900001525878906,35.459999084472656,34.400001525878906
"Feb 04, 2020",34.45000076293945,35.380001068115234,35.459999084472656,34.45000076293945
"Feb 05, 2020",34.630001068115234,34.900001525878906,35.20000076293945,34.5099983215332
"Feb 06, 2020",34.79999923706055,34.95000076293945,35.58000183105469,34.54999923706055
"Feb 07, 2020",35.36000061035156,34.5099983215332,35.97999954223633,34.5099983215332
"Feb 10, 2020",35.81999969482422,36.04999923706055,36.13999938964844,35.38999938964844
"Feb 11, 2020",36.869998931884766,36.349998474121094,37.380001068115234,36.29999923706055
"Feb 12, 2020",37.150001525878906,37.20000076293945,37.79999923706055,36.7599983215332
"Feb 13, 2020",37.2400016784668,37.150001525878906,37.5099983215332,36.70000076293945
"Feb 14, 2020",34.47999954223633,35.0,35.220001220703125,34.47999954223633
"Feb 17, 2020",33.72999954223633,34.66999816894531,34.66999816894531,33.529998779296875
"Feb 18, 2020",33.33000183105469,33.599998474121094,33.599998474121094,32.90999984741211
"Feb 19, 2020",33.97999954223633,33.40999984741211,34.08000183105469,33.25
"Feb 20, 2020",33.439998626708984,34.06999969482422,34.119998931884766,33.380001068115234
"Feb 21, 2020",33.0,33.29999923706055,33.31999969482422,32.529998779296875
"Feb 27, 2020",31.469999313354492,31.549999237060547,32.43000030517578,31.3700008392334
"Feb 28, 2020",31.850000381469727,31.600000381469727,31.850000381469727,30.690000534057617
"Mar 02, 2020",31.600000381469727,31.850000381469727,32.040000915527344,31.299999237060547
"Mar 03, 2020",30.6299991607666,31.56999969482422,31.920000076293945,30.600000381469727
"Mar 04, 2020",31.040000915527344,31.190000534057617,31.479999542236328,30.6299991607666
"Mar 05, 2020",30.440000534057617,31.0,31.25,30.40999984741211
"Mar 06, 2020",30.479999542236328,29.530000686645508,30.81999969482422,28.329999923706055
"Mar 09, 2020",28.389999389648438,29.0,29.489999771118164,28.389999389648438
"Mar 10, 2020",29.0,29.0,29.56999969482422,28.030000686645508
"Mar 11, 2020",27.780000686645508,28.489999771118164,28.6200008392334,26.440000534057617
"Mar 12, 2020",25.209999084472656,26.0,26.850000381469727,23.93000030517578
"Mar 13, 2020",26.610000610351562,27.5,28.059999465942383,24.530000686645508
"Mar 16, 2020",24.079999923706055,23.549999237060547,25.469999313354492,23.549999237060547
"Mar 17, 2020",26.670000076293945,24.309999465942383,27.579999923706055,24.139999389648438
"Mar 18, 2020",26.850000381469727,24.399999618530273,27.200000762939453,24.399999618530273
"Mar 19, 2020",24.469999313354492,25.93000030517578,26.68000030517578,24.309999465942383
"Mar 20, 2020",24.489999771118164,25.5,25.75,22.899999618530273
"Mar 23, 2020",22.399999618530273,24.100000381469727,24.100000381469727,22.040000915527344
"Mar 24, 2020",24.709999084472656,23.610000610351562,25.950000762939453,23.559999465942383
"Mar 25, 2020",26.540000915527344,24.229999542236328,28.600000381469727,24.229999542236328
"Mar 26, 2020",26.549999237060547,26.540000915527344,27.440000534057617,25.969999313354492
"Mar 27, 2020",24.5,25.34000015258789,25.670000076293945,24.309999465942383
"Mar 30, 2020",24.790000915527344,24.440000534057617,25.549999237060547,24.030000686645508
"Mar 31, 2020",24.850000381469727,24.780000686645508,25.3799991607666,24.010000228881836
"Apr 01, 2020",24.059999465942383,24.1299991607666,24.639999389648438,23.479999542236328
"Apr 02, 2020",23.479999542236328,24.040000915527344,24.829999923706055,23.479999542236328
"Apr 03, 2020",23.290000915527344,23.530000686645508,23.81999969482422,22.1299991607666
"Apr 06, 2020",23.6299991607666,24.510000228881836,25.010000228881836,23.579999923706055
"Apr 07, 2020",24.979999542236328,25.299999237060547,26.049999237060547,24.770000457763672
"Apr 08, 2020",25.510000228881836,25.1200008392334,25.81999969482422,24.600000381469727
"Apr 09, 2020",25.780000686645508,25.790000915527344,26.280000686645508,25.40999984741211
"Apr 13, 2020",26.09000015258789,25.81999969482422,26.399999618530273,25.200000762939453
"Apr 14, 2020",26.139999389648438,26.399999618530273,27.020000457763672,25.600000381469727
"Apr 15, 2020",26.209999084472656,25.850000381469727,27.059999465942383,25.530000686645508
"Apr 16, 2020",25.799999237060547,26.600000381469727,26.979999542236328,25.729999542236328
"Apr 17, 2020",25.920000076293945,26.389999389648438,26.56999969482422,25.329999923706055
"Apr 20, 2020",26.25,25.6299991607666,26.90999984741211,25.399999618530273
"Apr 22, 2020",26.950000762939453,26.18000030517578,26.950000762939453,26.040000915527344
"Apr 23, 2020",26.18000030517578,26.899999618530273,27.350000381469727,25.760000228881836
"Apr 24, 2020",24.399999618530273,25.579999923706055,25.950000762939453,23.559999465942383
"Apr 27, 2020",25.299999237060547,24.75,26.170000076293945,24.75
"Apr 28, 2020",25.260000228881836,26.450000762939453,26.450000762939453,25.1299991607666
"Apr 29, 2020",26.0,25.690000534057617,26.09000015258789,25.200000762939453
"Apr 30, 2020",26.549999237060547,25.329999923706055,26.65999984741211,25.329999923706055
"May 04, 2020",25.299999237060547,25.440000534057617,25.6200008392334,24.829999923706055
"May 05, 2020",24.899999618530273,25.709999084472656,25.90999984741211,24.899999618530273
"May 06, 2020",24.520000457763672,24.90999984741211,25.06999969482422,24.149999618530273
"May 07, 2020",23.489999771118164,24.34000015258789,24.459999084472656,23.170000076293945
"May 08, 2020",23.270000457763672,24.149999618530273,24.360000610351562,23.110000610351562
"May 11, 2020",23.549999237060547,23.3700008392334,24.0,23.18000030517578
"May 12, 2020",22.850000381469727,23.829999923706055,24.040000915527344,22.850000381469727
"May 13, 2020",23.110000610351562,22.950000762939453,23.1299991607666,22.639999389648438
"May 14, 2020",23.709999084472656,23.25,23.709999084472656,22.799999237060547
"May 15, 2020",22.59000015258789,23.299999237060547,23.510000228881836,22.3799991607666
"May 18, 2020",23.5,23.139999389648438,23.850000381469727,22.709999084472656
"May 19, 2020",23.479999542236328,23.59000015258789,24.18000030517578,23.100000381469727
"May 20, 2020",23.530000686645508,23.5,24.110000610351562,23.219999313354492
"May 21, 2020",24.149999618530273,23.84000015258789,24.329999923706055,23.540000915527344
"May 22, 2020",23.510000228881836,24.270000457763672,24.93000030517578,23.510000228881836
"May 25, 2020",24.649999618530273,24.5,24.979999542236328,24.290000915527344
"May 26, 2020",25.18000030517578,25.350000381469727,25.639999389648438,24.950000762939453
"May 27, 2020",25.299999237060547,25.549999237060547,25.600000381469727,25.200000762939453
"May 28, 2020",25.610000610351562,25.350000381469727,26.139999389648438,25.100000381469727
"May 29, 2020",25.280000686645508,25.549999237060547,25.59000015258789,24.90999984741211
"Jun 01, 2020",25.649999618530273,25.3799991607666,25.920000076293945,25.229999542236328
"Jun 02, 2020",26.510000228881836,25.850000381469727,26.510000228881836,25.81999969482422
"Jun 03, 2020",27.889999389648438,27.0,28.68000030517578,26.780000686645508
"Jun 04, 2020",28.049999237060547,27.700000762939453,28.1200008392334,27.450000762939453
"Jun 05, 2020",28.489999771118164,28.760000228881836,29.239999771118164,28.1299991607666
"Jun 08, 2020",28.399999618530273,28.600000381469727,28.799999237060547,28.110000610351562
"Jun 09, 2020",27.6200008392334,27.93000030517578,28.06999969482422,27.6200008392334
"Jun 10, 2020",26.850000381469727,27.90999984741211,28.0,26.850000381469727
"Jun 12, 2020",26.420000076293945,26.489999771118164,26.520000457763672,25.799999237060547
"Jun 15, 2020",26.350000381469727,26.049999237060547,26.860000610351562,25.600000381469727
"Jun 16, 2020",26.149999618530273,26.8700008392334,26.969999313354492,25.760000228881836
"Jun 17, 2020",27.09000015258789,26.270000457763672,27.399999618530273,26.18000030517578
"Jun 18, 2020",27.81999969482422,26.610000610351562,28.079999923706055,26.559999465942383
"Jun 19, 2020",28.790000915527344,28.15999984741211,29.459999084472656,28.15999984741211
"Jun 22, 2020",28.829999923706055,28.8700008392334,29.059999465942383,28.389999389648438
"Jun 23, 2020",28.75,29.459999084472656,29.489999771118164,28.75
"Jun 24, 2020",28.3700008392334,28.600000381469727,28.920000076293945,28.170000076293945
"Jun 25, 2020",29.0,28.3700008392334,29.030000686645508,28.329999923706055
"Jun 26, 2020",27.850000381469727,28.510000228881836,28.920000076293945,27.809999465942383
"Jun 29, 2020",28.25,28.100000381469727,28.65999984741211,27.969999313354492
"Jun 30, 2020",27.270000457763672,28.040000915527344,28.270000457763672,27.270000457763672
"Jul 01, 2020",27.700000762939453,27.690000534057617,28.010000228881836,27.34000015258789
"Jul 02, 2020",27.530000686645508,28.200000762939453,28.200000762939453,27.43000030517578
"Jul 03, 2020",27.760000228881836,27.540000915527344,28.100000381469727,27.469999313354492
"Jul 06, 2020",28.030000686645508,28.25,28.5,27.760000228881836
"Jul 07, 2020",27.799999237060547,28.020000457763672,28.239999771118164,27.530000686645508
"Jul 08, 2020",28.34000015258789,28.049999237060547,28.649999618530273,27.719999313354492
"Jul 09, 2020",28.049999237060547,28.489999771118164,28.489999771118164,27.729999542236328
"Jul 10, 2020",27.719999313354492,28.110000610351562,28.25,27.510000228881836
"Jul 13, 2020",27.3799991607666,27.899999618530273,28.079999923706055,27.3799991607666
"Jul 14, 2020",27.309999465942383,27.399999618530273,27.690000534057617,27.0
"Jul 15, 2020",27.559999465942383,27.530000686645508,27.760000228881836,27.260000228881836
"Jul 16, 2020",27.399999618530273,27.440000534057617,27.700000762939453,27.299999237060547
"Jul 17, 2020",27.549999237060547,27.420000076293945,27.780000686645508,27.420000076293945
"Jul 20, 2020",28.309999465942383,27.600000381469727,28.56999969482422,27.469999313354492
"Jul 21, 2020",28.209999084472656,28.6200008392334,28.90999984741211,27.989999771118164
"Jul 22, 2020",28.329999923706055,28.260000228881836,28.6200008392334,28.030000686645508
"Jul 23, 2020",27.8700008392334,28.489999771118164,28.489999771118164,27.75
"Jul 24, 2020",28.0,27.829999923706055,28.25,27.670000076293945
"Jul 27, 2020",28.489999771118164,28.049999237060547,28.75,28.010000228881836
"Jul 28, 2020",28.06999969482422,28.709999084472656,28.969999313354492,28.06999969482422
"Jul 29, 2020",28.239999771118164,28.219999313354492,28.479999542236328,28.06999969482422
"Jul 30, 2020",28.06999969482422,28.09000015258789,28.209999084472656,27.850000381469727
"Jul 31, 2020",27.829999923706055,28.31999969482422,28.34000015258789,27.559999465942383
"Aug 03, 2020",28.270000457763672,28.200000762939453,28.690000534057617,27.6200008392334
"Aug 04, 2020",28.100000381469727,28.350000381469727,29.3700008392334,27.950000762939453
"Aug 05, 2020",28.209999084472656,28.56999969482422,29.049999237060547,28.030000686645508
"Aug 06, 2020",28.770000457763672,28.329999923706055,28.989999771118164,28.1200008392334
"Aug 07, 2020",28.549999237060547,28.75,29.139999389648438,28.479999542236328
"Aug 10, 2020",28.739999771118164,28.799999237060547,28.959999084472656,28.450000762939453
"Aug 11, 2020",28.90999984741211,29.049999237060547,29.25,28.90999984741211
"Aug 12, 2020",28.950000762939453,29.200000762939453,29.770000457763672,28.81999969482422
"Aug 13, 2020",27.100000381469727,28.0,28.280000686645508,27.100000381469727
"Aug 14, 2020",27.040000915527344,27.0,27.31999969482422,26.860000610351562
"Aug 17, 2020",26.25,27.010000228881836,27.270000457763672,26.059999465942383
"Aug 18, 2020",27.020000457763672,26.799999237060547,27.110000610351562,26.209999084472656
"Aug 19, 2020",26.520000457763672,27.219999313354492,27.229999542236328,26.520000457763672
"Aug 20, 2020",26.479999542236328,26.190000534057617,26.639999389648438,26.100000381469727
"Aug 21, 2020",26.6299991607666,26.489999771118164,26.6299991607666,26.290000915527344
"Aug 24, 2020",26.489999771118164,26.700000762939453,26.899999618530273,26.459999084472656
"Aug 25, 2020",26.75,26.729999542236328,26.809999465942383,26.479999542236328
"Aug 26, 2020",26.329999923706055,26.75,26.75,25.959999084472656
"Aug 27, 2020",26.5,26.329999923706055,26.549999237060547,26.059999465942383
"Aug 28, 2020",27.549999237060547,26.5,27.860000610351562,26.5
"Aug 31, 2020",26.3799991607666,27.420000076293945,27.489999771118164,26.3799991607666
