Date,Price,Open,High,Low
"Jun 03, 2019",10.390000343322754,10.279999732971191,10.479999542236328,10.229999542236328
"Jun 04, 2019",10.649999618530273,10.399999618530273,10.729999542236328,10.279999732971191
"Jun 05, 2019",10.489999771118164,10.699999809265137,10.800000190734863,10.390000343322754
"Jun 06, 2019",10.220000267028809,10.5,10.569999694824219,10.15999984741211
"Jun 07, 2019",10.5,10.25,10.65999984741211,10.210000038146973
"Jun 10, 2019",10.4399995803833,10.430000305175781,10.479999542236328,10.25
"Jun 11, 2019",10.399999618530273,10.5,10.550000190734863,10.3100004196167
"Jun 12, 2019",10.350000381469727,10.359999656677246,10.600000381469727,10.220000267028809
"Jun 13, 2019",10.550000190734863,10.390000343322754,10.819999694824219,10.350000381469727
"Jun 14, 2019",10.479999542236328,10.5,10.640000343322754,10.329999923706055
"Jun 17, 2019",10.1899995803833,10.539999961853027,10.539999961853027,10.1899995803833
"Jun 18, 2019",10.25,10.300000190734863,10.350000381469727,10.100000381469727
"Jun 19, 2019",10.489999771118164,10.270000457763672,10.489999771118164,10.010000228881836
"Jun 21, 2019",10.869999885559082,10.489999771118164,10.899999618530273,10.369999885559082
"Jun 24, 2019",10.930000305175781,10.850000381469727,11.09000015258789,10.720000267028809
"Jun 25, 2019",10.65999984741211,11.0,11.100000381469727,10.609999656677246
"Jun 26, 2019",10.609999656677246,10.770000457763672,10.829999923706055,10.460000038146973
"Jun 27, 2019",10.9399995803833,10.510000228881836,10.9399995803833,10.470000267028809
"Jun 28, 2019",10.970000267028809,11.0,11.0,10.84000015258789
"Jul 01, 2019",10.850000381469727,11.0,11.100000381469727,10.739999771118164
"Jul 02, 2019",11.100000381469727,10.800000190734863,11.100000381469727,10.789999961853027
"Jul 03, 2019",11.239999771118164,11.039999961853027,11.420000076293945,11.039999961853027
"Jul 04, 2019",11.569999694824219,11.09000015258789,11.569999694824219,11.09000015258789
"Jul 05, 2019",11.699999809265137,11.470000267028809,11.699999809265137,11.329999923706055
"Jul 08, 2019",12.380000114440918,11.699999809265137,12.430000305175781,11.5600004196167
"Jul 10, 2019",12.329999923706055,12.399999618530273,12.449999809265137,12.069999694824219
"Jul 11, 2019",11.819999694824219,12.300000190734863,12.3100004196167,11.770000457763672
"Jul 12, 2019",11.449999809265137,11.850000381469727,11.970000267028809,11.449999809265137
"Jul 15, 2019",11.65999984741211,11.579999923706055,11.800000190734863,11.34000015258789
"Jul 16, 2019",11.75,11.739999771118164,11.779999732971191,11.4399995803833
"Jul 17, 2019",12.0,11.760000228881836,12.390000343322754,11.739999771118164
"Jul 18, 2019",12.600000381469727,12.119999885559082,12.6899995803833,12.0
"Jul 19, 2019",12.600000381469727,12.59000015258789,12.680000305175781,12.40999984741211
"Jul 22, 2019",12.520000457763672,12.619999885559082,12.680000305175781,12.270000457763672
"Jul 23, 2019",12.449999809265137,12.5,12.550000190734863,12.220000267028809
"Jul 24, 2019",12.300000190734863,12.350000381469727,12.470000267028809,12.180000305175781
"Jul 25, 2019",12.239999771118164,12.300000190734863,12.399999618530273,12.09000015258789
"Jul 26, 2019",12.539999961853027,12.350000381469727,12.609999656677246,12.239999771118164
"Jul 29, 2019",12.420000076293945,12.5,12.649999618530273,12.279999732971191
"Jul 30, 2019",12.279999732971191,12.420000076293945,12.489999771118164,12.130000114440918
"Jul 31, 2019",12.5600004196167,12.329999923706055,12.5600004196167,12.239999771118164
"Aug 01, 2019",13.170000076293945,12.630000114440918,13.1899995803833,12.619999885559082
"Aug 02, 2019",13.65999984741211,13.390000343322754,13.65999984741211,12.960000038146973
"Aug 05, 2019",12.979999542236328,13.390000343322754,13.390000343322754,12.75
"Aug 06, 2019",13.210000038146973,13.239999771118164,13.239999771118164,12.760000228881836
"Aug 07, 2019",12.949999809265137,13.09000015258789,13.119999885559082,12.770000457763672
"Aug 08, 2019",13.050000190734863,13.069999694824219,13.079999923706055,12.829999923706055
"Aug 09, 2019",13.319999694824219,13.069999694824219,13.319999694824219,12.890000343322754
"Aug 12, 2019",13.100000381469727,13.050000190734863,13.100000381469727,12.800000190734863
"Aug 13, 2019",12.899999618530273,12.930000305175781,13.260000228881836,12.8100004196167
"Aug 14, 2019",11.40999984741211,12.5,12.5,11.40999984741211
"Aug 15, 2019",10.75,11.5,11.5600004196167,10.680000305175781
"Aug 16, 2019",10.720000267028809,10.899999618530273,10.9399995803833,10.300000190734863
"Aug 19, 2019",10.789999961853027,10.720000267028809,11.039999961853027,10.529999732971191
"Aug 20, 2019",11.130000114440918,10.779999732971191,11.239999771118164,10.470000267028809
"Aug 21, 2019",11.149999618530273,11.279999732971191,11.369999885559082,10.949999809265137
"Aug 22, 2019",10.65999984741211,11.119999885559082,11.119999885559082,10.65999984741211
"Aug 23, 2019",10.270000457763672,10.539999961853027,10.649999618530273,10.210000038146973
"Aug 26, 2019",9.850000381469727,10.369999885559082,10.40999984741211,9.829999923706055
"Aug 27, 2019",9.760000228881836,9.9399995803833,10.15999984741211,9.550000190734863
"Aug 28, 2019",9.859999656677246,9.699999809265137,9.989999771118164,9.369999885559082
"Aug 29, 2019",10.1899995803833,10.0,10.319999694824219,9.779999732971191
"Aug 30, 2019",10.079999923706055,10.25,10.319999694824219,9.960000038146973
"Sep 02, 2019",10.069999694824219,10.149999618530273,10.270000457763672,10.029999732971191
"Sep 03, 2019",10.050000190734863,10.09000015258789,10.470000267028809,9.970000267028809
"Sep 04, 2019",10.279999732971191,10.180000305175781,10.34000015258789,10.149999618530273
"Sep 05, 2019",10.329999923706055,10.359999656677246,10.680000305175781,10.329999923706055
"Sep 06, 2019",10.399999618530273,10.420000076293945,10.529999732971191,10.210000038146973
"Sep 09, 2019",10.350000381469727,10.399999618530273,10.420000076293945,10.180000305175781
"Sep 10, 2019",10.6899995803833,10.5600004196167,10.920000076293945,10.399999618530273
"Sep 11, 2019",10.529999732971191,10.75,10.869999885559082,10.529999732971191
"Sep 12, 2019",11.130000114440918,10.65999984741211,11.130000114440918,10.510000228881836
"Sep 13, 2019",10.720000267028809,11.100000381469727,11.319999694824219,10.6899995803833
"Sep 16, 2019",11.270000457763672,10.800000190734863,11.289999961853027,10.619999885559082
"Sep 17, 2019",11.300000190734863,11.15999984741211,11.390000343322754,11.0600004196167
"Sep 18, 2019",11.279999732971191,11.300000190734863,11.399999618530273,11.149999618530273
"Sep 19, 2019",11.289999961853027,11.359999656677246,11.699999809265137,11.289999961853027
"Sep 20, 2019",11.260000228881836,11.199999809265137,11.460000038146973,11.069999694824219
"Sep 23, 2019",11.430000305175781,11.260000228881836,11.5600004196167,11.1899995803833
"Sep 24, 2019",11.649999618530273,11.550000190734863,11.65999984741211,11.449999809265137
"Sep 25, 2019",11.300000190734863,11.619999885559082,11.760000228881836,11.199999809265137
"Sep 26, 2019",11.399999618530273,11.40999984741211,11.470000267028809,11.229999542236328
"Sep 27, 2019",11.300000190734863,11.369999885559082,11.5,11.229999542236328
"Sep 30, 2019",11.180000305175781,11.350000381469727,11.399999618530273,11.109999656677246
"Oct 01, 2019",11.109999656677246,11.229999542236328,11.289999961853027,10.920000076293945
"Oct 02, 2019",10.800000190734863,10.960000038146973,10.989999771118164,10.619999885559082
"Oct 03, 2019",10.90999984741211,10.800000190734863,10.90999984741211,10.59000015258789
"Oct 04, 2019",11.100000381469727,10.920000076293945,11.170000076293945,10.630000114440918
"Oct 07, 2019",10.800000190734863,11.020000457763672,11.25,10.770000457763672
"Oct 08, 2019",10.399999618530273,10.859999656677246,10.859999656677246,10.319999694824219
"Oct 09, 2019",10.550000190734863,10.470000267028809,10.710000038146973,10.359999656677246
"Oct 10, 2019",10.380000114440918,10.619999885559082,10.960000038146973,10.380000114440918
"Oct 11, 2019",10.649999618530273,10.5,10.75,10.420000076293945
"Oct 14, 2019",10.670000076293945,10.649999618530273,10.670000076293945,10.470000267028809
"Oct 15, 2019",10.510000228881836,10.649999618530273,10.819999694824219,10.3100004196167
"Oct 16, 2019",10.479999542236328,10.470000267028809,10.579999923706055,10.350000381469727
"Oct 17, 2019",10.779999732971191,10.479999542236328,10.850000381469727,10.470000267028809
"Oct 18, 2019",10.75,10.899999618530273,10.970000267028809,10.619999885559082
"Oct 21, 2019",10.609999656677246,10.720000267028809,10.800000190734863,10.609999656677246
"Oct 22, 2019",10.789999961853027,10.649999618530273,10.789999961853027,10.520000457763672
"Oct 23, 2019",10.4399995803833,10.760000228881836,10.760000228881836,10.399999618530273
"Oct 24, 2019",9.949999809265137,10.5,10.5,9.859999656677246
"Oct 25, 2019",9.789999961853027,9.970000267028809,10.09000015258789,9.75
"Oct 28, 2019",9.770000457763672,9.800000190734863,9.949999809265137,9.729999542236328
"Oct 29, 2019",9.539999961853027,9.760000228881836,9.829999923706055,9.539999961853027
"Oct 30, 2019",9.600000381469727,9.789999961853027,9.789999961853027,9.510000228881836
"Oct 31, 2019",9.670000076293945,9.649999618530273,9.770000457763672,9.550000190734863
"Nov 01, 2019",9.850000381469727,9.699999809265137,9.989999771118164,9.649999618530273
"Nov 04, 2019",9.890000343322754,9.859999656677246,9.989999771118164,9.789999961853027
"Nov 05, 2019",9.899999618530273,9.930000305175781,9.949999809265137,9.760000228881836
"Nov 06, 2019",9.859999656677246,9.9399995803833,9.979999542236328,9.75
"Nov 07, 2019",10.0,9.880000114440918,10.0,9.829999923706055
"Nov 08, 2019",9.819999694824219,9.920000076293945,10.020000457763672,9.770000457763672
"Nov 11, 2019",9.800000190734863,9.800000190734863,9.899999618530273,9.670000076293945
"Nov 12, 2019",9.5,9.75,9.789999961853027,9.420000076293945
"Nov 13, 2019",9.670000076293945,9.390000343322754,9.880000114440918,9.359999656677246
"Nov 14, 2019",10.289999961853027,9.670000076293945,10.289999961853027,9.670000076293945
"Nov 18, 2019",10.300000190734863,10.380000114440918,10.479999542236328,10.199999809265137
"Nov 19, 2019",10.260000228881836,10.380000114440918,10.380000114440918,10.119999885559082
"Nov 21, 2019",10.539999961853027,10.100000381469727,10.859999656677246,9.960000038146973
"Nov 22, 2019",10.449999809265137,10.539999961853027,10.720000267028809,10.369999885559082
"Nov 25, 2019",10.359999656677246,10.4399995803833,10.5,10.25
"Nov 26, 2019",9.949999809265137,10.260000228881836,10.319999694824219,9.949999809265137
"Nov 27, 2019",10.069999694824219,10.0,10.069999694824219,9.819999694824219
"Nov 28, 2019",10.270000457763672,10.119999885559082,10.350000381469727,9.989999771118164
"Nov 29, 2019",10.25,10.319999694824219,10.420000076293945,10.210000038146973
"Dec 02, 2019",10.4399995803833,10.220000267028809,10.479999542236328,10.220000267028809
"Dec 03, 2019",10.489999771118164,10.5,10.59000015258789,10.359999656677246
"Dec 04, 2019",10.619999885559082,10.489999771118164,10.720000267028809,10.489999771118164
"Dec 05, 2019",10.65999984741211,10.600000381469727,10.880000114440918,10.600000381469727
"Dec 06, 2019",10.9399995803833,10.729999542236328,11.039999961853027,10.569999694824219
"Dec 09, 2019",10.989999771118164,10.979999542236328,11.34000015258789,10.899999618530273
"Dec 10, 2019",11.15999984741211,11.0,11.300000190734863,10.859999656677246
"Dec 11, 2019",11.949999809265137,11.15999984741211,11.949999809265137,11.140000343322754
"Dec 12, 2019",12.100000381469727,11.90999984741211,12.100000381469727,11.670000076293945
"Dec 13, 2019",12.199999809265137,12.130000114440918,12.4399995803833,12.039999961853027
"Dec 16, 2019",12.100000381469727,12.199999809265137,12.359999656677246,12.050000190734863
"Dec 17, 2019",12.0,12.0,12.25,11.829999923706055
"Dec 18, 2019",11.640000343322754,11.989999771118164,12.0,11.520000457763672
"Dec 19, 2019",11.210000038146973,11.569999694824219,11.569999694824219,11.020000457763672
"Dec 20, 2019",10.890000343322754,11.279999732971191,11.34000015258789,10.890000343322754
"Dec 23, 2019",11.199999809265137,10.989999771118164,11.210000038146973,10.949999809265137
"Dec 26, 2019",11.600000381469727,11.25,11.720000267028809,11.220000267028809
"Dec 27, 2019",11.609999656677246,11.680000305175781,11.760000228881836,11.420000076293945
"Dec 30, 2019",11.430000305175781,11.680000305175781,11.729999542236328,11.380000114440918
"Jan 02, 2020",12.199999809265137,11.550000190734863,12.199999809265137,11.460000038146973
"Jan 03, 2020",12.149999618530273,11.869999885559082,12.369999885559082,11.819999694824219
"Jan 06, 2020",11.989999771118164,12.0,12.069999694824219,11.699999809265137
"Jan 07, 2020",12.079999923706055,11.989999771118164,12.210000038146973,11.75
"Jan 08, 2020",12.0,12.180000305175781,12.270000457763672,11.899999618530273
"Jan 09, 2020",12.100000381469727,12.100000381469727,12.1899995803833,11.930000305175781
"Jan 10, 2020",12.199999809265137,12.149999618530273,12.5,12.069999694824219
"Jan 13, 2020",12.550000190734863,12.199999809265137,12.699999809265137,12.119999885559082
"Jan 14, 2020",12.789999961853027,12.59000015258789,12.789999961853027,12.4399995803833
"Jan 15, 2020",12.350000381469727,12.779999732971191,12.800000190734863,12.3100004196167
"Jan 16, 2020",12.020000457763672,12.5,12.569999694824219,11.779999732971191
"Jan 17, 2020",11.670000076293945,12.029999732971191,12.1899995803833,11.600000381469727
"Jan 20, 2020",11.529999732971191,11.6899995803833,11.6899995803833,11.430000305175781
"Jan 21, 2020",11.180000305175781,11.449999809265137,11.649999618530273,11.180000305175781
"Jan 22, 2020",11.300000190734863,11.260000228881836,11.350000381469727,11.119999885559082
"Jan 23, 2020",11.6899995803833,11.399999618530273,11.829999923706055,11.359999656677246
"Jan 24, 2020",11.670000076293945,11.800000190734863,11.850000381469727,11.510000228881836
"Jan 27, 2020",11.279999732971191,11.380000114440918,11.470000267028809,11.050000190734863
"Jan 28, 2020",11.699999809265137,11.600000381469727,11.890000343322754,11.430000305175781
"Jan 29, 2020",11.699999809265137,11.850000381469727,11.9399995803833,11.510000228881836
"Jan 30, 2020",11.489999771118164,11.489999771118164,11.59000015258789,11.0600004196167
"Jan 31, 2020",11.619999885559082,11.270000457763672,11.729999542236328,11.210000038146973
"Feb 03, 2020",11.649999618530273,11.279999732971191,11.960000038146973,11.199999809265137
"Feb 04, 2020",12.300000190734863,11.880000114440918,12.489999771118164,11.770000457763672
"Feb 05, 2020",12.180000305175781,12.180000305175781,12.670000076293945,12.069999694824219
"Feb 06, 2020",11.850000381469727,12.1899995803833,12.34000015258789,11.760000228881836
"Feb 07, 2020",11.289999961853027,11.84000015258789,11.859999656677246,11.229999542236328
"Feb 10, 2020",11.09000015258789,11.319999694824219,11.380000114440918,10.84000015258789
"Feb 11, 2020",11.149999618530273,11.140000343322754,11.489999771118164,11.050000190734863
"Feb 12, 2020",11.600000381469727,11.399999618530273,11.859999656677246,11.210000038146973
"Feb 13, 2020",11.800000190734863,11.600000381469727,12.079999923706055,11.430000305175781
"Feb 14, 2020",11.710000038146973,12.0,12.0,11.65999984741211
"Feb 17, 2020",11.710000038146973,11.789999961853027,11.989999771118164,11.510000228881836
"Feb 18, 2020",11.399999618530273,11.600000381469727,11.649999618530273,11.1899995803833
"Feb 19, 2020",11.149999618530273,11.329999923706055,11.4399995803833,11.109999656677246
"Feb 20, 2020",11.050000190734863,11.170000076293945,11.420000076293945,11.0
"Feb 21, 2020",11.050000190734863,11.0,11.079999923706055,10.960000038146973
"Feb 27, 2020",9.9399995803833,10.149999618530273,10.300000190734863,9.869999885559082
"Feb 28, 2020",10.09000015258789,9.899999618530273,10.119999885559082,9.550000190734863
"Mar 02, 2020",10.25,10.09000015258789,10.399999618530273,9.850000381469727
"Mar 03, 2020",10.489999771118164,10.140000343322754,10.779999732971191,10.100000381469727
"Mar 04, 2020",10.430000305175781,10.6899995803833,10.789999961853027,10.289999961853027
"Mar 05, 2020",9.979999542236328,10.289999961853027,10.380000114440918,9.619999885559082
"Mar 06, 2020",9.0,9.460000038146973,9.600000381469727,8.930000305175781
"Mar 09, 2020",7.539999961853027,8.300000190734863,8.380000114440918,7.480000019073486
"Mar 10, 2020",8.149999618530273,8.010000228881836,8.220000267028809,7.619999885559082
"Mar 11, 2020",7.550000190734863,7.789999961853027,8.0,6.980000019073486
"Mar 12, 2020",5.980000019073486,6.300000190734863,6.5,5.949999809265137
"Mar 13, 2020",6.670000076293945,7.070000171661377,7.369999885559082,5.900000095367432
"Mar 16, 2020",5.289999961853027,5.71999979019165,6.0,5.190000057220459
"Mar 17, 2020",5.909999847412109,5.400000095367432,5.929999828338623,5.099999904632568
"Mar 18, 2020",4.75,5.179999828338623,5.639999866485596,4.300000190734863
"Mar 19, 2020",4.860000133514404,4.53000020980835,5.380000114440918,4.079999923706055
"Mar 20, 2020",4.909999847412109,5.230000019073486,5.480000019073486,4.78000020980835
"Mar 23, 2020",4.53000020980835,5.03000020980835,5.150000095367432,4.25
"Mar 24, 2020",4.480000019073486,4.889999866485596,5.03000020980835,4.409999847412109
"Mar 25, 2020",5.0,4.5,5.28000020980835,4.420000076293945
"Mar 26, 2020",5.849999904632568,5.010000228881836,5.900000095367432,5.010000228881836
"Mar 27, 2020",5.320000171661377,5.409999847412109,5.739999771118164,5.320000171661377
"Mar 30, 2020",5.059999942779541,5.440000057220459,5.579999923706055,5.03000020980835
"Mar 31, 2020",4.0,4.690000057220459,4.769999980926514,3.9700000286102295
"Apr 01, 2020",3.869999885559082,3.8499999046325684,4.139999866485596,3.75
"Apr 02, 2020",3.6600000858306885,4.0,4.119999885559082,3.569999933242798
"Apr 03, 2020",3.7200000286102295,3.680000066757202,3.9000000953674316,3.5799999237060547
"Apr 06, 2020",4.199999809265137,3.930000066757202,4.199999809265137,3.8499999046325684
"Apr 07, 2020",4.480000019073486,4.650000095367432,4.920000076293945,4.400000095367432
"Apr 08, 2020",4.599999904632568,4.460000038146973,4.619999885559082,4.300000190734863
"Apr 09, 2020",4.579999923706055,4.650000095367432,4.889999866485596,4.460000038146973
"Apr 13, 2020",4.869999885559082,4.599999904632568,4.880000114440918,4.550000190734863
"Apr 14, 2020",4.960000038146973,5.070000171661377,5.179999828338623,4.900000095367432
"Apr 15, 2020",5.25,4.829999923706055,5.5,4.71999979019165
"Apr 16, 2020",5.110000133514404,5.539999961853027,5.599999904632568,5.039999961853027
"Apr 17, 2020",5.039999961853027,5.300000190734863,5.409999847412109,4.900000095367432
"Apr 20, 2020",5.090000152587891,4.900000095367432,5.260000228881836,4.829999923706055
"Apr 22, 2020",5.079999923706055,5.039999961853027,5.28000020980835,5.010000228881836
"Apr 23, 2020",4.900000095367432,5.170000076293945,5.199999809265137,4.760000228881836
"Apr 24, 2020",4.610000133514404,4.840000152587891,4.889999866485596,4.25
"Apr 27, 2020",4.599999904632568,4.78000020980835,4.820000171661377,4.550000190734863
"Apr 28, 2020",4.980000019073486,4.760000228881836,5.050000190734863,4.650000095367432
"Apr 29, 2020",5.590000152587891,5.139999866485596,5.650000095367432,4.980000019073486
"Apr 30, 2020",5.539999961853027,5.449999809265137,5.730000019073486,5.21999979019165
"May 04, 2020",5.21999979019165,5.400000095367432,5.460000038146973,5.139999866485596
"May 05, 2020",4.960000038146973,5.369999885559082,5.409999847412109,4.929999828338623
"May 06, 2020",4.980000019073486,5.010000228881836,5.139999866485596,4.679999828338623
"May 07, 2020",4.710000038146973,5.050000190734863,5.079999923706055,4.699999809265137
"May 08, 2020",4.730000019073486,4.809999942779541,4.920000076293945,4.639999866485596
"May 11, 2020",4.519999980926514,4.670000076293945,4.71999979019165,4.5
"May 12, 2020",4.360000133514404,4.579999923706055,4.820000171661377,4.340000152587891
"May 13, 2020",4.150000095367432,4.380000114440918,4.449999809265137,3.9700000286102295
"May 14, 2020",4.199999809265137,4.059999942779541,4.300000190734863,3.950000047683716
"May 15, 2020",4.210000038146973,4.150000095367432,4.400000095367432,4.110000133514404
"May 18, 2020",4.650000095367432,4.440000057220459,4.679999828338623,4.309999942779541
"May 19, 2020",4.610000133514404,4.639999866485596,4.869999885559082,4.599999904632568
"May 20, 2020",4.570000171661377,4.71999979019165,4.809999942779541,4.53000020980835
"May 21, 2020",4.699999809265137,4.639999866485596,4.829999923706055,4.570000171661377
"May 22, 2020",4.300000190734863,4.5,4.539999961853027,4.260000228881836
"May 25, 2020",4.730000019073486,4.449999809265137,4.75,4.420000076293945
"May 26, 2020",4.809999942779541,5.0,5.130000114440918,4.75
"May 27, 2020",5.300000190734863,4.880000114440918,5.300000190734863,4.800000190734863
"May 28, 2020",5.230000019073486,5.320000171661377,5.570000171661377,5.139999866485596
"May 29, 2020",5.260000228881836,5.190000057220459,5.409999847412109,5.099999904632568
"Jun 01, 2020",5.630000114440918,5.289999961853027,5.670000076293945,5.25
"Jun 02, 2020",6.400000095367432,5.860000133514404,6.440000057220459,5.809999942779541
"Jun 03, 2020",6.78000020980835,6.960000038146973,6.96999979019165,6.599999904632568
"Jun 04, 2020",6.739999771118164,6.650000095367432,6.849999904632568,6.519999980926514
"Jun 05, 2020",6.900000095367432,7.090000152587891,7.260000228881836,6.849999904632568
"Jun 08, 2020",6.900000095367432,6.96999979019165,7.099999904632568,6.78000020980835
"Jun 09, 2020",6.949999809265137,6.710000038146973,7.090000152587891,6.610000133514404
"Jun 10, 2020",6.659999847412109,7.099999904632568,7.170000076293945,6.659999847412109
"Jun 12, 2020",6.349999904632568,6.409999847412109,6.599999904632568,6.159999847412109
"Jun 15, 2020",6.389999866485596,6.090000152587891,6.550000190734863,5.920000076293945
"Jun 16, 2020",6.150000095367432,6.659999847412109,6.71999979019165,6.150000095367432
"Jun 17, 2020",6.429999828338623,6.210000038146973,6.519999980926514,6.0
"Jun 18, 2020",6.329999923706055,6.360000133514404,6.610000133514404,6.25
"Jun 19, 2020",6.309999942779541,6.480000019073486,6.480000019073486,6.269999980926514
"Jun 22, 2020",6.610000133514404,6.440000057220459,6.940000057220459,6.360000133514404
"Jun 23, 2020",7.010000228881836,6.789999961853027,7.070000171661377,6.570000171661377
"Jun 24, 2020",6.760000228881836,7.079999923706055,7.090000152587891,6.610000133514404
"Jun 25, 2020",6.710000038146973,6.789999961853027,6.820000171661377,6.559999942779541
"Jun 26, 2020",6.360000133514404,6.659999847412109,6.730000019073486,6.269999980926514
"Jun 29, 2020",6.550000190734863,6.420000076293945,6.570000171661377,6.079999923706055
"Jun 30, 2020",6.610000133514404,6.420000076293945,6.699999809265137,6.360000133514404
"Jul 01, 2020",6.96999979019165,6.639999866485596,6.96999979019165,6.590000152587891
"Jul 02, 2020",6.920000076293945,7.110000133514404,7.420000076293945,6.78000020980835
"Jul 03, 2020",7.199999809265137,6.929999828338623,7.199999809265137,6.800000190734863
"Jul 06, 2020",7.599999904632568,8.050000190734863,8.050000190734863,7.429999828338623
"Jul 07, 2020",7.449999809265137,7.53000020980835,7.78000020980835,7.320000171661377
"Jul 08, 2020",7.659999847412109,7.590000152587891,7.659999847412109,7.420000076293945
"Jul 09, 2020",7.78000020980835,7.699999809265137,7.849999904632568,7.579999923706055
"Jul 10, 2020",8.640000343322754,7.900000095367432,8.680000305175781,7.849999904632568
"Jul 13, 2020",8.680000305175781,8.949999809265137,9.130000114440918,8.640000343322754
"Jul 14, 2020",8.619999885559082,8.619999885559082,8.890000343322754,8.569999694824219
"Jul 15, 2020",8.75,8.850000381469727,8.989999771118164,8.6899995803833
"Jul 16, 2020",9.1899995803833,8.699999809265137,9.300000190734863,8.649999618530273
"Jul 17, 2020",9.350000381469727,9.359999656677246,9.5,9.1899995803833
"Jul 20, 2020",9.600000381469727,9.420000076293945,9.90999984741211,9.380000114440918
"Jul 21, 2020",9.399999618530273,9.930000305175781,9.960000038146973,9.220000267028809
"Jul 22, 2020",9.390000343322754,9.399999618530273,9.4399995803833,9.079999923706055
"Jul 23, 2020",8.75,9.699999809265137,9.699999809265137,8.670000076293945
"Jul 24, 2020",8.279999732971191,8.399999618530273,8.579999923706055,8.109999656677246
"Jul 27, 2020",8.329999923706055,8.4399995803833,8.529999732971191,8.029999732971191
"Jul 28, 2020",9.0,8.40999984741211,9.25,8.270000457763672
"Jul 29, 2020",9.239999771118164,9.210000038146973,9.420000076293945,8.819999694824219
"Jul 30, 2020",9.460000038146973,9.300000190734863,9.600000381469727,9.199999809265137
"Jul 31, 2020",8.279999732971191,9.800000190734863,9.9399995803833,8.130000114440918
"Aug 03, 2020",7.849999904632568,8.100000381469727,8.359999656677246,7.5
"Aug 04, 2020",7.400000095367432,7.639999866485596,7.869999885559082,7.269999980926514
"Aug 05, 2020",7.380000114440918,7.610000133514404,7.739999771118164,7.21999979019165
"Aug 06, 2020",7.269999980926514,7.400000095367432,7.460000038146973,7.170000076293945
"Aug 07, 2020",7.289999961853027,7.21999979019165,7.489999771118164,7.150000095367432
"Aug 10, 2020",7.389999866485596,7.300000190734863,7.489999771118164,7.110000133514404
"Aug 11, 2020",7.329999923706055,7.519999980926514,7.579999923706055,7.320000171661377
"Aug 12, 2020",7.190000057220459,7.360000133514404,7.380000114440918,7.019999980926514
"Aug 13, 2020",6.920000076293945,7.21999979019165,7.309999942779541,6.889999866485596
"Aug 14, 2020",7.190000057220459,6.909999847412109,7.269999980926514,6.820000171661377
"Aug 17, 2020",6.880000114440918,7.199999809265137,7.340000152587891,6.769999980926514
"Aug 18, 2020",6.960000038146973,7.079999923706055,7.130000114440918,6.909999847412109
"Aug 19, 2020",6.579999923706055,6.769999980926514,6.929999828338623,6.440000057220459
"Aug 20, 2020",6.570000171661377,6.380000114440918,6.760000228881836,6.360000133514404
"Aug 21, 2020",6.559999942779541,6.190000057220459,6.639999866485596,6.099999904632568
"Aug 24, 2020",6.369999885559082,6.639999866485596,6.679999828338623,6.360000133514404
"Aug 25, 2020",6.199999809265137,6.440000057220459,6.5,6.179999828338623
"Aug 26, 2020",6.059999942779541,6.230000019073486,6.309999942779541,5.960000038146973
"Aug 27, 2020",6.070000171661377,6.099999904632568,6.179999828338623,5.960000038146973
"Aug 28, 2020",6.010000228881836,6.119999885559082,6.179999828338623,5.980000019073486
"Aug 31, 2020",5.699999809265137,5.96999979019165,6.079999923706055,5.699999809265137
