result,data,num_ativos,lista_ativos,oper_ativos,volatilidade
0.9301113528652407,"Jan 04, 2010","8","['MMXM3', 'LAME4', 'JBSS3', 'MRVE3', 'ITSA4', 'LREN3', 'GOLL4', 'DTEX3']","[2.0, 2.0, 1.75, 1.75, 1.25, 1.25, 1.0, 0.5]","nan"
0.9864698641161935,"Feb 01, 2010","8","['ELET3', 'EMBR3', 'CSAN3', 'DTEX3', 'LREN3', 'BRKM5', 'KLBN4', 'BRAP4']","[0.25, 0.25, 0.0, 0.0, -0.125, -0.125, -0.125, -1.0]","nan"
1.0134275450092645,"Mar 01, 2010","8","['BBAS3', 'CSAN3', 'RDCD3', 'MMXM3', 'EMBR3', 'CPFE3', 'LIGT3', 'PETR4']","[2.0, 2.0, 1.5, 0.25, 0.25, 0.25, 0.25, 0.0]","0.00038823021643782907"
0.9468249174297152,"Apr 01, 2010","8","['ITSA4', 'GGBR4', 'USIM5', 'CSNA3', 'BRAP4', 'ELET3', 'EMBR3', 'CCRO3']","[2.0, 1.75, 0.25, 0.25, 0.25, 0.25, 0.25, 0.25]","0.00044846121420838767"
0.9382905557296183,"May 03, 2010","8","['GGBR4', 'RDCD3', 'GOAU4', 'ABEV3', 'KLBN4', 'ITSA4', 'BBDC4', 'BRAP4']","[0.0, 0.0, 0.0, 0.0, 0.0, -0.25, -0.5, -0.5]","nan"
1.070141713115194,"Jun 01, 2010","8","['RSID3', 'CSAN3', 'PDGR3', 'TRPL4', 'TIMP3', 'DTEX3', 'LREN3', 'CPFE3']","[1.75, 1.75, 1.75, 1.75, 1.75, 1.0, 0.25, 0.25]","0.004220533347153852"
1.1017153910582265,"Jul 01, 2010","8","['KLBN4', 'TRPL4', 'CPFE3', 'TIMP3', 'LAME4', 'CYRE3', 'JBSS3', 'PDGR3']","[2.0, 0.25, 0.25, 0.25, 0.25, 0.25, 0.25, 0.25]","0.004619993873214263"
0.9951594760860484,"Aug 02, 2010","8","['CMIG4', 'DTEX3', 'GFSA3', 'ABEV3', 'CPFE3', 'BRKM5', 'RSID3', 'SBSP3']","[1.25, 0.5, 0.375, 0.25, 0.25, 0.25, 0.25, 0.0]","0.0002762976982565824"
1.092214884771695,"Sep 01, 2010","8","['BBDC4', 'PDGR3', 'BRAP4', 'GOLL4', 'VALE3', 'EMBR3', 'GGBR4', 'BBAS3']","[1.5, 0.25, 0.0, 0.0, 0.0, 0.0, 0.0, -0.125]","0.0011177508792926537"
1.0428905382415947,"Oct 01, 2010","8","['USIM3', 'BBAS3', 'CSNA3', 'BRAP4', 'BBDC4', 'LREN3', 'CSAN3', 'DTEX3']","[2.0, 2.0, 2.0, 1.25, 1.25, 0.5, 0.25, 0.25]","0.00022354819207115082"
0.9904133329249353,"Nov 01, 2010","8","['CCRO3', 'CPFE3', 'MRVE3', 'ABEV3', 'BRAP4', 'ELET6', 'DTEX3', 'GOLL4']","[2.0, 1.25, 1.0, 0.25, 0.25, 0.25, 0.25, 0.25]","nan"
1.017286189999873,"Dec 01, 2010","8","['ABEV3', 'BTOW3', 'TIMP3', 'BRKM5', 'TRPL4', 'PETR3', 'LAME4', 'MMXM3']","[0.25, 0.25, 0.25, 0.25, 0.0, 0.0, 0.0, -0.125]","0.003912037923248069"
0.9279094380059092,"Jan 03, 2011","8","['TRPL4', 'CCRO3', 'PETR3', 'ELET6', 'GOAU4', 'GFSA3', 'ITUB4', 'PDGR3']","[2.0, 2.0, 2.0, 1.75, 1.75, 1.75, 1.5, 1.5]","0.004332912729711363"
1.044786624398601,"Feb 01, 2011","8","['MMXM3', 'SBSP3', 'GOAU4', 'CMIG4', 'TIMP3', 'CESP6', 'EMBR3', 'ELET6']","[2.5, 1.0, 1.0, 0.5, 0.25, 0.25, 0.25, 0.0]","0.00010526257762341703"
1.00555901895364,"Mar 01, 2011","8","['JBSS3', 'PETR3', 'CCRO3', 'CPLE6', 'LIGT3', 'DTEX3', 'EMBR3', 'TRPL4']","[1.75, 1.375, 1.25, 1.0, 0.5, 0.5, 0.25, 0.0]","0.0038055784388310735"
0.9831664189826883,"Apr 04, 2011","8","['TRPL4', 'BRAP4', 'CSNA3', 'MMXM3', 'DTEX3', 'LREN3', 'TIMP3', 'CCRO3']","[2.0, 1.125, 1.0, 1.0, 0.375, 0.25, 0.25, 0.25]","0.00458316210740816"
0.9883547480544763,"May 02, 2011","8","['BBAS3', 'GOLL4', 'TIMP3', 'CCRO3', 'BRKM5', 'MRFG3', 'RSID3', 'PDGR3']","[2.25, 0.5, 0.25, 0.25, 0.25, 0.25, 0.25, 0.25]","0.00023781843810677676"
0.9817686628350749,"Jun 01, 2011","8","['LREN3', 'GOAU4', 'JBSS3', 'RDCD3', 'KLBN4', 'BRAP4', 'TRPL4', 'CPFE3']","[1.75, 1.75, 1.75, 1.5, 1.5, 1.125, 1.0, 1.0]","0.004163165565990568"
1.3270425464376339,"Jul 01, 2011","8","['ITUB4', 'LREN3', 'TRPL4', 'SBSP3', 'RDCD3', 'BBDC4', 'LIGT3', 'CIEL3']","[3.5, 2.0, 1.75, 1.5, 1.5, 1.25, 0.75, 0.75]","0.004381460535708741"
0.8877710784783445,"Aug 01, 2011","6","['CPFE3', 'PETR3', 'BRFS3', 'MMXM3', 'SBSP3', 'MRFG3']","[1.0, 1.0, 0.25, -0.5, -1.5, -1.5]","0.0002497270712990178"
0.9003262279459803,"Sep 01, 2011","8","['CESP6', 'BRAP4', 'VALE3', 'BBDC4', 'ITUB4', 'PDGR3', 'PCAR4', 'LIGT3']","[1.75, 1.75, 1.75, 1.75, 1.75, 1.75, 1.5, 1.5]","0.00017070600148570535"
1.082852311862967,"Oct 03, 2011","8","['ITUB4', 'EMBR3', 'TRPL4', 'SBSP3', 'PCAR4', 'CESP6', 'LIGT3', 'LREN3']","[2.0, 0.25, 0.0, 0.0, 0.0, 0.0, 0.0, 0.0]","0.004666575503778682"
0.9784015147557812,"Nov 01, 2011","8","['BBDC4', 'SBSP3', 'CPLE6', 'CCRO3', 'BRAP4', 'BTOW3', 'CSNA3', 'MMXM3']","[2.5, 2.0, 1.75, 1.75, 1.75, 1.5, 1.5, 1.5]","0.00023806528773649777"
0.9427193596856603,"Dec 01, 2011","6","['TRPL4', 'DTEX3', 'RSID3', 'LAME4', 'MRVE3', 'BRAP4']","[1.0, 0.0, 0.0, 0.0, 0.0, -0.5]","0.008404102302316637"
1.0669752948514908,"Jan 02, 2012","8","['DTEX3', 'MMXM3', 'BBDC4', 'BBAS3', 'CESP6', 'ELET6', 'SBSP3', 'CPFE3']","[2.0, 1.75, 1.25, 1.0, 0.75, 0.75, 0.25, 0.25]","0.00015748108304095996"
1.084362250576452,"Feb 01, 2012","8","['CCRO3', 'BRKM5', 'BTOW3', 'HGTX3', 'BRML3', 'JBSS3', 'PCAR4', 'LREN3']","[2.0, 1.875, 1.75, 0.5, 0.5, 0.5, 0.25, 0.25]","0.0001562146130985253"
1.0252629834273073,"Mar 01, 2012","8","['BBAS3', 'ITUB4', 'PCAR4', 'CPFE3', 'HGTX3', 'ABEV3', 'TRPL4', 'UGPA3']","[2.0, 0.75, 0.5, 0.5, 0.375, 0.375, 0.25, 0.25]","0.005020516500312002"
1.0330135442451611,"Apr 02, 2012","8","['LAME4', 'SANB11', 'CCRO3', 'SBSP3', 'UGPA3', 'VIVT4', 'ABEV3', 'EMBR3']","[1.5, 1.0, 0.5, 0.25, 0.25, 0.25, 0.25, 0.25]","0.0003516096374884283"
0.8983443248764766,"May 02, 2012","8","['ELET6', 'BRML3', 'LAME4', 'GGBR4', 'SBSP3', 'UGPA3', 'EMBR3', 'PCAR4']","[1.75, 1.75, 1.75, 1.75, 0.5, 0.25, 0.25, 0.0]","0.0004216559299481349"
1.0266885019264826,"Jun 01, 2012","5","['SANB11', 'SBSP3', 'LREN3', 'CCRO3', 'TESA3']","[0.25, 0.0, 0.0, 0.0, 0.0]","0.00018794595842655792"
1.0131158166272105,"Jul 02, 2012","8","['HYPE3', 'CESP6', 'BRAP4', 'UGPA3', 'RDCD3', 'KLBN4', 'CCRO3', 'VALE3']","[1.75, 1.25, 1.25, 0.25, 0.25, 0.25, 0.25, 0.25]","0.0002320889331675287"
1.0783148486423872,"Aug 01, 2012","7","['GOAU4', 'KLBN4', 'USIM3', 'ABEV3', 'BTOW3', 'MRFG3', 'BBAS3']","[2.0, 2.0, 1.75, 1.75, 1.75, 1.75, 1.75]","0.00014390579460745018"
0.9138174056982488,"May 04, 2015","8","['BRKM5', 'PCAR4', 'BRFS3', 'BBAS3', 'ENBR3', 'ITUB4', 'BBDC4', 'PETR4']","[1.75, 1.25, 0.75, 0.5, 0.375, 0.25, 0.25, 0.25]","0.00026930244511747485"
1.0443986059682646,"Jun 01, 2015","8","['EMBR3', 'TIMP3', 'MRFG3', 'HYPE3', 'ABEV3', 'BBAS3', 'CMIG4', 'SBSP3']","[1.75, 1.5, 1.5, 0.25, 0.0, 0.0, 0.0, 0.0]","0.00013671719793504746"
0.9696712621589393,"Jul 01, 2015","8","['VIVT4', 'MRVE3', 'TIMP3', 'ITUB4', 'BBDC4', 'ABEV3', 'ITSA4', 'BBSE3']","[1.75, 1.75, 0.25, 0.0, 0.0, 0.0, 0.0, 0.0]","0.00017772720664585578"
0.8941735457479265,"Aug 03, 2015","8","['PCAR4', 'KLBN11', 'ENBR3', 'CIEL3', 'VIVT4', 'LAME4', 'SANB11', 'QUAL3']","[1.5, 0.25, 0.25, 0.0, 0.0, 0.0, 0.0, -0.25]","5.8843043233808513e-05"
1,"0","0","0","0","0"
1.020847986013688,"Oct 01, 2015","8","['BRFS3', 'ABEV3', 'JBSS3', 'EMBR3', 'KLBN11', 'BRKM5', 'ELET6', 'ITUB4']","[1.0, 0.5, 0.25, 0.25, 0.25, 0.25, 0.25, 0.0]","7.846165087653895e-05"
1.0227753876344667,"Nov 03, 2015","8","['CESP6', 'ENBR3', 'POMO4', 'ITSA4', 'BBAS3', 'HYPE3', 'BRKM5', 'BRPR3']","[1.75, 1.5, 1.25, 1.0, 0.25, 0.25, 0.25, 0.25]","0.0002019113487591658"
0.9571173388055546,"Dec 01, 2015","8","['ITUB4', 'SBSP3', 'PCAR4', 'HYPE3', 'KLBN11', 'SANB11', 'BRML3', 'CPFE3']","[1.75, 0.5, 0.25, 0.25, 0.25, 0.25, 0.25, 0.25]","0.00021145037928358543"
0.9988678867156224,"Jan 04, 2016","7","['JBSS3', 'CSAN3', 'MRFG3', 'SBSP3', 'MRVE3', 'SANB11', 'HYPE3']","[1.75, 1.75, 1.0, 0.5, 0.5, 0.25, -0.5]","0.00019478611248864382"
1.070929762084974,"Feb 01, 2016","5","['VIVT4', 'CESP6', 'CSAN3', 'HYPE3', 'SBSP3']","[1.75, 1.75, 1.5, 1.0, 0.75]","0.00024134317170763984"
1.2116522395950753,"Mar 01, 2016","8","['LAME4', 'TIMP3', 'ECOR3', 'BRAP4', 'BBAS3', 'ITUB4', 'BBSE3', 'KLBN11']","[2.25, 2.0, 2.0, 1.75, 1.5, 1.25, 1.25, 1.25]","0.0003126761246644473"
1.0598314342081732,"Apr 01, 2016","8","['WEGE3', 'ABEV3', 'UGPA3', 'RADL3', 'CSAN3', 'ITUB4', 'BBDC4', 'PETR4']","[2.0, 0.375, 0.375, 0.375, 0.375, 0.25, 0.25, 0.25]","0.0002455434077655595"
0.8781867901707817,"May 02, 2016","8","['ENBR3', 'CPFE3', 'PCAR4', 'BBDC4', 'PETR4', 'CIEL3', 'BBAS3', 'CCRO3']","[1.5, 1.25, 0.5, 0.25, 0.25, 0.25, 0.25, 0.25]","0.000528268267053922"
1.2300140620133366,"Jun 01, 2016","8","['ABEV3', 'ELET3', 'OIBR3', 'JBSS3', 'KLBN11', 'EQTL3', 'CSAN3', 'CIEL3']","[2.0, 1.25, 1.0, 0.25, 0.25, 0.25, 0.25, 0.0]","0.0001631114222973312"
1.208567890276846,"Jul 01, 2016","8","['CIEL3', 'CCRO3', 'USIM5', 'CMIG4', 'MULT3', 'LREN3', 'SBSP3', 'CPFE3']","[2.0, 2.0, 2.0, 1.875, 1.75, 0.25, 0.25, 0.25]","0.00041819694845758685"
0.9832109081114442,"Aug 01, 2016","8","['WEGE3', 'EQTL3', 'VIVT4', 'BBAS3', 'LREN3', 'BRML3', 'CPFE3', 'CMIG4']","[0.5, 0.375, 0.25, 0.25, 0.25, 0.25, 0.25, 0.25]","0.00036925695223815626"
0.9857513737145605,"Sep 01, 2016","8","['CESP6', 'BRFS3', 'VIVT4', 'KLBN11', 'BRKM5', 'GGBR4', 'QUAL3', 'GOAU4']","[1.0, 0.25, 0.25, 0.25, 0.25, 0.25, 0.25, 0.25]","0.0002597965852753669"
1.0651229141921454,"Oct 03, 2016","8","['ABEV3', 'MULT3', 'CSNA3', 'BBDC4', 'BBSE3', 'SBSP3', 'LAME4', 'WEGE3']","[1.25, 1.25, 1.0, 0.25, 0.25, 0.25, 0.25, 0.25]","0.00047223217814784104"
0.9542712817238165,"Nov 01, 2016","8","['QUAL3', 'RENT3', 'CCRO3', 'CESP6', 'GGBR4', 'BRAP4', 'ECOR3', 'UGPA3']","[2.0, 1.5, 1.25, 1.25, 0.375, 0.375, 0.375, 0.25]","0.000590139887723309"
1.0005894945802682,"Dec 01, 2016","8","['VIVT4', 'HYPE3', 'UGPA3', 'BBAS3', 'SANB11', 'BRAP4', 'GOAU4', 'USIM5']","[1.5, 1.0, 0.25, 0.25, 0.25, 0.25, 0.25, 0.25]","0.0008799880965099594"
1.1445277011329296,"Jan 02, 2017","8","['QUAL3', 'ITUB4', 'BBDC4', 'LREN3', 'BRML3', 'CYRE3', 'MRFG3', 'USIM5']","[2.0, 1.75, 1.75, 1.75, 1.75, 1.75, 1.75, 1.75]","0.00047921305912287856"
1.0184075811385889,"Feb 01, 2017","8","['MRFG3', 'ITUB4', 'BBDC4', 'ABEV3', 'BBAS3', 'VIVT4', 'JBSS3', 'LREN3']","[1.0, 0.25, 0.25, 0.25, 0.25, 0.25, 0.25, 0.25]","0.000254667504820901"
0.9802844760813181,"Mar 01, 2017","8","['BBSE3', 'ABEV3', 'BBAS3', 'CMIG4', 'ITSA4', 'ITUB4', 'BBDC4', 'CIEL3']","[1.75, 0.5, 0.5, 0.5, 0.375, 0.25, 0.25, 0.25]","0.00031723573958576304"
0.9925171676726512,"Apr 03, 2017","8","['BBAS3', 'BBDC4', 'PETR4', 'SBSP3', 'PCAR4', 'EQTL3', 'CSAN3', 'ENBR3']","[2.0, 1.75, 1.75, 1.75, 1.75, 1.5, 1.5, 1.5]","0.00042227366555739"
0.9786138682528749,"May 02, 2017","8","['BBDC4', 'SANB11', 'KLBN11', 'USIM5', 'ITSA4', 'BRFS3', 'BRKM5', 'WEGE3']","[3.25, 1.75, 1.75, 1.75, 1.5, 1.25, 1.25, 1.25]","0.0002260296446556572"
1.024993292324774,"Jun 01, 2017","8","['BRKM5', 'ENBR3', 'CPLE6', 'GOAU4', 'KLBN11', 'UGPA3', 'CPFE3', 'BBDC4']","[1.75, 1.5, 1.5, 1.25, 0.75, 0.25, 0.25, 0.0]","0.00014575679206625444"
1.0552561254937878,"Jul 03, 2017","8","['ECOR3', 'BBDC4', 'BRKM5', 'ITSA4', 'CCRO3', 'GOAU4', 'CSAN3', 'CYRE3']","[2.25, 2.0, 2.0, 1.75, 1.75, 1.75, 1.5, 1.5]","0.0003204017559490326"
1.0297874125013209,"Aug 01, 2017","8","['PCAR4', 'ITUB4', 'BBDC4', 'ABEV3', 'PETR4', 'ITSA4', 'BBAS3', 'CIEL3']","[1.25, 0.25, 0.25, 0.25, 0.25, 0.25, 0.25, 0.25]","0.0001405678129013523"
1.0232591498431787,"Sep 01, 2017","8","['ECOR3', 'RADL3', 'RENT3', 'PETR4', 'CCRO3', 'BRAP4', 'BBDC4', 'ABEV3']","[1.75, 1.25, 0.75, 0.5, 0.5, 0.375, 0.25, 0.25]","0.000179883044274688"
0.9955058720229413,"Oct 02, 2017","8","['BBAS3', 'JBSS3', 'ITUB4', 'BBDC4', 'PETR4', 'BRFS3', 'UGPA3', 'VIVT4']","[0.75, 0.75, 0.25, 0.25, 0.25, 0.25, 0.25, 0.25]","0.00011224219386728399"
0.9218709688121518,"Nov 01, 2017","8","['ABEV3', 'PETR4', 'CPFE3', 'UGPA3', 'ECOR3', 'CCRO3', 'HYPE3', 'BRAP4']","[1.0, 0.5, 0.375, 0.25, 0.25, 0.0, 0.0, 0.0]","0.00016813811899807354"
1.065784214660374,"Dec 01, 2017","8","['RADL3', 'ITSA4', 'MRFG3', 'CYRE3', 'GGBR4', 'ITUB4', 'ABEV3', 'WEGE3']","[0.375, 0.25, 0.25, 0.25, 0.125, 0.0, 0.0, 0.0]","0.0001477079233631491"
1.1045773089568125,"Sep 04, 2012","8","['PCAR4', 'USIM3', 'LREN3', 'RENT3', 'BRML3', 'BRFS3', 'BTOW3', 'RDCD3']","[0.75, 0.25, 0.25, 0.25, 0.25, 0.25, 0.25, 0.25]","0.00011145862954500772"
1.021695892024128,"Oct 01, 2012","7","['VALE3', 'UGPA3', 'HYPE3', 'PCAR4', 'CSAN3', 'DTEX3', 'BRKM5']","[2.0, 1.25, 1.25, 0.25, 0.25, 0.25, 0.25]","0.00018641364859765894"
1.0341031255438504,"Nov 01, 2012","8","['CPFE3', 'BBDC4', 'ITSA4', 'VALE3', 'CYRE3', 'BRFS3', 'DTEX3', 'KLBN4']","[2.0, 1.75, 1.75, 1.5, 1.0, 0.25, 0.25, 0.25]","0.000143315904421219"
1.003038706815728,"Dec 03, 2012","8","['RENT3', 'CSAN3', 'DTEX3', 'BRML3', 'KLBN4', 'SANB11', 'VALE3', 'MRFG3']","[0.25, 0.25, 0.25, 0.0, 0.0, 0.0, 0.0, 0.0]","0.00020340407025827605"
1.007414183496903,"Dec 28, 2012","8","['SBSP3', 'KLBN4', 'CYRE3', 'TRPL4', 'MMXM3', 'OIBR3', 'UGPA3', 'CSNA3']","[2.0, 2.0, 2.0, 1.75, 1.75, 1.5, 1.25, 1.25]","0.0030642260316675386"
0.9807010627253878,"Feb 01, 2013","8","['LREN3', 'GOAU4', 'TRPL4', 'SBSP3', 'ABEV3', 'BRFS3', 'BRKM5', 'MRFG3']","[1.75, 1.25, 0.25, 0.25, 0.25, 0.25, 0.25, 0.25]","0.0021857357030170632"
0.9878563036798548,"Mar 01, 2013","8","['RENT3', 'ELET6', 'BRKM5', 'TIMP3', 'BRFS3', 'PDGR3', 'VIVT4', 'CIEL3']","[2.0, 2.0, 2.0, 2.0, 1.75, 1.75, 1.5, 1.375]","0.00011626071741602851"
0.9952725067435789,"Mar 28, 2013","8","['USIM3', 'TIMP3', 'CESP6', 'BRFS3', 'PETR3', 'PCAR4', 'VIVT4', 'BTOW3']","[2.25, 2.0, 1.75, 1.75, 1.75, 0.25, 0.25, 0.25]","0.0001147866724595212"
0.932372336948533,"May 02, 2013","8","['VALE3', 'BRAP4', 'UGPA3', 'RENT3', 'BRML3', 'KLBN4', 'GOLL4', 'RSID3']","[1.75, 1.0, 0.5, 0.0, 0.0, 0.0, 0.0, 0.0]","0.00011046730978127282"
0.9295722523407517,"Jun 03, 2013","6","['CIEL3', 'BBDC4', 'ITUB4', 'ELET6', 'TIMP3', 'UGPA3']","[1.25, 0.25, 0.25, 0.0, 0.0, -1.75]","7.44212017619631e-05"
1,"0","0","0","0","0"
1.07787001011924,"Aug 01, 2013","8","['KLBN4', 'MMXM3', 'BBDC3', 'CESP6', 'LIGT3', 'CPFE3', 'BRAP4', 'VALE3']","[3.5, 2.125, 2.0, 1.75, 1.25, 1.25, 1.25, 1.25]","0.0002053904562178541"
1.036009030875901,"Sep 02, 2013","8","['BTOW3', 'USIM3', 'BRAP4', 'CIEL3', 'MRVE3', 'ITUB4', 'ITSA4', 'JBSS3']","[1.25, 0.25, 0.25, 0.25, 0.25, 0.0, 0.0, -1.5]","0.00023822843159439016"
1.0346269842951894,"Oct 01, 2013","8","['TRPL4', 'LIGT3', 'CPLE6', 'CSAN3', 'USIM3', 'DTEX3', 'ENBR3', 'GOLL4']","[1.75, 1.75, 0.25, 0.25, 0.25, 0.25, 0.25, 0.25]","0.00021060229840362687"
0.9700264060989404,"Nov 01, 2013","8","['LREN3', 'CSAN3', 'UGPA3', 'RENT3', 'LIGT3', 'BTOW3', 'DTEX3', 'BRKM5']","[1.75, 0.25, 0.25, 0.25, 0.25, 0.25, 0.25, 0.25]","0.00011751214260431208"
0.995578596195676,"Dec 02, 2013","8","['CMIG4', 'CPFE3', 'CCRO3', 'ABEV3', 'LIGT3', 'CIEL3', 'BRKM5', 'JBSS3']","[1.75, 1.0, 0.75, 0.25, 0.25, 0.25, 0.25, 0.25]","5.241535347037354e-05"
0.9134410285695739,"Jan 02, 2014","8","['BRPR3', 'GOAU4', 'GGBR4', 'BRKM5', 'PCAR4', 'RENT3', 'ABEV3', 'ELET6']","[2.0, 2.0, 1.75, 1.75, 1.75, 1.75, 1.5, 1.5]","0.00012292934582740857"
0.9750733361151385,"Feb 03, 2014","8","['KLBN4', 'DASA3', 'BTOW3', 'PDGR3', 'MRVE3', 'MMXM3', 'CYRE3', 'GOLL4']","[0.25, 0.25, 0.25, 0.0, 0.0, 0.0, -0.25, -1.0]","0.0005804864237700365"
1.0868050943101488,"Mar 05, 2014","8","['GFSA3', 'MRFG3', 'ITSA4', 'BRAP4', 'DASA3', 'CESP6', 'BTOW3', 'BBDC4']","[1.75, 1.75, 1.0, 1.0, 0.25, 0.25, 0.25, 0.0]","0.0001826028174909867"
0.9743333769660747,"Apr 01, 2014","8","['VIVT4', 'MRVE3', 'LIGT3', 'CPFE3', 'CYRE3', 'CSAN3', 'CPLE6', 'CSNA3']","[1.875, 1.75, 1.75, 1.75, 1.5, 1.5, 1.375, 1.0]","0.00016616399194346664"
0.9820535585536543,"May 02, 2014","8","['TIMP3', 'PETR4', 'BBDC4', 'BBAS3', 'ITSA4', 'CCRO3', 'BRFS3', 'SANB11']","[3.0, 0.25, 0.25, 0.25, 0.25, 0.25, 0.25, 0.25]","0.00017968515007364902"
1.0584562592445976,"Jun 02, 2014","8","['LREN3', 'CIEL3', 'HYPE3', 'SANB11', 'SBSP3', 'LIGT3', 'TRPL4', 'ITSA4']","[0.75, 0.25, 0.25, 0.25, 0.25, 0.25, 0.25, 0.0]","0.00013142783841878434"
1.0001452354173086,"Jul 01, 2014","8","['GFSA3', 'RSID3', 'ELET6', 'CIEL3', 'BBSE3', 'BBAS3', 'CCRO3', 'CMIG4']","[1.75, 1.5, 1.25, 0.375, 0.25, 0.25, 0.25, 0.25]","0.000165914206287026"
1.1034961685978448,"Aug 01, 2014","8","['EGIE3', 'VIVT4', 'BBDC4', 'ELET6', 'MRFG3', 'GOLL4', 'UGPA3', 'BRPR3']","[1.75, 0.5, 0.25, 0.25, 0.25, 0.25, 0.0, 0.0]","0.00011822198868790248"
0.9059186408065331,"Sep 01, 2014","8","['TIMP3', 'RSID3', 'CPFE3', 'BRPR3', 'MRVE3', 'BRML3', 'PCAR4', 'EMBR3']","[1.0, 1.0, 0.5, 0.5, 0.5, 0.375, 0.25, 0.25]","9.034683337358225e-05"
0.982400585738924,"Oct 01, 2014","8","['EMBR3', 'SANB11', 'TIMP3', 'OIBR4', 'BRKM5', 'PETR4', 'JBSS3', 'SBSP3']","[0.25, 0.25, 0.25, 0.25, 0.25, 0.0, 0.0, 0.0]","8.204062847735387e-05"
1,"0","0","0","0","0"
0.9253326928998812,"Dec 01, 2014","8","['EVEN3', 'EGIE3', 'LIGT3', 'PCAR4', 'SBSP3', 'MRVE3', 'CMIG4', 'BRAP4']","[2.5, 2.0, 2.0, 1.75, 1.75, 1.75, 1.5, 1.5]","0.00016997982598883737"
0.9442185078033387,"Jan 02, 2015","8","['CPFE3', 'ECOR3', 'BBSE3', 'BRML3', 'UGPA3', 'HYPE3', 'GOLL4', 'BRAP4']","[2.0, 2.0, 1.75, 1.75, 1.5, 1.5, 1.25, 1.0]","0.00020581343386574688"
1.120939327288492,"Feb 02, 2015","8","['EMBR3', 'UGPA3', 'ITSA4', 'JBSS3', 'BRAP4', 'CYRE3', 'RSID3', 'BBDC4']","[1.5, 0.75, 0.0, 0.0, 0.0, 0.0, 0.0, -0.25]","8.303737940008356e-05"
0.9949266264191192,"Mar 02, 2015","8","['CMIG4', 'QUAL3', 'EVEN3', 'OIBR4', 'DTEX3', 'LREN3', 'PETR4', 'CIEL3']","[1.75, 1.75, 1.5, 1.25, 1.25, 0.375, 0.25, 0.25]","0.00020711305640487955"
1.0825676221869804,"Apr 01, 2015","8","['BRFS3', 'BRPR3', 'GFSA3', 'ABEV3', 'PETR4', 'CIEL3', 'UGPA3', 'BBSE3']","[1.75, 0.5, 0.5, 0.25, 0.25, 0.25, 0.25, 0.25]","0.00012635198673194013"
1.0821033734296208,"Jan 02, 2018","8","['UGPA3', 'BRML3', 'CSNA3', 'IGTA3', 'CPFE3', 'EQTL3', 'FLRY3', 'QUAL3']","[2.0, 2.0, 2.0, 2.0, 2.0, 1.75, 1.75, 1.75]","0.00011185236375235221"
0.9870551351291085,"Feb 01, 2018","8","['PCAR4', 'CPLE6', 'PETR4', 'LREN3', 'LAME4', 'BRKM5', 'MULT3', 'MGLU3']","[1.25, 1.25, 0.25, 0.25, 0.25, 0.25, 0.25, 0.25]","0.00023994545138333493"
1.0095045300883458,"Mar 01, 2018","8","['WEGE3', 'EQTL3', 'ABEV3', 'PETR4', 'ITSA4', 'JBSS3', 'RAIL3', 'RENT3']","[1.5, 0.75, 0.25, 0.25, 0.25, 0.25, 0.25, 0.25]","0.0002425781933137081"
0.9699022737437847,"Apr 02, 2018","8","['EMBR3', 'CPFE3', 'BBSE3', 'EQTL3', 'TAEE11', 'IGTA3', 'ABEV3', 'RENT3']","[1.75, 1.75, 1.5, 1.25, 1.25, 1.0, 0.25, 0.25]","6.68482752059507e-05"
0.9209569653736177,"May 02, 2018","8","['TAEE11', 'ITSA4', 'CSAN3', 'CPLE6', 'SMLS3', 'VALE3', 'PCAR4', 'GGBR4']","[2.0, 1.75, 1.75, 1.5, 1.0, 0.375, 0.25, 0.25]","0.0001201997186452572"
1.0110107204598349,"Jun 01, 2018","7","['WEGE3', 'SUZB3', 'JBSS3', 'GGBR4', 'BRKM5', 'KLBN11', 'MRFG3']","[0.25, 0.25, 0.0, 0.0, 0.0, -1.0, -1.0]","0.0002981975388188"
1.0781947464289543,"Jul 02, 2018","8","['PETR4', 'BBAS3', 'CIEL3', 'RAIL3', 'BRML3', 'QUAL3', 'IGTA3', 'CMIG4']","[1.75, 1.75, 1.75, 1.75, 1.75, 1.75, 1.75, 1.5]","0.00013393698171723076"
0.9401393044224807,"Aug 01, 2018","8","['CVCB3', 'MRFG3', 'CPFE3', 'VALE3', 'EQTL3', 'BRAP4', 'CSNA3', 'GGBR4']","[2.0, 1.75, 1.75, 1.25, 1.25, 1.25, 1.25, 0.75]","0.0001655960374865331"
1.000847229120563,"Sep 03, 2018","8","['UGPA3', 'ELET3', 'EMBR3', 'KLBN11', 'VALE3', 'BRKM5', 'PCAR4', 'GOAU4']","[1.25, 0.75, 0.5, 0.5, 0.25, 0.25, 0.25, 0.25]","8.601087481893927e-05"
1.2100300615707336,"Oct 01, 2018","8","['JBSS3', 'RAIL3', 'GGBR4', 'EQTL3', 'BBSE3', 'MGLU3', 'ELET3', 'CYRE3']","[2.0, 1.875, 1.75, 1.75, 1.5, 1.5, 1.5, 1.5]","0.00014138032325457687"
1.0290481970853929,"Nov 01, 2018","8","['BBSE3', 'EQTL3', 'QUAL3', 'CYRE3', 'PETR4', 'B3SA3', 'RAIL3', 'JBSS3']","[0.5, 0.5, 0.5, 0.375, 0.25, 0.25, 0.25, 0.25]","0.00018347395387889576"
0.9325022775319746,"Dec 03, 2018","8","['BRKM5', 'TIMP3', 'SANB11', 'FLRY3', 'PCAR4', 'SBSP3', 'GGBR4', 'GOAU4']","[2.0, 2.0, 1.75, 1.75, 1.375, 1.25, 1.0, 1.0]","0.00010659360261547754"
1.12049987622006,"Dec 28, 2018","8","['BBAS3', 'LREN3', 'MGLU3', 'SBSP3', 'CVCB3', 'TAEE11', 'CYRE3', 'SMLS3']","[2.0, 1.25, 0.375, 0.25, 0.25, 0.25, 0.25, 0.25]","0.000258651362238623"
0.9753168356558083,"Feb 01, 2019","8","['BRKM5', 'MRFG3', 'RADL3', 'VIVT4', 'CPLE6', 'EGIE3', 'UGPA3', 'BRML3']","[2.0, 2.0, 1.75, 1.25, 1.25, 0.75, 0.375, 0.375]","5.975608986473928e-05"
0.9566942087927973,"Mar 01, 2019","8","['CIEL3', 'CPLE6', 'BTOW3', 'MGLU3', 'RADL3', 'CVCB3', 'USIM5', 'RENT3']","[2.0, 2.0, 1.75, 1.5, 1.5, 1.0, 1.0, 0.25]","0.00018603747215751486"
1.0290187382912188,"Apr 01, 2019","8","['BBDC4', 'EGIE3', 'QUAL3', 'PETR4', 'BRFS3', 'SUZB3', 'CMIG4', 'BTOW3']","[0.75, 0.75, 0.5, 0.25, 0.0, 0.0, 0.0, 0.0]","0.00023388356645790692"
1.047275552642236,"May 02, 2019","8","['ITUB4', 'KLBN11', 'IGTA3', 'CPLE6', 'HYPE3', 'TAEE11', 'ITSA4', 'RENT3']","[1.75, 1.75, 1.75, 1.75, 1.5, 1.25, 1.0, 0.5]","0.0001925563260488376"
1.0765806350682319,"Jun 03, 2019","8","['MGLU3', 'RADL3', 'CSNA3', 'CYRE3', 'VVAR3', 'SANB11', 'EMBR3', 'GOLL4']","[1.75, 1.75, 1.75, 1.75, 1.75, 1.5, 1.5, 1.25]","0.0001415572052580497"
0.9663044389339166,"Jul 01, 2019","8","['UGPA3', 'PCAR4', 'QUAL3', 'ECOR3', 'ITUB4', 'VALE3', 'BBDC4', 'PETR4']","[1.75, 0.75, 0.75, 0.5, 0.25, 0.25, 0.25, 0.25]","0.0001627545518477388"
1.0285222831636929,"Aug 01, 2019","8","['MRFG3', 'PCAR4', 'MRVE3', 'UGPA3', 'BBSE3', 'JBSS3', 'RENT3', 'VIVT4']","[3.5, 2.0, 2.0, 1.0, 1.0, 0.25, 0.25, 0.25]","0.0002505081025904555"
1.0387432888320423,"Sep 02, 2019","8","['FLRY3', 'BBSE3', 'HYPE3', 'JBSS3', 'RADL3', 'CCRO3', 'ELET3', 'BTOW3']","[2.0, 1.75, 1.0, 0.25, 0.25, 0.25, 0.25, 0.25]","0.00029163737425760204"
1.003397609917624,"Oct 01, 2019","8","['VVAR3', 'MULT3', 'CYRE3', 'IGTA3', 'TIMP3', 'ITUB4', 'ABEV3', 'WEGE3']","[2.0, 1.75, 1.75, 1.75, 1.5, 1.25, 1.25, 1.25]","0.00026625131294791103"
1.0318314485147815,"Nov 01, 2019","8","['EQTL3', 'CCRO3', 'RADL3', 'B3SA3', 'UGPA3', 'SBSP3', 'AZUL4', 'IRBR3']","[1.5, 1.0, 0.75, 0.25, 0.25, 0.25, 0.25, 0.25]","0.0002608943696172564"
1.0085795494885303,"Dec 02, 2019","8","['JBSS3', 'BRDT3', 'RAIL3', 'B3SA3', 'BRFS3', 'BRKM5', 'FLRY3', 'VALE3']","[1.75, 1.75, 1.25, 1.0, 1.0, 1.0, 0.375, 0.25]","0.0001231703393460042"
0.983255047095199,"Jan 02, 2020","8","['ITUB4', 'ITSA4', 'UGPA3', 'BRDT3', 'CMIG4', 'IGTA3', 'LREN3', 'GNDI3']","[2.0, 2.0, 0.75, 0.75, 0.5, 0.5, 0.375, 0.375]","0.00010974509008769409"
0.9270376360051971,"Feb 03, 2020","8","['RENT3', 'VIVT4', 'RADL3', 'EQTL3', 'AZUL4', 'LAME4', 'CMIG4', 'TIMP3']","[0.75, 0.25, 0.25, 0.25, 0.25, 0.25, 0.25, 0.25]","0.0002154692319221101"
1,"0","0","0","0","0"
1,"0","0","0","0","0"
1.1364252608489842,"May 04, 2020","8","['UGPA3', 'BRDT3', 'TAEE11', 'GOAU4', 'GGBR4', 'FLRY3', 'CSNA3', 'QUAL3']","[2.0, 2.0, 2.0, 2.0, 1.75, 1.75, 1.75, 1.75]","0.0008261291603016572"
1.0908660603452138,"Jun 01, 2020","8","['TIMP3', 'ABEV3', 'BBSE3', 'B3SA3', 'MGLU3', 'RENT3', 'BRDT3', 'BRML3']","[2.0, 1.25, 1.0, 0.75, 0.5, 0.5, 0.5, 0.5]","0.0007365688192217385"
1.1301612124768914,"Jul 01, 2020","8","['B3SA3', 'EQTL3', 'VALE3', 'MGLU3', 'WEGE3', 'GNDI3', 'RENT3', 'LAME4']","[0.375, 0.375, 0.25, 0.25, 0.25, 0.25, 0.25, 0.25]","0.0008647647711987654"