Date,Price,Open,High,Low
"Dec 15, 2017",16.0,15.40999984741211,16.1200008392334,15.25
"Dec 18, 2017",16.049999237060547,16.149999618530273,16.280000686645508,15.710000038146973
"Dec 19, 2017",15.949999809265137,16.049999237060547,16.25,15.699999809265137
"Dec 20, 2017",16.350000381469727,15.960000038146973,16.489999771118164,15.960000038146973
"Dec 21, 2017",16.600000381469727,16.31999969482422,17.229999542236328,16.31999969482422
"Dec 22, 2017",16.700000762939453,16.549999237060547,17.0,16.450000762939453
"Dec 25, 2017",16.700000762939453,16.700000762939453,16.700000762939453,16.700000762939453
"Dec 26, 2017",16.719999313354492,16.719999313354492,16.899999618530273,16.239999771118164
"Dec 27, 2017",16.75,16.700000762939453,16.75,16.6299991607666
"Dec 28, 2017",17.100000381469727,16.75,17.100000381469727,16.670000076293945
"Dec 29, 2017",17.100000381469727,17.100000381469727,17.100000381469727,17.100000381469727
"Jan 02, 2018",17.229999542236328,17.0,17.440000534057617,16.75
"Jan 03, 2018",17.299999237060547,17.1299991607666,17.450000762939453,17.049999237060547
"Jan 04, 2018",17.200000762939453,17.25,17.43000030517578,17.100000381469727
"Jan 05, 2018",17.5,17.18000030517578,17.5,17.079999923706055
"Jan 08, 2018",17.399999618530273,17.420000076293945,17.459999084472656,17.1299991607666
"Jan 09, 2018",17.399999618530273,17.399999618530273,17.399999618530273,17.15999984741211
"Jan 10, 2018",17.25,17.3700008392334,17.450000762939453,17.059999465942383
"Jan 11, 2018",17.149999618530273,17.299999237060547,17.3799991607666,17.09000015258789
"Jan 12, 2018",17.06999969482422,17.0,17.239999771118164,16.56999969482422
"Jan 15, 2018",17.56999969482422,17.280000686645508,17.56999969482422,17.110000610351562
"Jan 16, 2018",17.579999923706055,17.6299991607666,17.850000381469727,17.440000534057617
"Jan 17, 2018",17.75,17.579999923706055,17.75,17.309999465942383
"Jan 18, 2018",17.899999618530273,17.75,17.899999618530273,17.579999923706055
"Jan 19, 2018",17.899999618530273,17.799999237060547,17.899999618530273,17.639999389648438
"Jan 22, 2018",17.6299991607666,17.799999237060547,17.899999618530273,17.600000381469727
"Jan 23, 2018",18.0,18.0,18.190000534057617,17.8799991607666
"Jan 24, 2018",19.100000381469727,18.149999618530273,19.700000762939453,18.100000381469727
"Jan 25, 2018",19.100000381469727,19.100000381469727,19.100000381469727,19.100000381469727
"Jan 26, 2018",19.649999618530273,19.299999237060547,19.799999237060547,19.1299991607666
"Jan 29, 2018",20.100000381469727,19.600000381469727,20.200000762939453,19.450000762939453
"Jan 30, 2018",20.100000381469727,20.15999984741211,20.399999618530273,19.959999084472656
"Jan 31, 2018",21.0,20.270000457763672,21.110000610351562,20.25
"Feb 01, 2018",21.649999618530273,21.299999237060547,22.0,21.299999237060547
"Feb 02, 2018",21.0,20.93000030517578,21.149999618530273,20.790000915527344
"Feb 05, 2018",20.200000762939453,20.950000762939453,20.950000762939453,20.200000762939453
"Feb 06, 2018",20.31999969482422,19.75,20.389999389648438,19.389999389648438
"Feb 07, 2018",20.260000228881836,20.34000015258789,20.780000686645508,19.8700008392334
"Feb 08, 2018",20.81999969482422,20.350000381469727,20.81999969482422,20.229999542236328
"Feb 09, 2018",20.239999771118164,20.799999237060547,20.799999237060547,20.149999618530273
"Feb 15, 2018",21.649999618530273,21.219999313354492,21.8700008392334,21.219999313354492
"Feb 16, 2018",21.84000015258789,21.540000915527344,21.979999542236328,21.540000915527344
"Feb 19, 2018",21.899999618530273,21.950000762939453,22.0,21.6299991607666
"Feb 20, 2018",21.969999313354492,21.799999237060547,21.979999542236328,21.40999984741211
"Feb 21, 2018",21.899999618530273,21.829999923706055,22.0,21.760000228881836
"Feb 22, 2018",22.010000228881836,21.899999618530273,22.110000610351562,21.799999237060547
"Feb 23, 2018",21.8700008392334,22.1200008392334,22.299999237060547,21.610000610351562
"Feb 26, 2018",22.06999969482422,22.0,22.489999771118164,21.81999969482422
"Feb 27, 2018",22.530000686645508,22.0,22.600000381469727,21.829999923706055
"Feb 28, 2018",22.09000015258789,22.600000381469727,22.84000015258789,22.09000015258789
"Mar 01, 2018",22.600000381469727,22.200000762939453,22.600000381469727,21.850000381469727
"Mar 02, 2018",22.25,22.200000762939453,22.350000381469727,21.850000381469727
"Mar 05, 2018",22.5,22.25,22.549999237060547,22.200000762939453
"Mar 06, 2018",22.479999542236328,22.520000457763672,22.670000076293945,22.190000534057617
"Mar 07, 2018",22.299999237060547,22.5,22.700000762939453,21.700000762939453
"Mar 08, 2018",21.739999771118164,22.299999237060547,22.540000915527344,21.739999771118164
"Mar 09, 2018",21.950000762939453,21.739999771118164,22.040000915527344,21.43000030517578
"Mar 12, 2018",22.200000762939453,22.299999237060547,22.450000762939453,22.06999969482422
"Mar 13, 2018",22.450000762939453,22.309999465942383,22.549999237060547,22.229999542236328
"Mar 14, 2018",22.6299991607666,23.299999237060547,23.709999084472656,22.5
"Mar 15, 2018",22.899999618530273,22.700000762939453,23.15999984741211,22.260000228881836
"Mar 16, 2018",22.59000015258789,22.989999771118164,22.989999771118164,22.1299991607666
"Mar 19, 2018",22.530000686645508,22.489999771118164,22.530000686645508,22.25
"Mar 20, 2018",22.420000076293945,22.479999542236328,22.5,22.290000915527344
"Mar 21, 2018",23.149999618530273,22.350000381469727,23.149999618530273,22.200000762939453
"Mar 22, 2018",23.399999618530273,23.049999237060547,23.450000762939453,22.8700008392334
"Mar 23, 2018",23.200000762939453,23.170000076293945,23.479999542236328,22.729999542236328
"Mar 26, 2018",24.209999084472656,23.440000534057617,24.549999237060547,23.309999465942383
"Mar 27, 2018",23.709999084472656,24.389999389648438,24.43000030517578,23.040000915527344
"Mar 28, 2018",22.889999389648438,23.760000228881836,23.899999618530273,22.829999923706055
"Mar 29, 2018",23.09000015258789,23.139999389648438,23.360000610351562,22.809999465942383
"Apr 02, 2018",22.350000381469727,23.09000015258789,23.329999923706055,22.350000381469727
"Apr 03, 2018",22.459999084472656,22.579999923706055,22.690000534057617,22.239999771118164
"Apr 04, 2018",22.290000915527344,22.059999465942383,22.459999084472656,21.559999465942383
"Apr 05, 2018",22.670000076293945,22.989999771118164,23.25,22.5
"Apr 06, 2018",23.219999313354492,22.670000076293945,23.399999618530273,22.40999984741211
"Apr 09, 2018",23.399999618530273,23.5,23.899999618530273,23.209999084472656
"Apr 10, 2018",23.5,23.700000762939453,23.989999771118164,23.440000534057617
"Apr 11, 2018",23.420000076293945,23.399999618530273,23.579999923706055,23.139999389648438
"Apr 12, 2018",23.299999237060547,23.469999313354492,23.469999313354492,23.059999465942383
"Apr 13, 2018",23.200000762939453,23.34000015258789,23.479999542236328,22.920000076293945
"Apr 16, 2018",22.299999237060547,23.200000762939453,23.200000762939453,22.200000762939453
"Apr 17, 2018",22.040000915527344,22.489999771118164,22.489999771118164,21.809999465942383
"Apr 18, 2018",22.479999542236328,22.18000030517578,22.850000381469727,22.18000030517578
"Apr 19, 2018",23.0,22.639999389648438,23.260000228881836,22.420000076293945
"Apr 20, 2018",22.729999542236328,22.950000762939453,23.40999984741211,22.729999542236328
"Apr 23, 2018",22.75,22.690000534057617,23.059999465942383,22.5
"Apr 24, 2018",22.299999237060547,22.899999618530273,23.190000534057617,22.100000381469727
"Apr 25, 2018",21.889999389648438,22.299999237060547,22.479999542236328,21.709999084472656
"Apr 26, 2018",22.100000381469727,21.549999237060547,22.190000534057617,21.510000228881836
"Apr 27, 2018",22.690000534057617,22.190000534057617,22.799999237060547,22.059999465942383
"Apr 30, 2018",22.959999084472656,22.799999237060547,23.049999237060547,22.479999542236328
"May 02, 2018",23.100000381469727,22.8799991607666,23.450000762939453,22.739999771118164
"May 03, 2018",22.3700008392334,23.100000381469727,23.309999465942383,22.1200008392334
"May 04, 2018",21.8700008392334,22.489999771118164,22.5,21.43000030517578
"May 07, 2018",21.799999237060547,22.200000762939453,22.200000762939453,21.260000228881836
"May 08, 2018",20.959999084472656,21.899999618530273,22.0,20.68000030517578
"May 09, 2018",21.299999237060547,21.049999237060547,21.350000381469727,20.299999237060547
"May 10, 2018",21.31999969482422,21.360000610351562,21.950000762939453,21.219999313354492
"May 11, 2018",21.200000762939453,21.399999618530273,21.510000228881836,20.600000381469727
"May 14, 2018",20.899999618530273,21.299999237060547,21.59000015258789,20.530000686645508
"May 15, 2018",21.25,20.899999618530273,21.389999389648438,20.760000228881836
"May 16, 2018",21.299999237060547,21.5,21.579999923706055,20.81999969482422
"May 17, 2018",20.200000762939453,21.200000762939453,21.290000915527344,20.010000228881836
"May 18, 2018",19.6299991607666,20.0,20.0,19.18000030517578
"May 21, 2018",19.540000915527344,19.829999923706055,20.1200008392334,19.09000015258789
"May 22, 2018",19.829999923706055,19.600000381469727,19.899999618530273,19.309999465942383
"May 23, 2018",19.649999618530273,19.829999923706055,19.889999389648438,19.420000076293945
"May 24, 2018",18.920000076293945,18.0,19.25,17.850000381469727
"May 25, 2018",18.649999618530273,19.100000381469727,19.690000534057617,18.309999465942383
"May 28, 2018",16.5,18.18000030517578,18.190000534057617,16.5
"May 29, 2018",17.65999984741211,17.1200008392334,18.049999237060547,17.020000457763672
"May 30, 2018",18.200000762939453,17.850000381469727,18.950000762939453,17.290000915527344
"Jun 01, 2018",17.0,18.690000534057617,19.329999923706055,16.110000610351562
"Jun 04, 2018",18.209999084472656,17.639999389648438,18.299999237060547,17.3700008392334
"Jun 05, 2018",17.90999984741211,18.049999237060547,18.3700008392334,17.600000381469727
"Jun 06, 2018",18.829999923706055,17.829999923706055,19.040000915527344,17.829999923706055
"Jun 07, 2018",17.959999084472656,18.25,18.440000534057617,17.010000228881836
"Jun 08, 2018",17.3799991607666,17.950000762939453,18.34000015258789,17.020000457763672
"Jun 11, 2018",17.139999389648438,17.690000534057617,17.700000762939453,16.760000228881836
"Jun 12, 2018",17.260000228881836,17.389999389648438,17.440000534057617,17.079999923706055
"Jun 13, 2018",16.889999389648438,17.15999984741211,17.309999465942383,16.329999923706055
"Jun 14, 2018",16.700000762939453,17.09000015258789,17.09000015258789,16.540000915527344
"Jun 15, 2018",16.559999465942383,16.75,16.979999542236328,16.43000030517578
"Jun 18, 2018",16.809999465942383,16.770000457763672,17.100000381469727,16.020000457763672
"Jun 19, 2018",17.84000015258789,16.43000030517578,17.84000015258789,16.40999984741211
"Jun 20, 2018",17.3700008392334,17.989999771118164,18.200000762939453,17.020000457763672
"Jun 21, 2018",16.969999313354492,17.149999618530273,17.200000762939453,16.559999465942383
"Jun 22, 2018",17.540000915527344,16.84000015258789,17.540000915527344,16.6299991607666
"Jun 25, 2018",17.8799991607666,17.700000762939453,18.329999923706055,17.440000534057617
"Jun 26, 2018",18.31999969482422,17.90999984741211,18.31999969482422,17.739999771118164
"Jun 27, 2018",18.200000762939453,18.31999969482422,18.479999542236328,17.950000762939453
"Jun 28, 2018",18.280000686645508,18.200000762939453,18.5,18.020000457763672
"Jun 29, 2018",18.290000915527344,18.450000762939453,18.489999771118164,18.030000686645508
"Jul 02, 2018",18.15999984741211,18.299999237060547,18.31999969482422,17.8700008392334
"Jul 03, 2018",18.299999237060547,18.0,18.479999542236328,18.0
"Jul 04, 2018",18.25,18.15999984741211,18.34000015258789,18.049999237060547
"Jul 05, 2018",18.0,18.5,18.5,17.520000457763672
"Jul 06, 2018",18.6200008392334,18.190000534057617,18.899999618530273,18.030000686645508
"Jul 10, 2018",19.350000381469727,18.739999771118164,19.350000381469727,18.739999771118164
"Jul 11, 2018",19.459999084472656,19.34000015258789,19.81999969482422,19.1200008392334
"Jul 12, 2018",20.030000686645508,19.43000030517578,20.15999984741211,19.43000030517578
"Jul 13, 2018",20.200000762939453,20.149999618530273,20.479999542236328,19.899999618530273
"Jul 16, 2018",20.530000686645508,20.0,20.600000381469727,19.6299991607666
"Jul 17, 2018",19.799999237060547,20.280000686645508,20.469999313354492,19.510000228881836
"Jul 18, 2018",19.450000762939453,19.899999618530273,19.950000762939453,19.290000915527344
"Jul 19, 2018",19.0,19.239999771118164,19.260000228881836,18.520000457763672
"Jul 20, 2018",20.479999542236328,19.700000762939453,20.600000381469727,19.469999313354492
"Jul 23, 2018",20.809999465942383,20.25,20.809999465942383,19.709999084472656
"Jul 24, 2018",21.079999923706055,20.809999465942383,21.18000030517578,20.809999465942383
"Jul 25, 2018",21.639999389648438,21.0,21.639999389648438,20.860000610351562
"Jul 26, 2018",20.600000381469727,21.639999389648438,21.639999389648438,20.43000030517578
"Jul 27, 2018",21.020000457763672,20.649999618530273,21.170000076293945,20.25
"Jul 30, 2018",20.700000762939453,21.290000915527344,21.34000015258789,20.530000686645508
"Jul 31, 2018",19.489999771118164,20.260000228881836,20.260000228881836,19.399999618530273
"Aug 01, 2018",19.299999237060547,19.309999465942383,19.709999084472656,18.940000534057617
"Aug 02, 2018",19.510000228881836,19.649999618530273,19.84000015258789,19.149999618530273
"Aug 03, 2018",20.049999237060547,20.0,20.200000762939453,19.559999465942383
"Aug 06, 2018",20.059999465942383,20.020000457763672,20.079999923706055,19.719999313354492
"Aug 07, 2018",19.950000762939453,20.229999542236328,20.25,19.850000381469727
"Aug 08, 2018",19.549999237060547,19.950000762939453,20.350000381469727,19.399999618530273
"Aug 09, 2018",19.420000076293945,19.510000228881836,19.860000610351562,19.100000381469727
"Aug 10, 2018",18.559999465942383,19.450000762939453,19.459999084472656,18.280000686645508
"Aug 13, 2018",18.65999984741211,18.600000381469727,18.90999984741211,18.25
"Aug 14, 2018",19.559999465942383,18.809999465942383,19.649999618530273,18.770000457763672
"Aug 15, 2018",18.920000076293945,19.389999389648438,19.489999771118164,18.84000015258789
"Aug 16, 2018",18.700000762939453,19.100000381469727,19.229999542236328,18.360000610351562
"Aug 17, 2018",18.0,18.540000915527344,18.540000915527344,17.899999618530273
"Aug 20, 2018",17.979999542236328,18.030000686645508,18.420000076293945,17.899999618530273
"Aug 21, 2018",17.68000030517578,17.979999542236328,18.239999771118164,17.6200008392334
"Aug 22, 2018",18.219999313354492,17.770000457763672,18.3700008392334,17.6200008392334
"Aug 23, 2018",17.809999465942383,18.149999618530273,18.290000915527344,17.780000686645508
"Aug 24, 2018",17.639999389648438,18.010000228881836,18.219999313354492,17.6200008392334
"Aug 27, 2018",18.399999618530273,17.719999313354492,18.479999542236328,17.709999084472656
"Aug 28, 2018",18.239999771118164,18.459999084472656,18.829999923706055,18.239999771118164
"Aug 29, 2018",19.299999237060547,18.290000915527344,19.299999237060547,18.239999771118164
"Aug 30, 2018",18.739999771118164,19.09000015258789,19.459999084472656,18.600000381469727
"Aug 31, 2018",19.780000686645508,18.770000457763672,19.780000686645508,18.770000457763672
"Sep 03, 2018",19.559999465942383,19.43000030517578,19.600000381469727,19.299999237060547
"Sep 04, 2018",18.770000457763672,19.719999313354492,19.760000228881836,18.559999465942383
"Sep 05, 2018",19.020000457763672,18.950000762939453,19.540000915527344,18.760000228881836
"Sep 06, 2018",19.479999542236328,19.389999389648438,19.579999923706055,18.8799991607666
"Sep 10, 2018",20.549999237060547,19.479999542236328,20.549999237060547,19.43000030517578
"Sep 11, 2018",20.459999084472656,20.100000381469727,20.6299991607666,19.809999465942383
"Sep 12, 2018",21.06999969482422,20.59000015258789,21.34000015258789,20.40999984741211
"Sep 13, 2018",20.190000534057617,21.299999237060547,21.299999237060547,20.1299991607666
"Sep 14, 2018",19.6299991607666,20.260000228881836,20.43000030517578,19.420000076293945
"Sep 17, 2018",19.719999313354492,19.6200008392334,19.940000534057617,19.1200008392334
"Sep 18, 2018",19.530000686645508,19.8799991607666,19.940000534057617,19.309999465942383
"Sep 19, 2018",19.5,19.59000015258789,19.670000076293945,19.040000915527344
"Sep 20, 2018",19.0,19.530000686645508,19.530000686645508,18.860000610351562
"Sep 21, 2018",18.899999618530273,19.0,19.1200008392334,18.579999923706055
"Sep 24, 2018",18.229999542236328,18.899999618530273,19.0,18.15999984741211
"Sep 25, 2018",18.0,18.049999237060547,18.139999389648438,17.850000381469727
"Sep 26, 2018",19.170000076293945,18.260000228881836,19.170000076293945,18.260000228881836
"Sep 27, 2018",19.489999771118164,19.290000915527344,19.639999389648438,18.989999771118164
"Sep 28, 2018",19.5,19.25,19.690000534057617,19.010000228881836
"Oct 01, 2018",19.299999237060547,19.5,19.600000381469727,18.90999984741211
"Oct 02, 2018",20.299999237060547,19.700000762939453,20.299999237060547,19.670000076293945
"Oct 03, 2018",21.84000015258789,21.15999984741211,22.3700008392334,21.100000381469727
"Oct 04, 2018",22.110000610351562,21.219999313354492,22.600000381469727,21.219999313354492
"Oct 05, 2018",22.549999237060547,22.670000076293945,22.93000030517578,21.5
"Oct 08, 2018",26.31999969482422,25.5,26.719999313354492,24.0
"Oct 09, 2018",25.0,25.299999237060547,25.700000762939453,24.649999618530273
"Oct 10, 2018",23.899999618530273,25.149999618530273,25.149999618530273,23.010000228881836
"Oct 11, 2018",24.25,23.989999771118164,24.780000686645508,23.84000015258789
"Oct 15, 2018",23.8700008392334,24.399999618530273,24.6200008392334,23.8700008392334
"Oct 16, 2018",24.479999542236328,24.270000457763672,24.489999771118164,23.969999313354492
"Oct 17, 2018",23.6299991607666,24.110000610351562,24.43000030517578,23.43000030517578
"Oct 18, 2018",22.670000076293945,23.399999618530273,23.559999465942383,22.670000076293945
"Oct 19, 2018",22.559999465942383,23.399999618530273,23.559999465942383,22.31999969482422
"Oct 22, 2018",22.399999618530273,23.010000228881836,23.020000457763672,22.25
"Oct 23, 2018",22.270000457763672,22.100000381469727,22.639999389648438,21.639999389648438
"Oct 24, 2018",21.799999237060547,22.329999923706055,22.360000610351562,21.729999542236328
"Oct 25, 2018",22.5,22.09000015258789,22.639999389648438,21.8700008392334
"Oct 26, 2018",23.049999237060547,22.850000381469727,23.049999237060547,22.270000457763672
"Oct 29, 2018",23.020000457763672,23.06999969482422,23.200000762939453,22.6299991607666
"Oct 30, 2018",24.209999084472656,23.579999923706055,24.209999084472656,22.809999465942383
"Oct 31, 2018",23.979999542236328,24.290000915527344,24.3799991607666,23.31999969482422
"Nov 01, 2018",23.3799991607666,24.059999465942383,24.110000610351562,22.940000534057617
"Nov 05, 2018",22.600000381469727,23.479999542236328,23.700000762939453,22.600000381469727
"Nov 06, 2018",22.639999389648438,22.700000762939453,23.06999969482422,22.020000457763672
"Nov 07, 2018",22.899999618530273,23.0,23.360000610351562,22.639999389648438
"Nov 08, 2018",22.399999618530273,23.200000762939453,23.229999542236328,22.209999084472656
"Nov 09, 2018",22.1299991607666,22.469999313354492,22.579999923706055,21.690000534057617
"Nov 12, 2018",21.329999923706055,22.190000534057617,22.479999542236328,21.270000457763672
"Nov 13, 2018",22.5,21.479999542236328,23.149999618530273,20.43000030517578
"Nov 14, 2018",21.90999984741211,22.799999237060547,22.799999237060547,21.809999465942383
"Nov 16, 2018",22.149999618530273,22.079999923706055,22.579999923706055,21.90999984741211
"Nov 19, 2018",23.459999084472656,22.489999771118164,23.59000015258789,22.3700008392334
"Nov 21, 2018",23.690000534057617,23.200000762939453,24.059999465942383,22.979999542236328
"Nov 22, 2018",23.600000381469727,23.709999084472656,23.889999389648438,23.260000228881836
"Nov 23, 2018",24.299999237060547,23.799999237060547,24.299999237060547,23.459999084472656
"Nov 26, 2018",24.299999237060547,24.299999237060547,24.520000457763672,23.950000762939453
"Nov 27, 2018",24.56999969482422,24.329999923706055,24.829999923706055,24.110000610351562
"Nov 28, 2018",24.309999465942383,24.600000381469727,24.700000762939453,23.799999237060547
"Nov 29, 2018",24.459999084472656,24.280000686645508,24.670000076293945,24.049999237060547
"Nov 30, 2018",24.450000762939453,24.549999237060547,24.649999618530273,24.18000030517578
"Dec 03, 2018",25.0,25.0,25.110000610351562,24.65999984741211
"Dec 04, 2018",24.989999771118164,25.1200008392334,25.290000915527344,24.09000015258789
"Dec 05, 2018",24.84000015258789,25.0,25.0,24.450000762939453
"Dec 06, 2018",24.700000762939453,24.399999618530273,24.899999618530273,24.100000381469727
"Dec 07, 2018",24.229999542236328,24.610000610351562,24.770000457763672,24.190000534057617
"Dec 10, 2018",24.1299991607666,24.3799991607666,24.3799991607666,23.670000076293945
"Dec 11, 2018",23.75,24.25,24.270000457763672,23.510000228881836
"Dec 12, 2018",22.850000381469727,23.549999237060547,23.790000915527344,22.399999618530273
"Dec 13, 2018",22.8700008392334,22.90999984741211,23.010000228881836,22.360000610351562
"Dec 14, 2018",22.950000762939453,22.600000381469727,23.09000015258789,22.5
"Dec 17, 2018",22.920000076293945,22.950000762939453,23.190000534057617,22.760000228881836
"Dec 18, 2018",23.649999618530273,23.079999923706055,23.950000762939453,22.90999984741211
"Dec 19, 2018",23.760000228881836,23.979999542236328,24.40999984741211,23.670000076293945
"Dec 20, 2018",23.920000076293945,23.8700008392334,24.25,23.6200008392334
"Dec 21, 2018",24.0,23.93000030517578,24.200000762939453,23.549999237060547
"Dec 26, 2018",24.25,23.729999542236328,24.3799991607666,23.649999618530273
"Dec 27, 2018",24.690000534057617,24.110000610351562,24.700000762939453,23.950000762939453
"Dec 28, 2018",25.700000762939453,24.690000534057617,25.850000381469727,24.510000228881836
"Jan 02, 2019",26.0,25.8700008392334,26.950000762939453,25.75
"Jan 03, 2019",26.600000381469727,25.75,26.719999313354492,25.649999618530273
"Jan 04, 2019",26.700000762939453,26.8799991607666,27.18000030517578,26.389999389648438
"Jan 07, 2019",26.850000381469727,27.190000534057617,27.270000457763672,26.229999542236328
"Jan 08, 2019",25.950000762939453,27.079999923706055,27.149999618530273,25.729999542236328
"Jan 09, 2019",26.010000228881836,26.219999313354492,26.3700008392334,25.43000030517578
"Jan 10, 2019",25.75,26.149999618530273,26.149999618530273,25.459999084472656
"Jan 11, 2019",25.799999237060547,25.75,26.0,25.43000030517578
"Jan 14, 2019",26.299999237060547,25.959999084472656,26.479999542236328,25.739999771118164
"Jan 15, 2019",26.06999969482422,26.399999618530273,26.450000762939453,25.81999969482422
"Jan 16, 2019",26.329999923706055,26.100000381469727,26.329999923706055,25.790000915527344
"Jan 17, 2019",26.5,26.399999618530273,26.850000381469727,26.110000610351562
"Jan 18, 2019",26.43000030517578,26.5,26.8700008392334,26.110000610351562
"Jan 21, 2019",26.200000762939453,26.5,26.5,25.440000534057617
"Jan 22, 2019",25.440000534057617,26.149999618530273,26.420000076293945,25.149999618530273
"Jan 23, 2019",26.350000381469727,25.5,26.670000076293945,25.43000030517578
"Jan 24, 2019",26.65999984741211,26.5,27.299999237060547,26.34000015258789
"Jan 28, 2019",27.100000381469727,26.1200008392334,27.729999542236328,26.1200008392334
"Jan 29, 2019",26.790000915527344,27.690000534057617,27.690000534057617,26.709999084472656
"Jan 30, 2019",26.600000381469727,26.899999618530273,26.899999618530273,26.190000534057617
"Jan 31, 2019",26.649999618530273,26.729999542236328,27.06999969482422,26.31999969482422
"Feb 01, 2019",26.610000610351562,26.8700008392334,27.020000457763672,26.3700008392334
"Feb 04, 2019",26.850000381469727,26.770000457763672,27.149999618530273,26.559999465942383
"Feb 05, 2019",26.989999771118164,26.920000076293945,27.149999618530273,26.510000228881836
"Feb 06, 2019",25.700000762939453,26.700000762939453,26.899999618530273,25.5
"Feb 07, 2019",25.010000228881836,25.799999237060547,26.149999618530273,24.389999389648438
"Feb 08, 2019",25.1200008392334,24.940000534057617,25.350000381469727,24.229999542236328
"Feb 11, 2019",25.600000381469727,25.1200008392334,25.700000762939453,24.850000381469727
"Feb 12, 2019",25.520000457763672,25.770000457763672,26.229999542236328,25.479999542236328
"Feb 13, 2019",26.260000228881836,26.100000381469727,26.579999923706055,25.549999237060547
"Feb 14, 2019",26.540000915527344,26.280000686645508,26.899999618530273,25.700000762939453
"Feb 15, 2019",26.229999542236328,26.540000915527344,26.649999618530273,25.989999771118164
"Feb 18, 2019",25.309999465942383,26.0,26.0,25.280000686645508
"Feb 19, 2019",25.139999389648438,25.420000076293945,25.610000610351562,25.1200008392334
"Feb 20, 2019",24.959999084472656,25.139999389648438,25.459999084472656,24.8799991607666
"Feb 21, 2019",24.56999969482422,25.1200008392334,25.190000534057617,23.739999771118164
"Feb 22, 2019",24.8799991607666,24.639999389648438,24.8799991607666,24.360000610351562
"Feb 25, 2019",24.520000457763672,25.139999389648438,25.15999984741211,24.360000610351562
"Feb 26, 2019",24.649999618530273,25.110000610351562,25.219999313354492,24.6200008392334
"Feb 27, 2019",24.6200008392334,24.93000030517578,24.93000030517578,24.420000076293945
"Feb 28, 2019",24.450000762939453,24.700000762939453,24.889999389648438,24.309999465942383
"Mar 01, 2019",24.100000381469727,24.40999984741211,24.719999313354492,23.790000915527344
"Mar 07, 2019",24.75,24.59000015258789,24.829999923706055,24.40999984741211
"Mar 08, 2019",24.899999618530273,24.5,25.450000762939453,24.40999984741211
"Mar 11, 2019",24.200000762939453,24.829999923706055,24.829999923706055,23.920000076293945
"Mar 12, 2019",24.540000915527344,24.3799991607666,25.030000686645508,24.239999771118164
"Mar 13, 2019",24.559999465942383,24.780000686645508,24.8700008392334,24.34000015258789
"Mar 14, 2019",24.690000534057617,24.700000762939453,24.950000762939453,24.420000076293945
"Mar 15, 2019",25.209999084472656,24.739999771118164,25.229999542236328,24.739999771118164
"Mar 18, 2019",25.299999237060547,25.420000076293945,25.420000076293945,24.8700008392334
"Mar 19, 2019",25.8700008392334,25.329999923706055,25.8700008392334,25.239999771118164
"Mar 20, 2019",24.899999618530273,25.8700008392334,25.969999313354492,24.799999237060547
"Mar 21, 2019",24.5,25.139999389648438,25.139999389648438,24.06999969482422
"Mar 22, 2019",23.700000762939453,24.059999465942383,24.1200008392334,23.5
"Mar 25, 2019",23.799999237060547,23.5,24.100000381469727,23.219999313354492
"Mar 26, 2019",24.649999618530273,24.170000076293945,24.649999618530273,23.799999237060547
"Mar 27, 2019",23.399999618530273,24.309999465942383,24.329999923706055,23.399999618530273
"Mar 28, 2019",24.139999389648438,23.40999984741211,24.459999084472656,23.09000015258789
"Mar 29, 2019",23.149999618530273,24.25,24.450000762939453,22.809999465942383
"Apr 01, 2019",23.450000762939453,23.350000381469727,23.600000381469727,23.110000610351562
"Apr 02, 2019",23.479999542236328,23.600000381469727,23.790000915527344,22.8700008392334
"Apr 03, 2019",23.899999618530273,23.6299991607666,24.1299991607666,23.540000915527344
"Apr 04, 2019",24.799999237060547,23.899999618530273,25.059999465942383,23.889999389648438
"Apr 05, 2019",24.510000228881836,25.15999984741211,25.600000381469727,24.329999923706055
"Apr 08, 2019",23.899999618530273,24.600000381469727,24.799999237060547,23.8700008392334
"Apr 09, 2019",23.6299991607666,23.899999618530273,23.950000762939453,23.239999771118164
"Apr 10, 2019",23.399999618530273,23.90999984741211,23.90999984741211,23.239999771118164
"Apr 11, 2019",22.940000534057617,23.5,23.639999389648438,22.540000915527344
"Apr 12, 2019",22.0,22.5,22.860000610351562,21.899999618530273
"Apr 15, 2019",22.899999618530273,22.299999237060547,23.200000762939453,22.280000686645508
"Apr 16, 2019",22.739999771118164,22.899999618530273,23.09000015258789,22.59000015258789
"Apr 17, 2019",22.25,22.899999618530273,23.25,21.93000030517578
"Apr 18, 2019",22.540000915527344,22.3700008392334,22.56999969482422,22.010000228881836
"Apr 22, 2019",23.200000762939453,22.530000686645508,23.5,22.3799991607666
"Apr 23, 2019",24.34000015258789,23.469999313354492,24.399999618530273,23.420000076293945
"Apr 24, 2019",23.75,24.5,24.649999618530273,23.6299991607666
"Apr 25, 2019",22.270000457763672,21.700000762939453,22.270000457763672,21.600000381469727
"Apr 26, 2019",21.850000381469727,22.270000457763672,22.34000015258789,21.850000381469727
"Apr 29, 2019",22.709999084472656,22.1299991607666,22.920000076293945,22.049999237060547
"Apr 30, 2019",23.700000762939453,22.510000228881836,23.700000762939453,22.510000228881836
"May 02, 2019",23.81999969482422,23.479999542236328,24.43000030517578,23.25
"May 03, 2019",22.809999465942383,24.0,24.100000381469727,22.809999465942383
"May 06, 2019",22.829999923706055,22.559999465942383,22.969999313354492,22.5
"May 07, 2019",23.6299991607666,23.200000762939453,23.8700008392334,23.049999237060547
"May 08, 2019",23.899999618530273,23.770000457763672,24.239999771118164,23.65999984741211
"May 09, 2019",24.489999771118164,23.600000381469727,24.600000381469727,23.549999237060547
"May 10, 2019",23.950000762939453,24.280000686645508,24.5,23.920000076293945
"May 13, 2019",23.579999923706055,23.65999984741211,23.969999313354492,23.31999969482422
"May 14, 2019",22.950000762939453,23.739999771118164,23.850000381469727,22.950000762939453
"May 15, 2019",22.75,22.739999771118164,23.170000076293945,22.329999923706055
"May 16, 2019",21.899999618530273,22.420000076293945,22.530000686645508,21.700000762939453
"May 17, 2019",21.40999984741211,21.899999618530273,22.059999465942383,21.0
"May 20, 2019",22.479999542236328,21.479999542236328,22.5,21.469999313354492
"May 21, 2019",23.43000030517578,22.59000015258789,23.540000915527344,22.479999542236328
"May 22, 2019",23.0,23.5,23.959999084472656,23.0
"May 23, 2019",23.09000015258789,23.1299991607666,23.649999618530273,22.829999923706055
"May 24, 2019",23.030000686645508,23.190000534057617,23.780000686645508,23.030000686645508
"May 27, 2019",23.100000381469727,23.270000457763672,23.600000381469727,23.100000381469727
"May 28, 2019",23.639999389648438,23.040000915527344,23.639999389648438,23.040000915527344
"May 29, 2019",24.600000381469727,23.6200008392334,24.600000381469727,23.559999465942383
"May 30, 2019",24.899999618530273,24.549999237060547,25.049999237060547,24.309999465942383
"May 31, 2019",25.549999237060547,24.700000762939453,25.600000381469727,24.559999465942383
"Jun 03, 2019",25.139999389648438,25.559999465942383,25.649999618530273,24.850000381469727
"Jun 04, 2019",25.0,25.200000762939453,25.299999237060547,24.5
"Jun 05, 2019",24.510000228881836,25.0,25.219999313354492,24.360000610351562
"Jun 06, 2019",25.309999465942383,24.8799991607666,25.639999389648438,24.68000030517578
"Jun 07, 2019",24.809999465942383,25.700000762939453,25.979999542236328,24.809999465942383
"Jun 10, 2019",24.350000381469727,24.889999389648438,24.889999389648438,24.15999984741211
"Jun 11, 2019",24.899999618530273,24.489999771118164,25.239999771118164,24.420000076293945
"Jun 12, 2019",24.649999618530273,24.799999237060547,24.920000076293945,24.40999984741211
"Jun 13, 2019",24.899999618530273,24.790000915527344,25.3799991607666,24.639999389648438
"Jun 14, 2019",24.639999389648438,25.0,25.25,24.639999389648438
"Jun 17, 2019",24.100000381469727,24.6200008392334,24.989999771118164,24.010000228881836
"Jun 18, 2019",24.719999313354492,24.100000381469727,25.040000915527344,23.920000076293945
"Jun 19, 2019",24.6200008392334,24.649999618530273,24.739999771118164,24.200000762939453
"Jun 21, 2019",25.0,24.729999542236328,25.170000076293945,24.6299991607666
"Jun 24, 2019",25.0,25.170000076293945,25.350000381469727,24.950000762939453
"Jun 25, 2019",24.290000915527344,24.989999771118164,25.09000015258789,24.229999542236328
"Jun 26, 2019",25.0,24.399999618530273,25.18000030517578,24.399999618530273
"Jun 27, 2019",25.0,25.0,25.309999465942383,24.709999084472656
"Jun 28, 2019",25.0,25.200000762939453,25.299999237060547,24.84000015258789
"Jul 01, 2019",24.5,25.309999465942383,25.350000381469727,24.5
"Jul 02, 2019",23.600000381469727,24.6299991607666,24.8700008392334,23.530000686645508
"Jul 03, 2019",24.0,23.649999618530273,24.0,23.139999389648438
"Jul 04, 2019",24.510000228881836,24.170000076293945,24.770000457763672,23.860000610351562
"Jul 05, 2019",24.75,24.5,24.950000762939453,24.34000015258789
"Jul 08, 2019",25.450000762939453,24.719999313354492,25.450000762939453,24.719999313354492
"Jul 10, 2019",26.600000381469727,25.5,27.100000381469727,25.489999771118164
"Jul 11, 2019",26.700000762939453,26.5,26.799999237060547,26.15999984741211
"Jul 12, 2019",26.399999618530273,26.700000762939453,26.81999969482422,26.389999389648438
"Jul 15, 2019",26.059999465942383,26.40999984741211,26.6200008392334,25.860000610351562
"Jul 16, 2019",25.8799991607666,26.09000015258789,26.299999237060547,25.510000228881836
"Jul 17, 2019",26.3700008392334,25.809999465942383,26.549999237060547,25.809999465942383
"Jul 18, 2019",26.5,26.459999084472656,26.799999237060547,26.34000015258789
"Jul 19, 2019",26.25,26.110000610351562,26.729999542236328,26.059999465942383
"Jul 22, 2019",25.5,25.920000076293945,26.270000457763672,25.440000534057617
"Jul 23, 2019",26.010000228881836,25.399999618530273,26.399999618530273,25.079999923706055
"Jul 24, 2019",26.31999969482422,26.06999969482422,27.6299991607666,26.0
"Jul 25, 2019",26.350000381469727,26.1200008392334,27.0,26.0
"Jul 26, 2019",27.040000915527344,26.579999923706055,27.25,26.510000228881836
"Jul 29, 2019",26.709999084472656,26.940000534057617,27.100000381469727,26.549999237060547
"Jul 30, 2019",26.399999618530273,26.6299991607666,26.920000076293945,26.209999084472656
"Jul 31, 2019",26.600000381469727,26.559999465942383,26.65999984741211,26.15999984741211
"Aug 01, 2019",27.100000381469727,26.100000381469727,28.0,25.809999465942383
"Aug 02, 2019",27.25,27.25,27.34000015258789,26.510000228881836
"Aug 05, 2019",26.889999389648438,26.799999237060547,27.170000076293945,26.200000762939453
"Aug 06, 2019",27.100000381469727,27.100000381469727,27.18000030517578,26.25
"Aug 07, 2019",26.81999969482422,26.790000915527344,26.950000762939453,26.40999984741211
"Aug 08, 2019",27.040000915527344,26.940000534057617,27.239999771118164,26.68000030517578
"Aug 09, 2019",27.34000015258789,26.899999618530273,27.34000015258789,26.739999771118164
"Aug 12, 2019",27.25,27.18000030517578,27.469999313354492,26.780000686645508
"Aug 13, 2019",27.25,27.09000015258789,27.479999542236328,26.850000381469727
"Aug 14, 2019",27.100000381469727,27.139999389648438,27.260000228881836,26.709999084472656
"Aug 15, 2019",26.670000076293945,27.100000381469727,27.15999984741211,26.489999771118164
"Aug 16, 2019",27.780000686645508,26.760000228881836,27.780000686645508,26.06999969482422
"Aug 19, 2019",28.0,27.6299991607666,29.09000015258789,27.530000686645508
"Aug 20, 2019",28.530000686645508,28.0,28.770000457763672,27.440000534057617
"Aug 21, 2019",29.0,28.920000076293945,29.469999313354492,28.420000076293945
"Aug 22, 2019",28.469999313354492,29.049999237060547,29.139999389648438,28.3799991607666
"Aug 23, 2019",28.149999618530273,28.219999313354492,28.670000076293945,27.450000762939453
"Aug 26, 2019",27.780000686645508,28.25,28.350000381469727,26.84000015258789
"Aug 27, 2019",27.989999771118164,27.809999465942383,28.200000762939453,27.049999237060547
"Aug 28, 2019",28.450000762939453,27.760000228881836,28.530000686645508,27.579999923706055
"Aug 29, 2019",28.799999237060547,28.510000228881836,29.09000015258789,28.219999313354492
"Aug 30, 2019",28.799999237060547,29.0,29.540000915527344,28.43000030517578
"Sep 02, 2019",28.75,28.43000030517578,28.75,28.149999618530273
"Sep 03, 2019",28.329999923706055,28.530000686645508,28.93000030517578,28.280000686645508
"Sep 04, 2019",28.1299991607666,28.549999237060547,28.739999771118164,27.709999084472656
"Sep 05, 2019",28.200000762939453,28.200000762939453,28.520000457763672,27.860000610351562
"Sep 06, 2019",28.34000015258789,28.280000686645508,28.5,28.100000381469727
"Sep 09, 2019",27.68000030517578,28.59000015258789,28.600000381469727,27.579999923706055
"Sep 10, 2019",27.59000015258789,27.31999969482422,27.739999771118164,27.209999084472656
"Sep 11, 2019",27.899999618530273,27.799999237060547,28.079999923706055,27.469999313354492
"Sep 12, 2019",27.799999237060547,28.100000381469727,28.350000381469727,27.770000457763672
"Sep 13, 2019",27.290000915527344,27.850000381469727,27.90999984741211,26.959999084472656
"Sep 16, 2019",27.530000686645508,27.600000381469727,27.799999237060547,27.010000228881836
"Sep 17, 2019",27.15999984741211,27.149999618530273,27.520000457763672,26.93000030517578
"Sep 18, 2019",26.850000381469727,27.200000762939453,27.3700008392334,26.469999313354492
"Sep 19, 2019",26.899999618530273,27.09000015258789,27.309999465942383,26.850000381469727
"Sep 20, 2019",27.399999618530273,27.09000015258789,27.399999618530273,26.93000030517578
"Sep 23, 2019",27.299999237060547,27.350000381469727,27.3700008392334,27.0
"Sep 24, 2019",27.100000381469727,27.299999237060547,27.299999237060547,26.90999984741211
"Sep 25, 2019",27.020000457763672,27.0,27.139999389648438,26.420000076293945
"Sep 26, 2019",27.579999923706055,27.25,27.579999923706055,27.020000457763672
"Sep 27, 2019",27.40999984741211,27.450000762939453,27.700000762939453,27.25
"Sep 30, 2019",27.530000686645508,27.520000457763672,27.649999618530273,27.139999389648438
"Oct 01, 2019",27.049999237060547,27.540000915527344,27.6200008392334,27.0
"Oct 02, 2019",26.450000762939453,26.899999618530273,26.950000762939453,26.360000610351562
"Oct 03, 2019",26.850000381469727,26.649999618530273,27.299999237060547,26.450000762939453
"Oct 04, 2019",26.969999313354492,26.860000610351562,26.989999771118164,26.549999237060547
"Oct 07, 2019",26.5,26.739999771118164,27.15999984741211,26.489999771118164
"Oct 08, 2019",26.5,26.6200008392334,26.850000381469727,26.450000762939453
"Oct 09, 2019",26.6299991607666,26.649999618530273,26.899999618530273,26.40999984741211
"Oct 10, 2019",26.579999923706055,26.700000762939453,26.790000915527344,26.34000015258789
"Oct 11, 2019",27.309999465942383,26.6200008392334,27.5,26.6200008392334
"Oct 14, 2019",27.479999542236328,27.389999389648438,27.479999542236328,27.229999542236328
"Oct 15, 2019",26.850000381469727,27.450000762939453,27.639999389648438,26.829999923706055
"Oct 16, 2019",26.850000381469727,26.850000381469727,27.010000228881836,26.469999313354492
"Oct 17, 2019",26.600000381469727,26.899999618530273,27.149999618530273,26.450000762939453
"Oct 18, 2019",26.649999618530273,26.670000076293945,26.8799991607666,26.479999542236328
"Oct 21, 2019",27.06999969482422,26.68000030517578,27.100000381469727,26.68000030517578
"Oct 22, 2019",27.100000381469727,27.079999923706055,27.8700008392334,26.959999084472656
"Oct 23, 2019",27.739999771118164,27.239999771118164,27.8700008392334,27.010000228881836
"Oct 24, 2019",28.270000457763672,27.8799991607666,28.649999618530273,27.780000686645508
"Oct 25, 2019",28.450000762939453,28.399999618530273,28.850000381469727,28.0
"Oct 28, 2019",28.989999771118164,28.200000762939453,29.200000762939453,28.059999465942383
"Oct 29, 2019",28.34000015258789,28.850000381469727,28.90999984741211,28.260000228881836
"Oct 30, 2019",28.75,28.360000610351562,28.860000610351562,28.0
"Oct 31, 2019",28.280000686645508,28.790000915527344,28.790000915527344,27.920000076293945
"Nov 01, 2019",28.420000076293945,28.440000534057617,28.75,28.290000915527344
"Nov 04, 2019",27.770000457763672,28.600000381469727,28.639999389648438,27.75
"Nov 05, 2019",27.469999313354492,27.770000457763672,27.959999084472656,27.110000610351562
"Nov 06, 2019",27.5,27.600000381469727,28.0,27.139999389648438
"Nov 07, 2019",27.219999313354492,27.549999237060547,27.889999389648438,27.139999389648438
"Nov 08, 2019",27.8799991607666,27.3700008392334,28.68000030517578,27.059999465942383
"Nov 11, 2019",28.5,28.0,28.5,27.5
"Nov 12, 2019",27.479999542236328,28.239999771118164,28.389999389648438,26.920000076293945
"Nov 13, 2019",27.139999389648438,27.329999923706055,27.479999542236328,26.81999969482422
"Nov 14, 2019",27.6299991607666,27.399999618530273,27.739999771118164,26.959999084472656
"Nov 18, 2019",27.690000534057617,27.889999389648438,28.09000015258789,27.540000915527344
"Nov 19, 2019",27.68000030517578,27.68000030517578,28.139999389648438,27.079999923706055
"Nov 21, 2019",27.579999923706055,27.68000030517578,28.139999389648438,27.520000457763672
"Nov 22, 2019",27.579999923706055,27.610000610351562,27.829999923706055,27.3700008392334
"Nov 25, 2019",27.770000457763672,27.68000030517578,27.989999771118164,27.459999084472656
"Nov 26, 2019",28.0,27.520000457763672,28.0,27.170000076293945
"Nov 27, 2019",28.110000610351562,27.989999771118164,28.3700008392334,27.65999984741211
"Nov 28, 2019",28.280000686645508,28.139999389648438,28.450000762939453,27.93000030517578
"Nov 29, 2019",28.440000534057617,28.280000686645508,28.440000534057617,27.81999969482422
"Dec 02, 2019",28.65999984741211,28.489999771118164,28.75,28.329999923706055
"Dec 03, 2019",28.309999465942383,28.75,28.829999923706055,28.219999313354492
"Dec 04, 2019",27.700000762939453,28.6299991607666,28.6299991607666,27.610000610351562
"Dec 05, 2019",27.420000076293945,27.690000534057617,27.690000534057617,26.899999618530273
"Dec 06, 2019",27.229999542236328,27.420000076293945,27.579999923706055,27.100000381469727
"Dec 09, 2019",26.649999618530273,27.149999618530273,27.34000015258789,26.520000457763672
"Dec 10, 2019",27.239999771118164,26.670000076293945,27.239999771118164,26.6299991607666
"Dec 11, 2019",27.520000457763672,27.25,27.520000457763672,26.950000762939453
"Dec 12, 2019",27.799999237060547,27.5,27.860000610351562,27.40999984741211
"Dec 13, 2019",27.520000457763672,27.799999237060547,27.860000610351562,27.15999984741211
"Dec 16, 2019",28.5,27.700000762939453,28.540000915527344,27.510000228881836
"Dec 17, 2019",29.200000762939453,28.459999084472656,29.3700008392334,28.190000534057617
"Dec 18, 2019",29.219999313354492,29.040000915527344,29.399999618530273,28.709999084472656
"Dec 19, 2019",29.43000030517578,29.219999313354492,29.559999465942383,28.950000762939453
"Dec 20, 2019",29.299999237060547,29.3700008392334,29.93000030517578,29.170000076293945
"Dec 23, 2019",30.200000762939453,29.25,30.399999618530273,29.200000762939453
"Dec 26, 2019",30.139999389648438,30.190000534057617,30.329999923706055,29.93000030517578
"Dec 27, 2019",30.43000030517578,30.299999237060547,30.489999771118164,29.969999313354492
"Dec 30, 2019",30.06999969482422,30.43000030517578,30.43000030517578,29.809999465942383
