Date,Price,Open,High,Low
"Jun 03, 2019",46.689998626708984,47.34000015258789,47.369998931884766,45.709999084472656
"Jun 04, 2019",46.709999084472656,46.5099983215332,47.099998474121094,45.540000915527344
"Jun 05, 2019",45.150001525878906,47.119998931884766,47.290000915527344,44.720001220703125
"Jun 06, 2019",46.84000015258789,45.36000061035156,48.130001068115234,45.04999923706055
"Jun 07, 2019",48.599998474121094,48.209999084472656,48.77000045776367,47.84000015258789
"Jun 10, 2019",47.349998474121094,48.70000076293945,48.70000076293945,47.25
"Jun 11, 2019",47.290000915527344,47.599998474121094,48.0,46.79999923706055
"Jun 12, 2019",47.25,47.79999923706055,48.369998931884766,47.09000015258789
"Jun 13, 2019",47.08000183105469,47.599998474121094,47.63999938964844,46.150001525878906
"Jun 14, 2019",46.63999938964844,47.380001068115234,47.380001068115234,46.220001220703125
"Jun 17, 2019",47.75,46.40999984741211,48.5,46.40999984741211
"Jun 18, 2019",48.75,48.0,49.369998931884766,47.36000061035156
"Jun 19, 2019",49.599998474121094,49.150001525878906,49.68000030517578,48.65999984741211
"Jun 21, 2019",50.349998474121094,50.0,50.72999954223633,49.209999084472656
"Jun 24, 2019",49.79999923706055,50.0099983215332,50.540000915527344,49.459999084472656
"Jun 25, 2019",49.5,49.970001220703125,50.130001068115234,48.97999954223633
"Jun 26, 2019",49.0,50.099998474121094,50.099998474121094,48.59000015258789
"Jun 27, 2019",49.439998626708984,49.0,49.650001525878906,48.220001220703125
"Jun 28, 2019",50.880001068115234,49.70000076293945,50.880001068115234,49.099998474121094
"Jul 01, 2019",50.04999923706055,51.79999923706055,51.79999923706055,49.470001220703125
"Jul 02, 2019",50.09000015258789,50.439998626708984,50.630001068115234,49.900001525878906
"Jul 03, 2019",51.0,50.099998474121094,51.0,49.11000061035156
"Jul 04, 2019",52.7599983215332,51.0,53.459999084472656,51.0
"Jul 05, 2019",56.11000061035156,53.040000915527344,56.880001068115234,52.5
"Jul 08, 2019",56.7400016784668,55.86000061035156,57.90999984741211,55.68000030517578
"Jul 10, 2019",56.31999969482422,57.0,57.400001525878906,55.61000061035156
"Jul 11, 2019",58.209999084472656,56.33000183105469,59.16999816894531,56.33000183105469
"Jul 12, 2019",57.9900016784668,57.9900016784668,58.54999923706055,57.20000076293945
"Jul 15, 2019",57.599998474121094,58.0,58.47999954223633,57.310001373291016
"Jul 16, 2019",58.5,57.349998474121094,58.7599983215332,57.02000045776367
"Jul 17, 2019",58.4900016784668,59.0,59.0,58.130001068115234
"Jul 18, 2019",57.95000076293945,58.5,58.75,56.869998931884766
"Jul 19, 2019",57.220001220703125,57.689998626708984,58.13999938964844,56.560001373291016
"Jul 22, 2019",56.349998474121094,56.88999938964844,57.880001068115234,56.349998474121094
"Jul 23, 2019",55.9900016784668,56.400001525878906,56.97999954223633,55.2599983215332
"Jul 24, 2019",55.650001525878906,56.0,56.4900016784668,55.400001525878906
"Jul 25, 2019",54.900001525878906,55.650001525878906,55.97999954223633,54.380001068115234
"Jul 26, 2019",55.119998931884766,55.099998474121094,55.25,54.22999954223633
"Jul 29, 2019",56.290000915527344,55.25,56.290000915527344,54.58000183105469
"Jul 30, 2019",59.34000015258789,56.33000183105469,59.88999938964844,56.33000183105469
"Jul 31, 2019",59.7599983215332,59.689998626708984,61.93000030517578,58.75
"Aug 01, 2019",61.33000183105469,59.79999923706055,64.3499984741211,59.79999923706055
"Aug 02, 2019",61.900001525878906,62.970001220703125,63.349998474121094,60.599998474121094
"Aug 05, 2019",59.5,61.59000015258789,61.59000015258789,59.400001525878906
"Aug 06, 2019",62.619998931884766,60.20000076293945,63.77000045776367,60.20000076293945
"Aug 07, 2019",63.41999816894531,63.099998474121094,64.0999984741211,61.5
"Aug 08, 2019",64.73999786376953,64.19000244140625,65.55999755859375,63.09000015258789
"Aug 09, 2019",64.25,65.0,65.56999969482422,62.88999938964844
"Aug 12, 2019",62.5,64.0,64.1500015258789,61.31999969482422
"Aug 13, 2019",64.05999755859375,66.0,66.94999694824219,63.72999954223633
"Aug 14, 2019",62.369998931884766,64.0,64.79000091552734,61.97999954223633
"Aug 15, 2019",62.0,62.40999984741211,64.41000366210938,61.09000015258789
"Aug 16, 2019",61.45000076293945,62.38999938964844,63.95000076293945,60.4900016784668
"Aug 19, 2019",63.79999923706055,62.5,64.7699966430664,62.18000030517578
"Aug 20, 2019",65.5,63.9900016784668,65.5999984741211,61.290000915527344
"Aug 21, 2019",66.38999938964844,65.80999755859375,67.94000244140625,65.75
"Aug 22, 2019",67.19999694824219,67.0,68.44000244140625,66.62999725341797
"Aug 23, 2019",55.599998474121094,59.75,61.599998474121094,55.599998474121094
"Aug 26, 2019",45.619998931884766,58.599998474121094,59.310001373291016,40.0
"Aug 27, 2019",53.81999969482422,50.209999084472656,54.81999969482422,47.11000061035156
"Aug 28, 2019",52.81999969482422,54.66999816894531,54.970001220703125,52.0
"Aug 29, 2019",56.0099983215332,54.220001220703125,58.599998474121094,52.650001525878906
"Aug 30, 2019",57.04999923706055,57.599998474121094,58.25,56.5099983215332
"Sep 02, 2019",58.79999923706055,57.5,59.599998474121094,57.400001525878906
"Sep 03, 2019",56.29999923706055,58.79999923706055,58.810001373291016,55.709999084472656
"Sep 04, 2019",55.7400016784668,56.630001068115234,57.0099983215332,54.349998474121094
"Sep 05, 2019",54.790000915527344,56.04999923706055,57.290000915527344,54.400001525878906
"Sep 06, 2019",53.099998474121094,54.0,54.88999938964844,52.61000061035156
"Sep 09, 2019",50.560001373291016,53.09000015258789,53.369998931884766,49.369998931884766
"Sep 10, 2019",51.2400016784668,50.5,51.2400016784668,49.29999923706055
"Sep 11, 2019",53.540000915527344,52.25,53.959999084472656,52.22999954223633
"Sep 12, 2019",54.90999984741211,54.59000015258789,55.529998779296875,53.02000045776367
"Sep 13, 2019",54.9900016784668,55.619998931884766,56.130001068115234,54.58000183105469
"Sep 16, 2019",54.470001220703125,55.029998779296875,55.689998626708984,54.099998474121094
"Sep 17, 2019",55.45000076293945,54.47999954223633,55.5,54.029998779296875
"Sep 18, 2019",56.83000183105469,55.0,56.83000183105469,55.0
"Sep 19, 2019",57.959999084472656,57.0,58.689998626708984,56.529998779296875
"Sep 20, 2019",57.470001220703125,57.970001220703125,58.290000915527344,56.869998931884766
"Sep 23, 2019",57.0,57.290000915527344,57.290000915527344,56.189998626708984
"Sep 24, 2019",56.900001525878906,57.25,57.25,56.209999084472656
"Sep 25, 2019",57.310001373291016,57.09000015258789,57.310001373291016,54.900001525878906
"Sep 26, 2019",58.540000915527344,57.29999923706055,58.540000915527344,56.90999984741211
"Sep 27, 2019",58.11000061035156,58.619998931884766,58.619998931884766,57.33000183105469
"Sep 30, 2019",58.540000915527344,58.0,58.9900016784668,57.900001525878906
"Oct 01, 2019",57.79999923706055,58.5,58.72999954223633,57.209999084472656
"Oct 02, 2019",56.279998779296875,57.029998779296875,57.33000183105469,55.630001068115234
"Oct 03, 2019",54.150001525878906,56.0099983215332,56.40999984741211,50.599998474121094
"Oct 04, 2019",51.83000183105469,54.150001525878906,55.470001220703125,51.5099983215332
"Oct 07, 2019",50.619998931884766,51.79999923706055,52.150001525878906,50.61000061035156
"Oct 08, 2019",51.45000076293945,50.97999954223633,52.13999938964844,49.959999084472656
"Oct 09, 2019",52.18000030517578,52.2400016784668,52.61000061035156,50.650001525878906
"Oct 10, 2019",53.70000076293945,51.81999969482422,54.189998626708984,51.65999984741211
"Oct 11, 2019",54.810001373291016,54.0,54.900001525878906,53.529998779296875
"Oct 14, 2019",55.72999954223633,54.95000076293945,55.849998474121094,54.11000061035156
"Oct 15, 2019",56.59000015258789,55.849998474121094,57.65999984741211,55.2400016784668
"Oct 16, 2019",58.189998626708984,56.689998626708984,58.189998626708984,56.2599983215332
"Oct 17, 2019",58.36000061035156,58.04999923706055,58.79999923706055,58.0099983215332
"Oct 18, 2019",58.20000076293945,57.9900016784668,58.7400016784668,57.31999969482422
"Oct 21, 2019",58.61000061035156,58.0,58.630001068115234,57.40999984741211
"Oct 22, 2019",58.790000915527344,58.900001525878906,59.290000915527344,58.279998779296875
"Oct 23, 2019",61.47999954223633,59.060001373291016,62.22999954223633,58.70000076293945
"Oct 24, 2019",64.19999694824219,61.650001525878906,64.37000274658203,61.599998474121094
"Oct 25, 2019",64.25,64.69999694824219,66.26000213623047,63.5099983215332
"Oct 28, 2019",64.29000091552734,65.0,65.0,63.88999938964844
"Oct 29, 2019",63.54999923706055,64.11000061035156,64.55999755859375,63.150001525878906
"Oct 30, 2019",64.08000183105469,63.9900016784668,64.30999755859375,63.040000915527344
"Oct 31, 2019",65.3499984741211,64.4000015258789,65.44000244140625,63.689998626708984
"Nov 01, 2019",65.7699966430664,65.68000030517578,66.72000122070312,64.80999755859375
"Nov 04, 2019",65.97000122070312,66.38999938964844,67.0,64.8499984741211
"Nov 05, 2019",67.36000061035156,67.30000305175781,67.9800033569336,66.02999877929688
"Nov 06, 2019",66.31999969482422,67.25,67.73999786376953,65.27999877929688
"Nov 07, 2019",66.83000183105469,66.80999755859375,67.0,66.13999938964844
"Nov 08, 2019",67.93000030517578,66.30000305175781,68.23999786376953,65.66999816894531
"Nov 11, 2019",67.13999938964844,67.29000091552734,67.5199966430664,66.31999969482422
"Nov 12, 2019",66.54000091552734,66.44999694824219,67.20999908447266,65.75
"Nov 13, 2019",64.38999938964844,66.06999969482422,66.81999969482422,64.0999984741211
"Nov 14, 2019",66.7699966430664,65.66000366210938,66.98999786376953,65.05000305175781
"Nov 18, 2019",66.91999816894531,67.51000213623047,68.26000213623047,66.77999877929688
"Nov 19, 2019",68.5,67.0,68.5999984741211,66.4800033569336
"Nov 21, 2019",70.20999908447266,68.80000305175781,70.69000244140625,68.31999969482422
"Nov 22, 2019",70.87000274658203,71.69999694824219,71.69999694824219,70.55000305175781
"Nov 25, 2019",69.93000030517578,71.66999816894531,71.94999694824219,69.5999984741211
"Nov 26, 2019",67.33000183105469,70.0,70.0,66.25
"Nov 27, 2019",68.5,68.48999786376953,68.7300033569336,67.0999984741211
"Nov 28, 2019",68.55000305175781,68.30000305175781,69.0999984741211,67.7300033569336
"Nov 29, 2019",69.52999877929688,68.5,69.80000305175781,68.5
"Dec 02, 2019",69.06999969482422,70.0,70.8499984741211,68.80999755859375
"Dec 03, 2019",68.5199966430664,69.0,69.12999725341797,67.80000305175781
"Dec 04, 2019",69.95999908447266,68.5,70.05999755859375,67.9000015258789
"Dec 05, 2019",70.58999633789062,70.94999694824219,71.45999908447266,70.3499984741211
"Dec 06, 2019",73.87000274658203,71.5,74.38999938964844,71.0199966430664
"Dec 09, 2019",76.73999786376953,75.0,77.47000122070312,75.0
"Dec 10, 2019",74.12999725341797,76.9000015258789,76.91999816894531,73.2300033569336
"Dec 11, 2019",72.87999725341797,74.80000305175781,75.91999816894531,72.51000213623047
"Dec 12, 2019",74.72000122070312,74.04000091552734,74.93000030517578,73.5199966430664
"Dec 13, 2019",74.69999694824219,74.75,74.94999694824219,73.51000213623047
"Dec 16, 2019",74.8499984741211,74.98999786376953,75.55000305175781,74.12999725341797
"Dec 17, 2019",75.0,74.68000030517578,75.38999938964844,73.11000061035156
"Dec 18, 2019",74.56999969482422,75.4000015258789,75.4000015258789,73.41000366210938
"Dec 19, 2019",75.97000122070312,75.0,77.18000030517578,74.26000213623047
"Dec 20, 2019",75.56999969482422,76.36000061035156,76.7699966430664,75.25
"Dec 23, 2019",74.16999816894531,75.54000091552734,76.41000366210938,73.69999694824219
"Dec 26, 2019",75.6500015258789,74.8499984741211,76.3499984741211,74.55000305175781
"Dec 27, 2019",74.73999786376953,75.5,75.83000183105469,73.7699966430664
"Dec 30, 2019",75.5999984741211,75.98999786376953,76.72000122070312,75.0199966430664
"Jan 02, 2020",75.80999755859375,76.1500015258789,76.98999786376953,75.80999755859375
"Jan 03, 2020",76.02999877929688,75.87999725341797,76.19999694824219,75.45999908447266
"Jan 06, 2020",75.91999816894531,76.3499984741211,76.9000015258789,75.5999984741211
"Jan 07, 2020",75.5999984741211,74.6500015258789,75.69999694824219,73.1500015258789
"Jan 08, 2020",74.93000030517578,75.4000015258789,75.5,73.95999908447266
"Jan 09, 2020",75.44000244140625,75.19999694824219,75.47000122070312,74.5199966430664
"Jan 10, 2020",76.5,76.0,78.19999694824219,75.62000274658203
"Jan 13, 2020",76.69999694824219,76.4000015258789,77.4000015258789,76.18000030517578
"Jan 14, 2020",75.23999786376953,76.33000183105469,76.4800033569336,75.16000366210938
"Jan 15, 2020",74.5999984741211,75.01000213623047,75.41999816894531,73.5999984741211
"Jan 16, 2020",73.6500015258789,74.80999755859375,75.4000015258789,73.30000305175781
"Jan 17, 2020",76.62999725341797,74.94999694824219,76.6500015258789,74.30999755859375
"Jan 20, 2020",76.5,76.69999694824219,77.08000183105469,76.25
"Jan 21, 2020",76.87999725341797,76.7699966430664,77.0,75.62999725341797
"Jan 22, 2020",75.91999816894531,77.4000015258789,77.4000015258789,75.0
"Jan 23, 2020",78.4000015258789,78.0999984741211,78.4000015258789,77.13999938964844
"Jan 24, 2020",78.16000366210938,78.4000015258789,78.9000015258789,76.7699966430664
"Jan 27, 2020",75.0199966430664,76.5,76.81999969482422,74.6500015258789
"Jan 28, 2020",75.22000122070312,73.9800033569336,76.0,73.9800033569336
"Jan 29, 2020",75.41000366210938,75.30000305175781,76.04000091552734,74.19999694824219
"Jan 30, 2020",73.87000274658203,74.87999725341797,74.87999725341797,72.61000061035156
"Jan 31, 2020",74.2699966430664,74.13999938964844,75.55000305175781,73.5999984741211
"Feb 03, 2020",75.4800033569336,75.9000015258789,75.9000015258789,74.33000183105469
"Feb 04, 2020",74.98999786376953,75.98999786376953,76.4000015258789,74.70999908447266
"Feb 05, 2020",78.41999816894531,76.37999725341797,78.8499984741211,76.12999725341797
"Feb 06, 2020",78.01000213623047,78.9000015258789,78.9000015258789,76.86000061035156
"Feb 07, 2020",77.02999877929688,78.19999694824219,78.9000015258789,76.83000183105469
"Feb 10, 2020",73.5,77.43000030517578,77.43000030517578,73.22000122070312
"Feb 11, 2020",76.23999786376953,73.81999969482422,76.76000213623047,73.54000091552734
"Feb 12, 2020",78.88999938964844,76.37000274658203,78.9000015258789,76.05000305175781
"Feb 13, 2020",81.62999725341797,79.0,81.80000305175781,77.80000305175781
"Feb 14, 2020",77.37000274658203,81.44999694824219,81.44999694824219,76.1500015258789
"Feb 17, 2020",77.18000030517578,78.0,78.76000213623047,76.5
"Feb 18, 2020",74.58000183105469,76.88999938964844,76.88999938964844,73.98999786376953
"Feb 19, 2020",73.3499984741211,74.5,74.94999694824219,72.16000366210938
"Feb 20, 2020",73.69999694824219,75.0999984741211,75.0999984741211,71.51000213623047
"Feb 21, 2020",72.0199966430664,72.0,73.98999786376953,70.9000015258789
"Feb 27, 2020",66.98999786376953,66.0,68.18000030517578,64.22000122070312
"Feb 28, 2020",65.80999755859375,65.0,66.37999725341797,62.209999084472656
"Mar 02, 2020",66.20999908447266,66.29000091552734,69.08000183105469,64.5
"Mar 03, 2020",64.33000183105469,66.56999969482422,68.37999725341797,64.0999984741211
"Mar 04, 2020",65.95999908447266,65.0999984741211,67.08000183105469,64.25
"Mar 05, 2020",61.38999938964844,64.9000015258789,65.83000183105469,61.08000183105469
"Mar 06, 2020",56.5,56.130001068115234,59.0,54.5
"Mar 09, 2020",47.9900016784668,50.0,52.119998931884766,47.369998931884766
"Mar 10, 2020",50.13999938964844,50.70000076293945,51.54999923706055,47.779998779296875
"Mar 11, 2020",44.40999984741211,48.83000183105469,50.93000030517578,42.900001525878906
"Mar 12, 2020",32.47999954223633,37.970001220703125,38.849998474121094,31.25
"Mar 13, 2020",41.540000915527344,40.70000076293945,42.0,32.52000045776367
"Mar 16, 2020",35.29999923706055,35.0,38.06999969482422,33.5099983215332
"Mar 17, 2020",35.0,36.79999923706055,36.849998474121094,33.130001068115234
"Mar 18, 2020",32.0,32.5,33.13999938964844,25.799999237060547
"Mar 19, 2020",33.04999923706055,30.0,34.08000183105469,27.010000228881836
"Mar 20, 2020",30.309999465942383,34.0,34.7599983215332,28.510000228881836
"Mar 23, 2020",26.110000610351562,30.0,30.399999618530273,25.530000686645508
"Mar 24, 2020",32.599998474121094,29.0,32.599998474121094,29.0
"Mar 25, 2020",34.209999084472656,32.5,37.75,30.850000381469727
"Mar 26, 2020",37.22999954223633,35.0,40.400001525878906,33.79999923706055
"Mar 27, 2020",36.400001525878906,35.0,37.900001525878906,34.31999969482422
"Mar 30, 2020",36.08000183105469,36.599998474121094,38.880001068115234,35.15999984741211
"Mar 31, 2020",33.63999938964844,36.08000183105469,36.400001525878906,32.560001373291016
"Apr 01, 2020",30.0,32.0,32.0,29.5
"Apr 02, 2020",31.90999984741211,30.559999465942383,31.90999984741211,30.0
"Apr 03, 2020",32.310001373291016,31.420000076293945,32.4900016784668,29.600000381469727
"Apr 06, 2020",35.20000076293945,34.5,37.220001220703125,34.5
"Apr 07, 2020",37.689998626708984,39.5,40.209999084472656,37.2400016784668
"Apr 08, 2020",40.18000030517578,38.27000045776367,40.470001220703125,37.400001525878906
"Apr 09, 2020",41.75,40.4900016784668,42.20000076293945,40.18000030517578
"Apr 13, 2020",40.25,41.75,41.75,39.439998626708984
"Apr 14, 2020",40.459999084472656,40.61000061035156,42.310001373291016,40.459999084472656
"Apr 15, 2020",39.97999954223633,39.0,41.2400016784668,38.5
"Apr 16, 2020",39.619998931884766,41.08000183105469,41.34000015258789,39.36000061035156
"Apr 17, 2020",40.79999923706055,41.040000915527344,41.18000030517578,39.83000183105469
"Apr 20, 2020",39.849998474121094,39.790000915527344,41.75,39.36000061035156
"Apr 22, 2020",42.189998626708984,39.900001525878906,42.4900016784668,39.20000076293945
"Apr 23, 2020",40.599998474121094,43.0,44.08000183105469,40.38999938964844
"Apr 24, 2020",37.349998474121094,40.0,40.709999084472656,33.79999923706055
"Apr 27, 2020",40.15999984741211,38.5,40.33000183105469,36.880001068115234
"Apr 28, 2020",43.79999923706055,41.290000915527344,44.119998931884766,41.209999084472656
"Apr 29, 2020",43.7400016784668,45.150001525878906,45.83000183105469,43.31999969482422
"Apr 30, 2020",41.810001373291016,42.29999923706055,43.0,40.63999938964844
"May 04, 2020",41.209999084472656,40.59000015258789,41.79999923706055,40.0
"May 05, 2020",41.290000915527344,41.79999923706055,42.66999816894531,40.4900016784668
"May 06, 2020",39.5,41.540000915527344,41.75,39.5
"May 07, 2020",37.310001373291016,40.15999984741211,40.16999816894531,37.209999084472656
"May 08, 2020",37.41999816894531,37.5099983215332,38.40999984741211,36.52000045776367
"May 11, 2020",37.08000183105469,37.099998474121094,38.83000183105469,36.54999923706055
"May 12, 2020",36.4900016784668,38.599998474121094,39.52000045776367,36.2400016784668
"May 13, 2020",37.54999923706055,37.20000076293945,37.59000015258789,36.029998779296875
"May 14, 2020",38.119998931884766,37.0,38.119998931884766,36.099998474121094
"May 15, 2020",37.38999938964844,37.79999923706055,38.810001373291016,36.34000015258789
"May 18, 2020",40.72999954223633,38.5,40.939998626708984,38.0
"May 19, 2020",41.5,40.5,42.22999954223633,39.93000030517578
"May 20, 2020",42.970001220703125,41.79999923706055,43.27000045776367,41.15999984741211
"May 21, 2020",46.9900016784668,43.209999084472656,47.040000915527344,42.279998779296875
"May 22, 2020",46.06999969482422,46.150001525878906,46.900001525878906,45.209999084472656
"May 25, 2020",49.939998626708984,48.5,50.59000015258789,47.06999969482422
"May 26, 2020",49.209999084472656,51.0099983215332,52.04999923706055,49.209999084472656
"May 27, 2020",50.88999938964844,50.02000045776367,50.90999984741211,49.619998931884766
"May 28, 2020",49.59000015258789,49.9900016784668,50.5,49.130001068115234
"May 29, 2020",48.84000015258789,49.75,49.75,47.25
"Jun 01, 2020",50.13999938964844,48.84000015258789,50.439998626708984,48.189998626708984
"Jun 02, 2020",55.310001373291016,50.290000915527344,55.310001373291016,50.20000076293945
"Jun 03, 2020",59.5,57.38999938964844,61.869998931884766,56.79999923706055
"Jun 04, 2020",60.25,58.7400016784668,61.5,57.2400016784668
"Jun 05, 2020",60.2400016784668,62.25,63.63999938964844,59.58000183105469
"Jun 08, 2020",66.0199966430664,60.36000061035156,67.2699966430664,60.36000061035156
"Jun 09, 2020",65.58000183105469,64.48999786376953,68.5,63.279998779296875
"Jun 10, 2020",63.36000061035156,66.5,67.0,62.5
"Jun 12, 2020",63.0099983215332,61.77000045776367,63.5,60.70000076293945
"Jun 15, 2020",60.810001373291016,61.0,62.119998931884766,59.52000045776367
"Jun 16, 2020",62.900001525878906,62.849998474121094,64.91999816894531,62.31999969482422
"Jun 17, 2020",63.790000915527344,63.0,66.44999694824219,63.0
"Jun 18, 2020",69.25,63.95000076293945,69.80000305175781,63.040000915527344
"Jun 19, 2020",72.0,70.26000213623047,72.0,68.22000122070312
"Jun 22, 2020",75.98999786376953,71.5,77.87000274658203,70.5199966430664
"Jun 23, 2020",78.45999908447266,78.0999984741211,81.80000305175781,77.19999694824219
"Jun 24, 2020",76.69999694824219,77.98999786376953,79.98999786376953,74.62000274658203
"Jun 25, 2020",76.9000015258789,77.0,79.4000015258789,75.1500015258789
"Jun 26, 2020",72.66999816894531,76.20999908447266,77.77999877929688,71.9000015258789
"Jun 29, 2020",75.69999694824219,75.0,75.7699966430664,73.69999694824219
"Jun 30, 2020",77.19999694824219,75.4000015258789,78.4000015258789,74.29000091552734
"Jul 01, 2020",76.4000015258789,78.5,79.5,75.76000213623047
"Jul 02, 2020",79.0,77.8499984741211,80.41999816894531,77.23999786376953
"Jul 03, 2020",79.51000213623047,78.79000091552734,80.12000274658203,78.2300033569336
"Jul 06, 2020",80.0,81.1500015258789,81.97000122070312,79.45999908447266
"Jul 07, 2020",80.94999694824219,79.68000030517578,82.19000244140625,78.5
"Jul 08, 2020",85.0,81.80999755859375,85.0,81.72000122070312
"Jul 09, 2020",82.86000061035156,85.04000091552734,86.08000183105469,82.80000305175781
"Jul 10, 2020",85.4000015258789,83.44999694824219,85.4000015258789,82.26000213623047
"Jul 13, 2020",84.95999908447266,86.0,87.0999984741211,84.58999633789062
"Jul 14, 2020",83.4000015258789,84.9000015258789,86.19999694824219,81.83999633789062
"Jul 15, 2020",83.9800033569336,84.68000030517578,85.69999694824219,83.83000183105469
"Jul 16, 2020",86.02999877929688,83.98999786376953,88.79000091552734,83.30000305175781
"Jul 17, 2020",89.02999877929688,86.98999786376953,89.02999877929688,86.05999755859375
"Jul 20, 2020",92.5,91.79000091552734,93.1500015258789,88.77999877929688
"Jul 21, 2020",89.30000305175781,93.47000122070312,93.9000015258789,88.5
"Jul 22, 2020",89.19999694824219,89.98999786376953,90.19999694824219,87.26000213623047
"Jul 23, 2020",87.4000015258789,89.0,93.1500015258789,87.0
"Jul 24, 2020",86.4000015258789,87.97000122070312,87.97000122070312,83.2300033569336
"Jul 27, 2020",87.70999908447266,87.9800033569336,89.80999755859375,86.25
"Jul 28, 2020",84.75,87.30000305175781,88.38999938964844,84.54000091552734
"Jul 29, 2020",87.83000183105469,85.0,88.06999969482422,81.72000122070312
"Jul 30, 2020",86.86000061035156,86.18000030517578,87.87999725341797,84.81999969482422
"Jul 31, 2020",86.41999816894531,87.9800033569336,88.5,84.5999984741211
"Aug 03, 2020",89.75,88.0,90.9000015258789,86.5
"Aug 04, 2020",87.19999694824219,88.98999786376953,90.22000122070312,85.91999816894531
"Aug 05, 2020",88.19999694824219,87.98999786376953,89.30000305175781,86.86000061035156
"Aug 06, 2020",89.63999938964844,88.62999725341797,89.63999938964844,87.33999633789062
"Aug 07, 2020",88.13999938964844,89.01000213623047,89.5199966430664,86.01000213623047
"Aug 10, 2020",88.45999908447266,88.20999908447266,90.73999786376953,86.63999938964844
"Aug 11, 2020",87.30999755859375,90.75,91.86000061035156,86.9000015258789
"Aug 12, 2020",85.68000030517578,88.0,88.91000366210938,84.8499984741211
"Aug 13, 2020",85.45999908447266,87.3499984741211,87.68000030517578,84.55999755859375
"Aug 14, 2020",82.5999984741211,86.0,86.26000213623047,81.86000061035156
"Aug 17, 2020",79.0,82.61000061035156,82.61000061035156,77.5199966430664
"Aug 18, 2020",85.41999816894531,80.80999755859375,85.54000091552734,80.1500015258789
"Aug 19, 2020",83.87999725341797,85.13999938964844,85.5999984741211,83.5199966430664
"Aug 20, 2020",83.13999938964844,81.4000015258789,83.52999877929688,81.3499984741211
"Aug 21, 2020",82.62999725341797,82.80000305175781,83.0,81.0999984741211
"Aug 24, 2020",83.55999755859375,83.6500015258789,84.0999984741211,82.41999816894531
"Aug 25, 2020",81.02999877929688,83.0,84.30000305175781,80.68000030517578
"Aug 26, 2020",80.6500015258789,81.1500015258789,82.95999908447266,78.12999725341797
"Aug 27, 2020",82.77999877929688,81.0,82.80000305175781,79.80999755859375
"Aug 28, 2020",82.80000305175781,82.80000305175781,83.45999908447266,81.91999816894531
"Aug 31, 2020",80.33000183105469,82.0999984741211,82.5,80.33000183105469
