result,data,num_ativos,lista_ativos,oper_ativos,volatilidade
0.9350430842534624,"Jan 04, 2010","9","['MMXM3', 'LAME4', 'VALE3', 'JBSS3', 'MRVE3', 'ITSA4', 'LREN3', 'GOLL4', 'DTEX3']","[2.0, 2.0, 1.75, 1.75, 1.75, 1.25, 1.25, 1.0, 0.5]","nan"
0.9918858027164658,"Feb 01, 2010","9","['USIM3', 'ELET3', 'EMBR3', 'CSAN3', 'DTEX3', 'LREN3', 'BRKM5', 'KLBN4', 'VALE3']","[1.0, 0.25, 0.25, 0.0, 0.0, -0.125, -0.125, -0.125, -1.0]","nan"
1.0213164587374686,"Mar 01, 2010","9","['BBAS3', 'CSAN3', 'RDCD3', 'MMXM3', 'EMBR3', 'CPFE3', 'LIGT3', 'PETR4', 'GGBR4']","[2.0, 2.0, 1.5, 0.25, 0.25, 0.25, 0.25, 0.0, 0.0]","0.0004194722862215669"
0.9437159321278195,"Apr 01, 2010","9","['ITSA4', 'GGBR4', 'VALE3', 'USIM5', 'CSNA3', 'BRAP4', 'ELET3', 'EMBR3', 'CCRO3']","[2.0, 1.75, 0.25, 0.25, 0.25, 0.25, 0.25, 0.25, 0.25]","0.00044914879355275114"
0.9484158049386965,"May 03, 2010","9","['GGBR4', 'RDCD3', 'GOAU4', 'ABEV3', 'KLBN4', 'ITSA4', 'BBDC4', 'BRAP4', 'SBSP3']","[0.0, 0.0, 0.0, 0.0, 0.0, -0.25, -0.5, -0.5, -1.75]","nan"
1.0643042021798483,"Jun 01, 2010","9","['RSID3', 'CSAN3', 'PDGR3', 'TRPL4', 'TIMP3', 'DTEX3', 'LREN3', 'CPFE3', 'BRFS3']","[1.75, 1.75, 1.75, 1.75, 1.75, 1.0, 0.25, 0.25, 0.0]","0.0034696011048296195"
1.11548329565875,"Jul 01, 2010","9","['KLBN4', 'TRPL4', 'CPFE3', 'TIMP3', 'LAME4', 'CYRE3', 'JBSS3', 'PDGR3', 'GFSA3']","[2.0, 0.25, 0.25, 0.25, 0.25, 0.25, 0.25, 0.25, 0.25]","0.0038512041848360818"
0.9873424224085473,"Aug 02, 2010","9","['ELET3', 'CMIG4', 'DTEX3', 'GFSA3', 'ABEV3', 'CPFE3', 'BRKM5', 'RSID3', 'ITSA4']","[1.75, 1.25, 0.5, 0.375, 0.25, 0.25, 0.25, 0.25, 0.25]","0.0002788305565052034"
1.090230897751384,"Sep 01, 2010","9","['BBDC4', 'PDGR3', 'BRAP4', 'GOLL4', 'VALE3', 'EMBR3', 'GGBR4', 'BBAS3', 'CSNA3']","[1.5, 0.25, 0.0, 0.0, 0.0, 0.0, 0.0, -0.125, -0.125]","0.0009658282747735829"
1.0279277232176882,"Oct 01, 2010","9","['USIM3', 'BBAS3', 'CSNA3', 'PETR4', 'BRAP4', 'BBDC4', 'ITSA4', 'LREN3', 'CSAN3']","[2.0, 2.0, 2.0, 1.75, 1.25, 1.25, 1.25, 0.5, 0.25]","0.00018660176285611448"
0.9963898617860077,"Nov 01, 2010","9","['CCRO3', 'CPFE3', 'MRVE3', 'ABEV3', 'BRAP4', 'ELET6', 'DTEX3', 'GOLL4', 'BRKM5']","[2.0, 1.25, 1.0, 0.25, 0.25, 0.25, 0.25, 0.25, 0.25]","nan"
1.0095460996023284,"Dec 01, 2010","9","['ABEV3', 'BTOW3', 'TIMP3', 'BRKM5', 'TRPL4', 'PETR3', 'LAME4', 'MMXM3', 'USIM3']","[0.25, 0.25, 0.25, 0.25, 0.0, 0.0, 0.0, -0.125, -0.5]","0.0031019598416394396"
0.9276801291281429,"Jan 03, 2011","9","['TRPL4', 'CCRO3', 'PETR3', 'ELET6', 'GOAU4', 'GFSA3', 'ITUB4', 'PDGR3', 'GGBR4']","[2.0, 2.0, 2.0, 1.75, 1.75, 1.75, 1.5, 1.5, 1.25]","0.0033737966677383144"
1.044271978343252,"Feb 01, 2011","9","['MMXM3', 'SBSP3', 'GOAU4', 'CMIG4', 'TIMP3', 'CESP6', 'EMBR3', 'ELET6', 'RDCD3']","[2.5, 1.0, 1.0, 0.5, 0.25, 0.25, 0.25, 0.0, 0.0]","7.266897913609655e-05"
1.0169416995763236,"Mar 01, 2011","9","['JBSS3', 'PETR3', 'CCRO3', 'CPLE6', 'LIGT3', 'DTEX3', 'EMBR3', 'TRPL4', 'SBSP3']","[1.75, 1.375, 1.25, 1.0, 0.5, 0.5, 0.25, 0.0, 0.0]","0.0030337181930847903"
0.9766736133283692,"Apr 04, 2011","9","['TRPL4', 'BRAP4', 'CSNA3', 'MMXM3', 'DTEX3', 'LREN3', 'TIMP3', 'CCRO3', 'USIM3']","[2.0, 1.125, 1.0, 1.0, 0.375, 0.25, 0.25, 0.25, 0.25]","0.0036550107093663454"
0.9892114352056279,"May 02, 2011","9","['BBAS3', 'GOLL4', 'TIMP3', 'CCRO3', 'BRKM5', 'MRFG3', 'RSID3', 'PDGR3', 'BRAP4']","[2.25, 0.5, 0.25, 0.25, 0.25, 0.25, 0.25, 0.25, 0.0]","0.0002240003637009127"
0.9872267527619384,"Jun 01, 2011","9","['LREN3', 'GOAU4', 'BBDC4', 'JBSS3', 'RDCD3', 'KLBN4', 'BRAP4', 'TRPL4', 'CPFE3']","[1.75, 1.75, 1.75, 1.75, 1.5, 1.5, 1.125, 1.0, 1.0]","0.003261359035022265"
1.2749110878487644,"Jul 01, 2011","9","['ITUB4', 'ITSA4', 'LREN3', 'TRPL4', 'SBSP3', 'RDCD3', 'BBDC4', 'LIGT3', 'CIEL3']","[3.5, 3.25, 2.0, 1.75, 1.5, 1.5, 1.25, 0.75, 0.75]","0.0034591720686340008"
0.8890978924654134,"Aug 01, 2011","7","['CPFE3', 'PETR3', 'JBSS3', 'BRFS3', 'MMXM3', 'SBSP3', 'MRFG3']","[1.0, 1.0, 1.0, 0.25, -0.5, -1.5, -1.5]","0.0002157347389449759"
0.9084502102408067,"Sep 01, 2011","9","['CESP6', 'BRAP4', 'VALE3', 'BBDC4', 'ITUB4', 'ITSA4', 'PDGR3', 'PCAR4', 'LIGT3']","[1.75, 1.75, 1.75, 1.75, 1.75, 1.75, 1.75, 1.5, 1.5]","0.00017762298979227034"
1.0827766090021316,"Oct 03, 2011","9","['ITUB4', 'EMBR3', 'TRPL4', 'SBSP3', 'PCAR4', 'CESP6', 'LIGT3', 'LREN3', 'BRAP4']","[2.0, 0.25, 0.0, 0.0, 0.0, 0.0, 0.0, 0.0, 0.0]","0.003712972885154622"
0.9719397235592617,"Nov 01, 2011","9","['BBDC4', 'SBSP3', 'CPLE6', 'CCRO3', 'BRAP4', 'BTOW3', 'CSNA3', 'MMXM3', 'GGBR4']","[2.5, 2.0, 1.75, 1.75, 1.75, 1.5, 1.5, 1.5, 1.5]","0.0002701966357160135"
0.944966782499785,"Dec 01, 2011","7","['TRPL4', 'USIM5', 'DTEX3', 'RSID3', 'LAME4', 'MRVE3', 'BRAP4']","[1.0, 1.0, 0.0, 0.0, 0.0, 0.0, -0.5]","0.006326958726186277"
1.0767202479413822,"Jan 02, 2012","9","['DTEX3', 'MMXM3', 'BBDC4', 'BBAS3', 'USIM5', 'CESP6', 'ELET6', 'SBSP3', 'CPFE3']","[2.0, 1.75, 1.25, 1.0, 1.0, 0.75, 0.75, 0.25, 0.25]","0.00018149517301033191"
1.0950739045230289,"Feb 01, 2012","9","['CCRO3', 'BRKM5', 'BTOW3', 'HGTX3', 'BRML3', 'JBSS3', 'PCAR4', 'LREN3', 'CIEL3']","[2.0, 1.875, 1.75, 0.5, 0.5, 0.5, 0.25, 0.25, 0.25]","0.00012064998313740124"
1.0207918749179088,"Mar 01, 2012","9","['BBAS3', 'ITUB4', 'PCAR4', 'CPFE3', 'HGTX3', 'ABEV3', 'TRPL4', 'UGPA3', 'CPLE6']","[2.0, 0.75, 0.5, 0.5, 0.375, 0.375, 0.25, 0.25, 0.25]","0.003997613301609461"
1.019235607649793,"Apr 02, 2012","9","['LAME4', 'SANB11', 'CCRO3', 'SBSP3', 'UGPA3', 'VIVT4', 'ABEV3', 'EMBR3', 'MRFG3']","[1.5, 1.0, 0.5, 0.25, 0.25, 0.25, 0.25, 0.25, 0.25]","0.0002819899828326782"
0.9024275728537773,"May 02, 2012","9","['ELET6', 'BRML3', 'LAME4', 'GGBR4', 'SBSP3', 'UGPA3', 'EMBR3', 'PCAR4', 'KLBN4']","[1.75, 1.75, 1.75, 1.75, 0.5, 0.25, 0.25, 0.0, 0.0]","0.0004141182117336119"
1.0266885019264826,"Jun 01, 2012","5","['SANB11', 'SBSP3', 'LREN3', 'CCRO3', 'TESA3']","[0.25, 0.0, 0.0, 0.0, 0.0]","0.00018794595842655792"
0.9345946385597104,"Jan 02, 2015","9","['CPFE3', 'ECOR3', 'BBSE3', 'BRML3', 'UGPA3', 'HYPE3', 'GOLL4', 'VALE3', 'BRAP4']","[2.0, 2.0, 1.75, 1.75, 1.5, 1.5, 1.25, 1.0, 1.0]","0.0001776554484939349"
1.1209874005358924,"Feb 02, 2015","9","['EMBR3', 'UGPA3', 'ITSA4', 'VALE3', 'JBSS3', 'BRAP4', 'CYRE3', 'RSID3', 'BBDC4']","[1.5, 0.75, 0.0, 0.0, 0.0, 0.0, 0.0, 0.0, -0.25]","8.874525922529262e-05"
0.9887806236834353,"Mar 02, 2015","9","['CMIG4', 'QUAL3', 'EVEN3', 'OIBR4', 'DTEX3', 'LREN3', 'PETR4', 'CIEL3', 'VIVT4']","[1.75, 1.75, 1.5, 1.25, 1.25, 0.375, 0.25, 0.25, 0.25]","0.00014219425355985402"
1.1026131307493334,"Apr 01, 2015","9","['BRFS3', 'ELET3', 'BRPR3', 'GFSA3', 'ABEV3', 'PETR4', 'CIEL3', 'UGPA3', 'BBSE3']","[1.75, 0.75, 0.5, 0.5, 0.25, 0.25, 0.25, 0.25, 0.25]","0.0001667056392715735"
0.912374982472297,"May 04, 2015","9","['BRKM5', 'PCAR4', 'BRFS3', 'BBAS3', 'ENBR3', 'ITUB4', 'BBDC4', 'PETR4', 'ITSA4']","[1.75, 1.25, 0.75, 0.5, 0.375, 0.25, 0.25, 0.25, 0.25]","0.0002574101950840731"
1.0296110356413761,"Jun 01, 2015","9","['EMBR3', 'TIMP3', 'MRFG3', 'HYPE3', 'ABEV3', 'VALE3', 'BBAS3', 'CMIG4', 'SBSP3']","[1.75, 1.5, 1.5, 0.25, 0.0, 0.0, 0.0, 0.0, 0.0]","0.00016561731145524707"
0.9526041965893388,"Jul 01, 2015","9","['VIVT4', 'MRVE3', 'TIMP3', 'ITUB4', 'BBDC4', 'ABEV3', 'PETR3', 'ITSA4', 'BBSE3']","[1.75, 1.75, 0.25, 0.0, 0.0, 0.0, 0.0, 0.0, 0.0]","0.00018663960780467419"
0.917253669426908,"Aug 03, 2015","9","['VALE3', 'PCAR4', 'KLBN11', 'ENBR3', 'CIEL3', 'VIVT4', 'BBDC3', 'LAME4', 'SANB11']","[1.75, 1.5, 0.25, 0.25, 0.0, 0.0, 0.0, 0.0, 0.0]","6.959124777702881e-05"
1,"0","0","0","0","0"
1.0212565560788183,"Oct 01, 2015","9","['BRFS3', 'ABEV3', 'JBSS3', 'EMBR3', 'KLBN11', 'BRKM5', 'ELET6', 'ITUB4', 'LAME4']","[1.0, 0.5, 0.25, 0.25, 0.25, 0.25, 0.25, 0.0, 0.0]","8.516010122633887e-05"
1.024780740375573,"Nov 03, 2015","9","['CESP6', 'ENBR3', 'POMO4', 'ITSA4', 'BBAS3', 'HYPE3', 'BRKM5', 'BRPR3', 'ITUB4']","[1.75, 1.5, 1.25, 1.0, 0.25, 0.25, 0.25, 0.25, 0.0]","0.00021778785880524076"
0.9537884332335139,"Dec 01, 2015","9","['ITUB4', 'SBSP3', 'PCAR4', 'HYPE3', 'KLBN11', 'SANB11', 'BRML3', 'CPFE3', 'RENT3']","[1.75, 0.5, 0.25, 0.25, 0.25, 0.25, 0.25, 0.25, 0.25]","0.00021805673858341725"
0.9712872275890383,"Jan 04, 2016","8","['JBSS3', 'VALE3', 'CSAN3', 'MRFG3', 'SBSP3', 'MRVE3', 'SANB11', 'HYPE3']","[1.75, 1.75, 1.75, 1.0, 0.5, 0.5, 0.25, -0.5]","0.0001327403777920425"
1.070929762084974,"Feb 01, 2016","5","['VIVT4', 'CESP6', 'CSAN3', 'HYPE3', 'SBSP3']","[1.75, 1.75, 1.5, 1.0, 0.75]","0.00024134317170763984"
1.2085862827430722,"Mar 01, 2016","9","['LAME4', 'TIMP3', 'ECOR3', 'BRAP4', 'BBAS3', 'ITUB4', 'BBSE3', 'KLBN11', 'ITSA4']","[2.25, 2.0, 2.0, 1.75, 1.5, 1.25, 1.25, 1.25, 0.75]","0.00031887533867741677"
1.0655293251033808,"Apr 01, 2016","9","['WEGE3', 'ABEV3', 'UGPA3', 'RADL3', 'CSAN3', 'ITUB4', 'BBDC4', 'PETR4', 'CIEL3']","[2.0, 0.375, 0.375, 0.375, 0.375, 0.25, 0.25, 0.25, 0.25]","0.00025141810626061754"
0.8590613280938351,"May 02, 2016","9","['ENBR3', 'CPFE3', 'PCAR4', 'BBDC4', 'PETR4', 'CIEL3', 'VALE3', 'BBAS3', 'CCRO3']","[1.5, 1.25, 0.5, 0.25, 0.25, 0.25, 0.25, 0.25, 0.25]","0.0006008622269619844"
1.2192896085155775,"Jun 01, 2016","9","['ABEV3', 'ELET3', 'OIBR3', 'JBSS3', 'KLBN11', 'EQTL3', 'CSAN3', 'CIEL3', 'LREN3']","[2.0, 1.25, 1.0, 0.25, 0.25, 0.25, 0.25, 0.0, 0.0]","0.00017899224437990528"
1.203481537142556,"Jul 01, 2016","9","['CIEL3', 'CCRO3', 'USIM5', 'CMIG4', 'MULT3', 'LREN3', 'SBSP3', 'CPFE3', 'QUAL3']","[2.0, 2.0, 2.0, 1.875, 1.75, 0.25, 0.25, 0.25, 0.25]","0.00043417165789035153"
0.9740834621836644,"Aug 01, 2016","9","['WEGE3', 'EQTL3', 'VALE3', 'VIVT4', 'BBAS3', 'LREN3', 'BRML3', 'CPFE3', 'CMIG4']","[0.5, 0.375, 0.25, 0.25, 0.25, 0.25, 0.25, 0.25, 0.25]","0.00042383088523947367"
0.9922873094659873,"Sep 01, 2016","9","['CESP6', 'BRFS3', 'VIVT4', 'KLBN11', 'BRKM5', 'GGBR4', 'QUAL3', 'GOAU4', 'VALE3']","[1.0, 0.25, 0.25, 0.25, 0.25, 0.25, 0.25, 0.25, 0.0]","0.0003449821037334711"
1.0536635156429859,"Oct 03, 2016","9","['ABEV3', 'MULT3', 'CSNA3', 'BBDC4', 'BBSE3', 'SBSP3', 'LAME4', 'WEGE3', 'KLBN11']","[1.25, 1.25, 1.0, 0.25, 0.25, 0.25, 0.25, 0.25, 0.25]","0.0003150900923689336"
0.9876142998586256,"Nov 01, 2016","9","['QUAL3', 'RENT3', 'CCRO3', 'CESP6', 'VALE3', 'GGBR4', 'BRAP4', 'ECOR3', 'UGPA3']","[2.0, 1.5, 1.25, 1.25, 0.375, 0.375, 0.375, 0.375, 0.25]","0.0006670939734095437"
1.0039777479560037,"Dec 01, 2016","9","['VIVT4', 'HYPE3', 'UGPA3', 'BBAS3', 'SANB11', 'BRAP4', 'GOAU4', 'USIM5', 'CPFE3']","[1.5, 1.0, 0.25, 0.25, 0.25, 0.25, 0.25, 0.25, 0.125]","0.0007967803843525423"
1.1412528232918389,"Jan 02, 2017","9","['QUAL3', 'ITUB4', 'BBDC4', 'LREN3', 'BRML3', 'CYRE3', 'MRFG3', 'USIM5', 'BBAS3']","[2.0, 1.75, 1.75, 1.75, 1.75, 1.75, 1.75, 1.75, 1.5]","0.0005306516823028689"
1.016430253765382,"Feb 01, 2017","9","['MRFG3', 'ITUB4', 'BBDC4', 'ABEV3', 'VALE3', 'BBAS3', 'VIVT4', 'JBSS3', 'LREN3']","[1.0, 0.25, 0.25, 0.25, 0.25, 0.25, 0.25, 0.25, 0.25]","0.00031217113266847774"
0.9787277602175188,"Mar 01, 2017","9","['BBSE3', 'ABEV3', 'BBAS3', 'CMIG4', 'ITSA4', 'ITUB4', 'BBDC4', 'CIEL3', 'CCRO3']","[1.75, 0.5, 0.5, 0.5, 0.375, 0.25, 0.25, 0.25, 0.25]","0.00031922085664659366"
1.0108753869633091,"Apr 03, 2017","9","['BBAS3', 'BBDC4', 'PETR4', 'SBSP3', 'PCAR4', 'EQTL3', 'CSAN3', 'ENBR3', 'RADL3']","[2.0, 1.75, 1.75, 1.75, 1.75, 1.5, 1.5, 1.5, 1.0]","0.0003812942604717671"
0.9568495659001248,"May 02, 2017","9","['BBDC4', 'SANB11', 'KLBN11', 'USIM5', 'ITSA4', 'BRFS3', 'BRKM5', 'WEGE3', 'JBSS3']","[3.25, 1.75, 1.75, 1.75, 1.5, 1.25, 1.25, 1.25, 1.0]","0.0002479026389010101"
1.0171547983039821,"Jun 01, 2017","9","['BRKM5', 'ENBR3', 'CPLE6', 'GOAU4', 'PETR3', 'KLBN11', 'UGPA3', 'CPFE3', 'BBDC4']","[1.75, 1.5, 1.5, 1.25, 1.0, 0.75, 0.25, 0.25, 0.0]","0.00018124943979231216"
1.007344900815314,"Jul 02, 2012","9","['HYPE3', 'CESP6', 'BRAP4', 'UGPA3', 'RDCD3', 'KLBN4', 'CCRO3', 'VALE3', 'VIVT4']","[1.75, 1.25, 1.25, 0.25, 0.25, 0.25, 0.25, 0.25, 0.0]","0.00021523272683495874"
1.105918569198464,"Aug 01, 2012","8","['GOAU4', 'KLBN4', 'USIM3', 'ABEV3', 'BTOW3', 'MRFG3', 'BBAS3', 'RSID3']","[2.0, 2.0, 1.75, 1.75, 1.75, 1.75, 1.75, 1.75]","0.00020507401640979623"
1.0957571055587367,"Sep 03, 2012","9","['PCAR4', 'USIM3', 'LREN3', 'RENT3', 'BRML3', 'BRFS3', 'BTOW3', 'RDCD3', 'MRFG3']","[0.75, 0.25, 0.25, 0.25, 0.25, 0.25, 0.25, 0.25, 0.25]","0.00015050914837365495"
1.0288908545779278,"Oct 01, 2012","8","['VALE3', 'UGPA3', 'HYPE3', 'PCAR4', 'CSAN3', 'DTEX3', 'BRKM5', 'LAME4']","[2.0, 1.25, 1.25, 0.25, 0.25, 0.25, 0.25, 0.25]","0.00021592492025569368"
1.0272801417125024,"Nov 01, 2012","9","['CPFE3', 'BBDC4', 'ITSA4', 'VALE3', 'CYRE3', 'BRFS3', 'DTEX3', 'KLBN4', 'BRAP4']","[2.0, 1.75, 1.75, 1.5, 1.0, 0.25, 0.25, 0.25, 0.0]","0.0001235100753245641"
1.0039537394263307,"Dec 03, 2012","9","['RENT3', 'CSAN3', 'DTEX3', 'BRML3', 'KLBN4', 'SANB11', 'VALE3', 'MRFG3', 'CYRE3']","[0.25, 0.25, 0.25, 0.0, 0.0, 0.0, 0.0, 0.0, 0.0]","0.0002315148693968369"
1.009744951364653,"Dec 28, 2012","9","['SBSP3', 'KLBN4', 'CYRE3', 'TRPL4', 'MMXM3', 'OIBR3', 'UGPA3', 'CSNA3', 'CPLE6']","[2.0, 2.0, 2.0, 1.75, 1.75, 1.5, 1.25, 1.25, 0.75]","0.0025145219109528574"
0.9798886185046023,"Feb 01, 2013","9","['LREN3', 'GOAU4', 'TRPL4', 'SBSP3', 'ABEV3', 'ELET3', 'BRFS3', 'BRKM5', 'MRFG3']","[1.75, 1.25, 0.25, 0.25, 0.25, 0.25, 0.25, 0.25, 0.25]","0.0018184865331313661"
0.9541081038799312,"Mar 01, 2013","9","['RENT3', 'ELET6', 'BRKM5', 'TIMP3', 'BRFS3', 'PDGR3', 'VIVT4', 'CIEL3', 'MRVE3']","[2.0, 2.0, 2.0, 2.0, 1.75, 1.75, 1.5, 1.375, 0.5]","0.00015064141823698522"
0.9788368554218508,"Mar 28, 2013","9","['USIM3', 'TIMP3', 'CESP6', 'BRFS3', 'PETR3', 'ELET3', 'PCAR4', 'VIVT4', 'BTOW3']","[2.25, 2.0, 1.75, 1.75, 1.75, 1.25, 0.25, 0.25, 0.25]","0.00011461226105008199"
0.9397110791200672,"May 02, 2013","9","['VALE3', 'BRAP4', 'UGPA3', 'RENT3', 'BRML3', 'KLBN4', 'GOLL4', 'RSID3', 'PETR3']","[1.75, 1.0, 0.5, 0.0, 0.0, 0.0, 0.0, 0.0, 0.0]","9.676396040450352e-05"
0.9014624658816889,"Jun 03, 2013","8","['CIEL3', 'BBDC4', 'ITUB4', 'ELET6', 'TIMP3', 'USIM5', 'PETR4', 'UGPA3']","[1.25, 0.25, 0.25, 0.0, 0.0, 0.0, -1.0, -1.75]","4.386361819064081e-05"
1,"0","0","0","0","0"
1.0655867097306442,"Aug 01, 2013","9","['KLBN4', 'MMXM3', 'BBDC3', 'CESP6', 'LIGT3', 'CPFE3', 'BRAP4', 'VALE3', 'HYPE3']","[3.5, 2.125, 2.0, 1.75, 1.25, 1.25, 1.25, 1.25, 1.25]","0.00014657649292341732"
1.0584105881100625,"Sep 02, 2013","9","['BTOW3', 'USIM3', 'BRAP4', 'CIEL3', 'ELET3', 'MRVE3', 'ITUB4', 'ITSA4', 'JBSS3']","[1.25, 0.25, 0.25, 0.25, 0.25, 0.25, 0.0, 0.0, -1.5]","0.0002045394945220184"
1.0448887790014671,"Oct 01, 2013","9","['TRPL4', 'LIGT3', 'CPLE6', 'CSAN3', 'USIM3', 'DTEX3', 'ENBR3', 'GOLL4', 'ELET3']","[1.75, 1.75, 0.25, 0.25, 0.25, 0.25, 0.25, 0.25, 0.25]","0.00021674755786201002"
0.9580778192963426,"Nov 01, 2013","9","['LREN3', 'CSAN3', 'UGPA3', 'RENT3', 'LIGT3', 'BTOW3', 'DTEX3', 'BRKM5', 'GOLL4']","[1.75, 0.25, 0.25, 0.25, 0.25, 0.25, 0.25, 0.25, 0.25]","0.0001609749137545835"
1.0025764562625035,"Dec 02, 2013","9","['CMIG4', 'CPFE3', 'CCRO3', 'ABEV3', 'LIGT3', 'CIEL3', 'BRKM5', 'JBSS3', 'GFSA3']","[1.75, 1.0, 0.75, 0.25, 0.25, 0.25, 0.25, 0.25, 0.25]","6.555293448334879e-05"
0.9410097876685899,"Jan 02, 2014","9","['BRPR3', 'GOAU4', 'GGBR4', 'BRKM5', 'PCAR4', 'RENT3', 'ABEV3', 'ELET6', 'OIBR4']","[2.0, 2.0, 1.75, 1.75, 1.75, 1.75, 1.5, 1.5, 1.25]","0.00014654982581532302"
0.9931728039086081,"Feb 03, 2014","9","['KLBN4', 'DASA3', 'BTOW3', 'PDGR3', 'MRVE3', 'MMXM3', 'CYRE3', 'GOLL4', 'EMBR3']","[0.25, 0.25, 0.25, 0.0, 0.0, 0.0, -0.25, -1.0, -1.125]","0.00038969142827056767"
1.0782183523343645,"Mar 05, 2014","9","['GFSA3', 'MRFG3', 'ITSA4', 'BRAP4', 'DASA3', 'CESP6', 'BTOW3', 'BBDC4', 'ABEV3']","[1.75, 1.75, 1.0, 1.0, 0.25, 0.25, 0.25, 0.0, 0.0]","0.00016252745880415036"
0.9767412888290825,"Apr 01, 2014","9","['VIVT4', 'MRVE3', 'LIGT3', 'CPFE3', 'CYRE3', 'CSAN3', 'CPLE6', 'CSNA3', 'CCRO3']","[1.875, 1.75, 1.75, 1.75, 1.5, 1.5, 1.375, 1.0, 0.75]","0.00016457888357048923"
0.9867614457539381,"May 02, 2014","9","['TIMP3', 'PETR4', 'BBDC4', 'BBAS3', 'ITSA4', 'CCRO3', 'BRFS3', 'SANB11', 'SBSP3']","[3.0, 0.25, 0.25, 0.25, 0.25, 0.25, 0.25, 0.25, 0.25]","0.00018209288273675648"
1.051996183982828,"Jun 02, 2014","9","['BBDC3', 'LREN3', 'CIEL3', 'HYPE3', 'SANB11', 'SBSP3', 'LIGT3', 'TRPL4', 'ITSA4']","[1.0, 0.75, 0.25, 0.25, 0.25, 0.25, 0.25, 0.25, 0.0]","0.00014508124241799838"
1.01161685422051,"Jul 01, 2014","9","['VALE3', 'GFSA3', 'RSID3', 'ELET6', 'CIEL3', 'BBSE3', 'BBAS3', 'CCRO3', 'CMIG4']","[1.75, 1.75, 1.5, 1.25, 0.375, 0.25, 0.25, 0.25, 0.25]","0.00014193445689255856"
1.0908910121631807,"Aug 01, 2014","9","['EGIE3', 'VIVT4', 'BBDC4', 'ELET6', 'MRFG3', 'GOLL4', 'UGPA3', 'BRPR3', 'GOAU4']","[1.75, 0.5, 0.25, 0.25, 0.25, 0.25, 0.0, 0.0, 0.0]","9.91033064349368e-05"
0.9187377160123023,"Sep 01, 2014","9","['TIMP3', 'RSID3', 'CPFE3', 'BRPR3', 'MRVE3', 'BRML3', 'PCAR4', 'EMBR3', 'SANB11']","[1.0, 1.0, 0.5, 0.5, 0.5, 0.375, 0.25, 0.25, 0.25]","9.489972631966634e-05"
0.9849593854650851,"Oct 01, 2014","9","['EMBR3', 'SANB11', 'TIMP3', 'OIBR4', 'BRKM5', 'PETR4', 'JBSS3', 'SBSP3', 'CSAN3']","[0.25, 0.25, 0.25, 0.25, 0.25, 0.0, 0.0, 0.0, 0.0]","8.795307885840362e-05"
1,"0","0","0","0","0"
0.922867273180295,"Dec 01, 2014","9","['EVEN3', 'EGIE3', 'LIGT3', 'PCAR4', 'SBSP3', 'MRVE3', 'CMIG4', 'BRAP4', 'BBDC4']","[2.5, 2.0, 2.0, 1.75, 1.75, 1.75, 1.5, 1.5, 1.25]","0.00014203053416834483"
1.051848800118422,"Jul 03, 2017","9","['ECOR3', 'BBDC4', 'BRKM5', 'ITSA4', 'CCRO3', 'GOAU4', 'CSAN3', 'CYRE3', 'EGIE3']","[2.25, 2.0, 2.0, 1.75, 1.75, 1.75, 1.5, 1.5, 1.25]","0.00024111412740687797"
1.0310127986851734,"Aug 01, 2017","9","['PCAR4', 'ITUB4', 'BBDC4', 'ABEV3', 'PETR4', 'ITSA4', 'BBAS3', 'CIEL3', 'LREN3']","[1.25, 0.25, 0.25, 0.25, 0.25, 0.25, 0.25, 0.25, 0.25]","0.00013818920522116383"
1.009313300139894,"Sep 01, 2017","9","['ECOR3', 'RADL3', 'VALE3', 'RENT3', 'PETR4', 'CCRO3', 'BRAP4', 'BBDC4', 'ABEV3']","[1.75, 1.25, 0.75, 0.75, 0.5, 0.5, 0.375, 0.25, 0.25]","0.00018533074769935394"
0.997124570468844,"Oct 02, 2017","9","['BBAS3', 'JBSS3', 'ITUB4', 'BBDC4', 'PETR4', 'BRFS3', 'UGPA3', 'VIVT4', 'PCAR4']","[0.75, 0.75, 0.25, 0.25, 0.25, 0.25, 0.25, 0.25, 0.25]","0.00010290461237851181"
0.9173918135714642,"Nov 01, 2017","9","['ABEV3', 'PETR4', 'CPFE3', 'UGPA3', 'ELET3', 'ECOR3', 'VALE3', 'CCRO3', 'HYPE3']","[1.0, 0.5, 0.375, 0.25, 0.25, 0.25, 0.0, 0.0, 0.0]","0.0001308292354806522"
1.0863943618507064,"Dec 01, 2017","9","['RADL3', 'ITSA4', 'MRFG3', 'CYRE3', 'GGBR4', 'ITUB4', 'ABEV3', 'WEGE3', 'JBSS3']","[0.375, 0.25, 0.25, 0.25, 0.125, 0.0, 0.0, 0.0, 0.0]","0.00011380397857044216"
1.0706791893830516,"Jan 02, 2018","9","['UGPA3', 'BRML3', 'CSNA3', 'IGTA3', 'CPFE3', 'EQTL3', 'FLRY3', 'QUAL3', 'ENBR3']","[2.0, 2.0, 2.0, 2.0, 2.0, 1.75, 1.75, 1.75, 1.75]","0.00011896786060522276"
0.9906025625336599,"Feb 01, 2018","9","['PCAR4', 'CPLE6', 'PETR4', 'LREN3', 'LAME4', 'BRKM5', 'MULT3', 'MGLU3', 'SMLS3']","[1.25, 1.25, 0.25, 0.25, 0.25, 0.25, 0.25, 0.25, 0.25]","0.0002617480358135719"
1.016819903845384,"Mar 01, 2018","9","['WEGE3', 'EQTL3', 'ABEV3', 'PETR4', 'ITSA4', 'JBSS3', 'RAIL3', 'RENT3', 'MGLU3']","[1.5, 0.75, 0.25, 0.25, 0.25, 0.25, 0.25, 0.25, 0.25]","0.0003164263551331245"
0.9719484336631196,"Apr 02, 2018","9","['EMBR3', 'CPFE3', 'BBSE3', 'EQTL3', 'TAEE11', 'IGTA3', 'ABEV3', 'RENT3', 'CMIG4']","[1.75, 1.75, 1.5, 1.25, 1.25, 1.0, 0.25, 0.25, 0.25]","6.154265083174568e-05"
0.9185497600480009,"May 02, 2018","9","['TAEE11', 'ITSA4', 'CSAN3', 'CPLE6', 'SMLS3', 'VALE3', 'PCAR4', 'GGBR4', 'LAME4']","[2.0, 1.75, 1.75, 1.5, 1.0, 0.375, 0.25, 0.25, 0.25]","0.00013533740287028558"
1.0110107204598349,"Jun 01, 2018","7","['WEGE3', 'SUZB3', 'JBSS3', 'GGBR4', 'BRKM5', 'KLBN11', 'MRFG3']","[0.25, 0.25, 0.0, 0.0, 0.0, -1.0, -1.0]","0.0002981975388188"
1.0475157005294409,"Jul 02, 2018","9","['PETR4', 'BBAS3', 'CIEL3', 'RAIL3', 'BRML3', 'QUAL3', 'IGTA3', 'CMIG4', 'EMBR3']","[1.75, 1.75, 1.75, 1.75, 1.75, 1.75, 1.75, 1.5, 0.25]","0.00011146329466053007"
0.9399562728134472,"Aug 01, 2018","9","['CVCB3', 'MRFG3', 'CPFE3', 'VALE3', 'EQTL3', 'BRAP4', 'CSNA3', 'GGBR4', 'BBDC4']","[2.0, 1.75, 1.75, 1.25, 1.25, 1.25, 1.25, 0.75, 0.25]","0.00015945767620301397"
0.9974609145548732,"Sep 03, 2018","9","['UGPA3', 'ELET3', 'EMBR3', 'KLBN11', 'VALE3', 'BRKM5', 'PCAR4', 'GOAU4', 'ABEV3']","[1.25, 0.75, 0.5, 0.5, 0.25, 0.25, 0.25, 0.25, 0.0]","7.639794310152863e-05"
1.1811638952018453,"Oct 01, 2018","9","['JBSS3', 'RAIL3', 'GGBR4', 'EQTL3', 'BBSE3', 'MGLU3', 'ELET3', 'CYRE3', 'VALE3']","[2.0, 1.875, 1.75, 1.75, 1.5, 1.5, 1.5, 1.5, 0.25]","0.00013269375140930983"
1.0313227729005179,"Nov 01, 2018","9","['BBSE3', 'EQTL3', 'QUAL3', 'CYRE3', 'PETR4', 'B3SA3', 'RAIL3', 'JBSS3', 'LAME4']","[0.5, 0.5, 0.5, 0.375, 0.25, 0.25, 0.25, 0.25, 0.25]","0.00018338036009685045"
0.9439702784411202,"Dec 03, 2018","9","['BRKM5', 'TIMP3', 'SANB11', 'FLRY3', 'PCAR4', 'SBSP3', 'GGBR4', 'GOAU4', 'MGLU3']","[2.0, 2.0, 1.75, 1.75, 1.375, 1.25, 1.0, 1.0, 0.75]","0.00012366669821714134"
1.120426358941143,"Dec 28, 2018","9","['BBAS3', 'LREN3', 'MGLU3', 'SBSP3', 'CVCB3', 'TAEE11', 'CYRE3', 'SMLS3', 'ITUB4']","[2.0, 1.25, 0.375, 0.25, 0.25, 0.25, 0.25, 0.25, 0.0]","0.0002618929397231269"
0.9848567927656962,"Feb 01, 2019","9","['BRKM5', 'MRFG3', 'RADL3', 'VIVT4', 'CPLE6', 'EGIE3', 'UGPA3', 'BRML3', 'PETR4']","[2.0, 2.0, 1.75, 1.25, 1.25, 0.75, 0.375, 0.375, 0.25]","6.754011072417041e-05"
0.959359875841244,"Mar 01, 2019","9","['CIEL3', 'CPLE6', 'BTOW3', 'MGLU3', 'RADL3', 'CVCB3', 'USIM5', 'RENT3', 'CSAN3']","[2.0, 2.0, 1.75, 1.5, 1.5, 1.0, 1.0, 0.25, 0.25]","0.00018902842019426783"
1.035144034986602,"Apr 01, 2019","9","['BBDC4', 'EGIE3', 'QUAL3', 'PETR4', 'BRFS3', 'SUZB3', 'CMIG4', 'BTOW3', 'CYRE3']","[0.75, 0.75, 0.5, 0.25, 0.0, 0.0, 0.0, 0.0, 0.0]","0.00025582804332967686"
1.046593023760001,"May 02, 2019","9","['ITUB4', 'KLBN11', 'IGTA3', 'CPLE6', 'HYPE3', 'TAEE11', 'ITSA4', 'RENT3', 'EGIE3']","[1.75, 1.75, 1.75, 1.75, 1.5, 1.25, 1.0, 0.5, 0.375]","0.00019145570912703695"
1.0684470524186873,"Jun 03, 2019","9","['MGLU3', 'RADL3', 'CSNA3', 'CYRE3', 'VVAR3', 'SANB11', 'EMBR3', 'GOLL4', 'CMIG4']","[1.75, 1.75, 1.75, 1.75, 1.75, 1.5, 1.5, 1.25, 1.0]","0.0001734828531560773"
0.9822998481363147,"Jul 01, 2019","9","['UGPA3', 'PCAR4', 'QUAL3', 'ECOR3', 'ITUB4', 'VALE3', 'BBDC4', 'PETR4', 'B3SA3']","[1.75, 0.75, 0.75, 0.5, 0.25, 0.25, 0.25, 0.25, 0.25]","0.00018407318391440441"
1.0371882512974449,"Aug 01, 2019","9","['MRFG3', 'PCAR4', 'MRVE3', 'UGPA3', 'BBSE3', 'JBSS3', 'RENT3', 'VIVT4', 'RADL3']","[3.5, 2.0, 2.0, 1.0, 1.0, 0.25, 0.25, 0.25, 0.25]","0.00020494408243258114"
1.0433536091863684,"Sep 02, 2019","9","['FLRY3', 'BBSE3', 'HYPE3', 'JBSS3', 'RADL3', 'CCRO3', 'ELET3', 'BTOW3', 'QUAL3']","[2.0, 1.75, 1.0, 0.25, 0.25, 0.25, 0.25, 0.25, 0.25]","0.00034355880003418413"
1.0035480496754343,"Oct 01, 2019","9","['VVAR3', 'MULT3', 'CYRE3', 'IGTA3', 'TIMP3', 'ITUB4', 'ABEV3', 'WEGE3', 'LREN3']","[2.0, 1.75, 1.75, 1.75, 1.5, 1.25, 1.25, 1.25, 1.0]","0.0002711139921763465"
1.0228745717443801,"Nov 01, 2019","9","['PETR3', 'EQTL3', 'CCRO3', 'RADL3', 'B3SA3', 'UGPA3', 'SBSP3', 'AZUL4', 'IRBR3']","[2.0, 1.5, 1.0, 0.75, 0.25, 0.25, 0.25, 0.25, 0.25]","0.0002329684049730247"
1.010853556703027,"Dec 02, 2019","9","['JBSS3', 'BRDT3', 'RAIL3', 'B3SA3', 'BRFS3', 'BRKM5', 'FLRY3', 'VALE3', 'SUZB3']","[1.75, 1.75, 1.25, 1.0, 1.0, 1.0, 0.375, 0.25, 0.25]","7.463781068074738e-05"