Date,Price,Open,High,Low
"Jun 03, 2019",19.899999618530273,19.899999618530273,20.229999542236328,19.739999771118164
"Jun 04, 2019",19.899999618530273,19.989999771118164,20.219999313354492,19.899999618530273
"Jun 05, 2019",19.690000534057617,20.010000228881836,20.149999618530273,19.690000534057617
"Jun 06, 2019",20.280000686645508,19.899999618530273,20.280000686645508,19.81999969482422
"Jun 07, 2019",20.690000534057617,20.389999389648438,20.84000015258789,20.270000457763672
"Jun 10, 2019",21.0,20.600000381469727,21.149999618530273,20.469999313354492
"Jun 11, 2019",21.34000015258789,21.200000762939453,21.3700008392334,20.93000030517578
"Jun 12, 2019",21.15999984741211,21.209999084472656,21.420000076293945,21.010000228881836
"Jun 13, 2019",21.280000686645508,21.270000457763672,21.559999465942383,21.100000381469727
"Jun 14, 2019",20.899999618530273,21.25,21.270000457763672,20.770000457763672
"Jun 17, 2019",20.59000015258789,20.989999771118164,20.989999771118164,20.43000030517578
"Jun 18, 2019",20.690000534057617,20.649999618530273,20.780000686645508,20.25
"Jun 19, 2019",20.799999237060547,20.729999542236328,20.920000076293945,20.530000686645508
"Jun 21, 2019",21.0,20.899999618530273,21.149999618530273,20.829999923706055
"Jun 24, 2019",21.1299991607666,21.0,21.399999618530273,20.940000534057617
"Jun 25, 2019",20.979999542236328,21.1299991607666,21.190000534057617,20.729999542236328
"Jun 26, 2019",21.100000381469727,21.18000030517578,21.18000030517578,20.8700008392334
"Jun 27, 2019",21.399999618530273,21.0,21.510000228881836,20.889999389648438
"Jun 28, 2019",21.350000381469727,21.520000457763672,21.690000534057617,21.350000381469727
"Jul 01, 2019",21.5,21.690000534057617,21.799999237060547,21.280000686645508
"Jul 02, 2019",21.65999984741211,21.600000381469727,21.899999618530273,21.3700008392334
"Jul 03, 2019",21.639999389648438,21.700000762939453,21.850000381469727,21.520000457763672
"Jul 04, 2019",22.0,21.850000381469727,22.299999237060547,21.770000457763672
"Jul 05, 2019",22.719999313354492,21.950000762939453,22.829999923706055,21.719999313354492
"Jul 08, 2019",23.270000457763672,22.770000457763672,23.270000457763672,22.690000534057617
"Jul 10, 2019",23.790000915527344,23.299999237060547,23.899999618530273,23.299999237060547
"Jul 11, 2019",23.670000076293945,23.940000534057617,23.989999771118164,23.350000381469727
"Jul 12, 2019",23.75,23.8700008392334,24.1299991607666,23.600000381469727
"Jul 15, 2019",23.649999618530273,23.75,23.860000610351562,23.3700008392334
"Jul 16, 2019",23.520000457763672,23.850000381469727,23.90999984741211,23.219999313354492
"Jul 17, 2019",23.81999969482422,23.59000015258789,23.969999313354492,23.549999237060547
"Jul 18, 2019",23.670000076293945,23.81999969482422,23.81999969482422,23.479999542236328
"Jul 19, 2019",23.510000228881836,23.670000076293945,23.670000076293945,23.270000457763672
"Jul 22, 2019",23.149999618530273,23.520000457763672,23.579999923706055,23.059999465942383
"Jul 23, 2019",23.209999084472656,23.170000076293945,23.399999618530273,22.90999984741211
"Jul 24, 2019",23.600000381469727,23.06999969482422,23.850000381469727,23.06999969482422
"Jul 25, 2019",23.75,23.75,23.860000610351562,23.309999465942383
"Jul 26, 2019",23.6299991607666,23.450000762939453,24.100000381469727,23.079999923706055
"Jul 29, 2019",23.549999237060547,23.559999465942383,23.700000762939453,23.3799991607666
"Jul 30, 2019",23.6200008392334,23.559999465942383,23.950000762939453,23.309999465942383
"Jul 31, 2019",23.329999923706055,23.549999237060547,23.59000015258789,22.670000076293945
"Aug 01, 2019",23.739999771118164,23.329999923706055,24.110000610351562,23.200000762939453
"Aug 02, 2019",23.469999313354492,23.700000762939453,23.709999084472656,23.110000610351562
"Aug 05, 2019",23.079999923706055,23.200000762939453,23.200000762939453,22.709999084472656
"Aug 06, 2019",23.200000762939453,23.200000762939453,23.399999618530273,22.780000686645508
"Aug 07, 2019",23.040000915527344,23.170000076293945,23.170000076293945,22.5
"Aug 08, 2019",23.399999618530273,23.299999237060547,23.729999542236328,23.270000457763672
"Aug 09, 2019",23.469999313354492,23.5,23.75,23.350000381469727
"Aug 12, 2019",23.5,23.469999313354492,23.559999465942383,23.1200008392334
"Aug 13, 2019",24.0,23.299999237060547,24.200000762939453,23.299999237060547
"Aug 14, 2019",23.510000228881836,24.0,24.0,23.15999984741211
"Aug 15, 2019",22.709999084472656,23.510000228881836,23.75,22.18000030517578
"Aug 16, 2019",23.540000915527344,22.950000762939453,23.610000610351562,22.940000534057617
"Aug 19, 2019",23.200000762939453,23.59000015258789,23.760000228881836,23.100000381469727
"Aug 20, 2019",23.709999084472656,23.309999465942383,23.719999313354492,22.690000534057617
"Aug 21, 2019",24.209999084472656,23.75,24.209999084472656,23.729999542236328
"Aug 22, 2019",24.520000457763672,24.399999618530273,24.59000015258789,24.049999237060547
"Aug 23, 2019",24.030000686645508,24.31999969482422,24.3799991607666,23.520000457763672
"Aug 26, 2019",23.43000030517578,24.09000015258789,24.280000686645508,23.200000762939453
"Aug 27, 2019",23.34000015258789,23.43000030517578,23.68000030517578,23.0
"Aug 28, 2019",23.309999465942383,23.309999465942383,23.649999618530273,23.030000686645508
"Aug 29, 2019",24.079999923706055,23.559999465942383,24.479999542236328,23.459999084472656
"Aug 30, 2019",24.0,24.1200008392334,24.399999618530273,23.75
"Sep 02, 2019",24.0,23.989999771118164,24.25,23.860000610351562
"Sep 03, 2019",24.0,24.0,24.280000686645508,23.700000762939453
"Sep 04, 2019",23.940000534057617,24.280000686645508,24.3700008392334,23.940000534057617
"Sep 05, 2019",23.770000457763672,24.229999542236328,24.489999771118164,23.770000457763672
"Sep 06, 2019",23.799999237060547,23.799999237060547,24.06999969482422,23.760000228881836
"Sep 09, 2019",23.459999084472656,23.889999389648438,23.979999542236328,23.170000076293945
"Sep 10, 2019",23.459999084472656,23.549999237060547,23.729999542236328,23.360000610351562
"Sep 11, 2019",23.809999465942383,23.700000762939453,23.950000762939453,23.479999542236328
"Sep 12, 2019",24.219999313354492,23.889999389648438,24.5,23.829999923706055
"Sep 13, 2019",24.309999465942383,24.399999618530273,24.40999984741211,24.06999969482422
"Sep 16, 2019",24.149999618530273,24.190000534057617,24.299999237060547,23.780000686645508
"Sep 17, 2019",24.610000610351562,24.110000610351562,24.700000762939453,24.0
"Sep 18, 2019",24.719999313354492,24.68000030517578,25.100000381469727,24.329999923706055
"Sep 19, 2019",24.540000915527344,24.799999237060547,25.0,24.43000030517578
"Sep 20, 2019",25.139999389648438,24.729999542236328,25.139999389648438,24.549999237060547
"Sep 23, 2019",25.510000228881836,25.149999618530273,25.739999771118164,24.860000610351562
"Sep 24, 2019",25.530000686645508,25.489999771118164,25.75,25.299999237060547
"Sep 25, 2019",25.299999237060547,25.5,25.600000381469727,24.959999084472656
"Sep 26, 2019",25.5,25.309999465942383,25.6299991607666,25.190000534057617
"Sep 27, 2019",25.700000762939453,25.559999465942383,26.1299991607666,25.520000457763672
"Sep 30, 2019",26.420000076293945,25.770000457763672,26.450000762939453,25.549999237060547
"Oct 01, 2019",26.100000381469727,26.420000076293945,26.420000076293945,26.0
"Oct 02, 2019",24.860000610351562,26.0,26.0,24.860000610351562
"Oct 03, 2019",25.0,25.170000076293945,25.299999237060547,24.770000457763672
"Oct 04, 2019",25.0,25.170000076293945,25.170000076293945,24.600000381469727
"Oct 07, 2019",24.200000762939453,24.8799991607666,24.979999542236328,24.190000534057617
"Oct 08, 2019",24.049999237060547,24.200000762939453,24.34000015258789,23.90999984741211
"Oct 09, 2019",24.209999084472656,24.309999465942383,24.3799991607666,23.950000762939453
"Oct 10, 2019",24.209999084472656,24.360000610351562,24.3700008392334,23.989999771118164
"Oct 11, 2019",24.600000381469727,24.299999237060547,24.799999237060547,24.15999984741211
"Oct 14, 2019",24.760000228881836,24.729999542236328,24.780000686645508,24.5
"Oct 15, 2019",24.600000381469727,24.829999923706055,24.8799991607666,24.420000076293945
"Oct 16, 2019",25.0,24.65999984741211,25.0,24.18000030517578
"Oct 17, 2019",25.0,25.0,25.09000015258789,24.610000610351562
"Oct 18, 2019",24.739999771118164,24.989999771118164,25.0,24.600000381469727
"Oct 21, 2019",24.790000915527344,24.809999465942383,24.950000762939453,24.610000610351562
"Oct 22, 2019",24.600000381469727,24.790000915527344,24.799999237060547,24.389999389648438
"Oct 23, 2019",24.68000030517578,24.600000381469727,25.059999465942383,24.420000076293945
"Oct 24, 2019",24.510000228881836,24.93000030517578,24.93000030517578,24.200000762939453
"Oct 25, 2019",24.90999984741211,24.540000915527344,24.920000076293945,24.540000915527344
"Oct 28, 2019",25.40999984741211,25.0,25.549999237060547,24.950000762939453
"Oct 29, 2019",25.450000762939453,25.420000076293945,25.530000686645508,24.950000762939453
"Oct 30, 2019",25.540000915527344,25.5,25.690000534057617,25.110000610351562
"Oct 31, 2019",25.450000762939453,25.540000915527344,25.540000915527344,25.18000030517578
"Nov 01, 2019",25.530000686645508,25.43000030517578,25.530000686645508,25.190000534057617
"Nov 04, 2019",25.510000228881836,25.639999389648438,25.790000915527344,25.489999771118164
"Nov 05, 2019",25.700000762939453,25.489999771118164,25.709999084472656,25.309999465942383
"Nov 06, 2019",25.850000381469727,25.719999313354492,25.889999389648438,25.34000015258789
"Nov 07, 2019",26.299999237060547,25.979999542236328,26.299999237060547,25.8799991607666
"Nov 08, 2019",25.860000610351562,26.100000381469727,26.149999618530273,25.6200008392334
"Nov 11, 2019",26.079999923706055,25.670000076293945,26.309999465942383,25.5
"Nov 12, 2019",25.739999771118164,26.0,26.0,25.59000015258789
"Nov 13, 2019",26.030000686645508,25.600000381469727,26.030000686645508,25.559999465942383
"Nov 14, 2019",27.0,26.0,27.0,25.969999313354492
"Nov 18, 2019",26.920000076293945,27.0,27.510000228881836,26.770000457763672
"Nov 19, 2019",26.610000610351562,26.899999618530273,27.020000457763672,26.610000610351562
"Nov 21, 2019",27.75,26.649999618530273,28.040000915527344,26.559999465942383
"Nov 22, 2019",27.780000686645508,27.75,28.040000915527344,27.40999984741211
"Nov 25, 2019",28.469999313354492,27.8700008392334,28.469999313354492,27.530000686645508
"Nov 26, 2019",28.549999237060547,28.399999618530273,28.549999237060547,27.860000610351562
"Nov 27, 2019",28.200000762939453,28.389999389648438,28.540000915527344,27.889999389648438
"Nov 28, 2019",27.979999542236328,28.40999984741211,28.5,27.979999542236328
"Nov 29, 2019",28.5,28.299999237060547,28.649999618530273,28.290000915527344
"Dec 02, 2019",28.469999313354492,28.5,28.649999618530273,28.280000686645508
"Dec 03, 2019",28.510000228881836,28.5,28.690000534057617,28.229999542236328
"Dec 04, 2019",28.489999771118164,28.600000381469727,28.68000030517578,28.299999237060547
"Dec 05, 2019",28.309999465942383,28.549999237060547,29.040000915527344,28.309999465942383
"Dec 06, 2019",28.8799991607666,28.43000030517578,29.079999923706055,28.420000076293945
"Dec 09, 2019",29.049999237060547,28.940000534057617,29.25,28.81999969482422
"Dec 10, 2019",28.440000534057617,28.850000381469727,28.850000381469727,28.18000030517578
"Dec 11, 2019",28.5,28.489999771118164,28.700000762939453,28.270000457763672
"Dec 12, 2019",28.440000534057617,28.780000686645508,28.850000381469727,28.34000015258789
"Dec 13, 2019",28.780000686645508,28.5,28.780000686645508,28.350000381469727
"Dec 16, 2019",28.950000762939453,28.739999771118164,28.959999084472656,28.450000762939453
"Dec 17, 2019",28.809999465942383,28.889999389648438,29.049999237060547,28.719999313354492
"Dec 18, 2019",29.850000381469727,28.899999618530273,30.100000381469727,28.709999084472656
"Dec 19, 2019",30.399999618530273,29.959999084472656,30.84000015258789,29.899999618530273
"Dec 20, 2019",29.829999923706055,30.5,30.5,29.59000015258789
"Dec 23, 2019",30.0,29.829999923706055,30.020000457763672,29.6200008392334
"Dec 26, 2019",30.100000381469727,30.0,30.149999618530273,29.899999618530273
"Dec 27, 2019",30.399999618530273,30.170000076293945,30.540000915527344,29.969999313354492
"Dec 30, 2019",30.530000686645508,30.399999618530273,30.889999389648438,30.270000457763672
"Jan 02, 2020",31.020000457763672,31.09000015258789,31.389999389648438,30.860000610351562
"Jan 03, 2020",30.110000610351562,30.920000076293945,31.25,30.110000610351562
"Jan 06, 2020",31.0,30.190000534057617,31.0,30.010000228881836
"Jan 07, 2020",31.31999969482422,31.010000228881836,31.520000457763672,30.6299991607666
"Jan 08, 2020",31.1299991607666,31.299999237060547,31.579999923706055,30.81999969482422
"Jan 09, 2020",31.709999084472656,31.299999237060547,31.969999313354492,31.1299991607666
"Jan 10, 2020",31.149999618530273,32.0,32.0,30.950000762939453
"Jan 13, 2020",31.0,31.40999984741211,31.40999984741211,30.8799991607666
"Jan 14, 2020",31.459999084472656,31.0,31.459999084472656,30.889999389648438
"Jan 15, 2020",31.229999542236328,31.399999618530273,31.709999084472656,31.049999237060547
"Jan 16, 2020",31.239999771118164,31.360000610351562,31.479999542236328,30.670000076293945
"Jan 17, 2020",31.389999389648438,31.239999771118164,31.389999389648438,30.709999084472656
"Jan 20, 2020",32.22999954223633,31.350000381469727,32.22999954223633,30.899999618530273
"Jan 21, 2020",32.150001525878906,32.22999954223633,32.33000183105469,31.780000686645508
"Jan 22, 2020",32.869998931884766,32.29999923706055,32.869998931884766,32.11000061035156
"Jan 23, 2020",32.25,32.5099983215332,32.619998931884766,32.119998931884766
"Jan 24, 2020",32.36000061035156,32.470001220703125,32.5,31.940000534057617
"Jan 27, 2020",32.150001525878906,31.979999542236328,32.38999938964844,30.90999984741211
"Jan 28, 2020",32.5,32.15999984741211,32.599998474121094,32.06999969482422
"Jan 29, 2020",31.15999984741211,32.650001525878906,32.689998626708984,31.15999984741211
"Jan 30, 2020",31.65999984741211,30.799999237060547,31.65999984741211,30.06999969482422
"Jan 31, 2020",31.0,31.649999618530273,31.649999618530273,30.649999618530273
"Feb 03, 2020",31.709999084472656,31.0,32.0,30.780000686645508
"Feb 04, 2020",32.65999984741211,32.0099983215332,32.65999984741211,31.950000762939453
"Feb 05, 2020",33.5,32.77000045776367,34.09000015258789,32.72999954223633
"Feb 06, 2020",32.099998474121094,33.5,33.689998626708984,31.81999969482422
"Feb 07, 2020",31.200000762939453,32.11000061035156,32.130001068115234,31.200000762939453
"Feb 10, 2020",30.93000030517578,31.31999969482422,31.469999313354492,29.889999389648438
"Feb 11, 2020",31.170000076293945,31.049999237060547,31.729999542236328,30.81999969482422
"Feb 12, 2020",31.790000915527344,31.299999237060547,32.22999954223633,31.059999465942383
"Feb 13, 2020",30.68000030517578,31.600000381469727,31.649999618530273,30.68000030517578
"Feb 14, 2020",30.989999771118164,30.75,31.25,30.719999313354492
"Feb 17, 2020",31.079999923706055,31.1200008392334,31.299999237060547,30.899999618530273
"Feb 18, 2020",30.950000762939453,30.899999618530273,31.1299991607666,30.299999237060547
"Feb 19, 2020",31.989999771118164,30.850000381469727,32.08000183105469,30.850000381469727
"Feb 20, 2020",31.450000762939453,32.119998931884766,32.41999816894531,31.030000686645508
"Feb 21, 2020",31.25,31.360000610351562,31.5,30.850000381469727
"Feb 27, 2020",28.56999969482422,29.209999084472656,29.520000457763672,28.520000457763672
"Feb 28, 2020",29.760000228881836,28.889999389648438,29.760000228881836,28.440000534057617
"Mar 02, 2020",30.899999618530273,30.049999237060547,31.18000030517578,29.899999618530273
"Mar 03, 2020",30.6200008392334,30.899999618530273,32.04999923706055,30.6200008392334
"Mar 04, 2020",31.010000228881836,31.3700008392334,32.150001525878906,30.790000915527344
"Mar 05, 2020",29.989999771118164,31.0,31.059999465942383,29.579999923706055
"Mar 06, 2020",29.559999465942383,29.0,30.1200008392334,28.020000457763672
"Mar 09, 2020",27.010000228881836,27.5,27.780000686645508,26.549999237060547
"Mar 10, 2020",27.270000457763672,28.360000610351562,28.780000686645508,26.31999969482422
"Mar 11, 2020",26.200000762939453,26.8700008392334,27.0,24.399999618530273
"Mar 12, 2020",22.799999237060547,23.979999542236328,24.229999542236328,22.56999969482422
"Mar 13, 2020",23.600000381469727,25.510000228881836,25.899999618530273,22.0
"Mar 16, 2020",20.0,22.0,22.059999465942383,19.899999618530273
"Mar 17, 2020",21.110000610351562,20.5,21.389999389648438,20.1299991607666
"Mar 18, 2020",18.139999389648438,19.440000534057617,19.989999771118164,17.5
"Mar 19, 2020",19.5,17.829999923706055,20.09000015258789,17.15999984741211
"Mar 20, 2020",19.239999771118164,20.020000457763672,20.6200008392334,19.059999465942383
"Mar 23, 2020",18.760000228881836,19.5,19.510000228881836,18.049999237060547
"Mar 24, 2020",19.440000534057617,19.799999237060547,20.469999313354492,19.440000534057617
"Mar 25, 2020",20.079999923706055,19.399999618530273,20.350000381469727,18.899999618530273
"Mar 26, 2020",20.899999618530273,20.110000610351562,21.760000228881836,20.110000610351562
"Mar 27, 2020",19.700000762939453,20.399999618530273,20.959999084472656,19.700000762939453
"Mar 30, 2020",20.649999618530273,20.270000457763672,21.209999084472656,20.030000686645508
"Mar 31, 2020",20.239999771118164,20.799999237060547,20.93000030517578,19.670000076293945
"Apr 01, 2020",20.0,19.899999618530273,20.09000015258789,19.09000015258789
"Apr 02, 2020",20.200000762939453,20.100000381469727,20.31999969482422,19.700000762939453
"Apr 03, 2020",19.209999084472656,20.149999618530273,20.200000762939453,18.979999542236328
"Apr 06, 2020",20.0,20.549999237060547,21.100000381469727,19.799999237060547
"Apr 07, 2020",21.389999389648438,21.0,22.709999084472656,21.0
"Apr 08, 2020",21.639999389648438,21.639999389648438,22.399999618530273,21.520000457763672
"Apr 09, 2020",21.549999237060547,22.020000457763672,22.299999237060547,21.389999389648438
"Apr 13, 2020",21.34000015258789,21.65999984741211,21.739999771118164,21.15999984741211
"Apr 14, 2020",22.399999618530273,21.940000534057617,22.690000534057617,21.729999542236328
"Apr 15, 2020",22.479999542236328,22.0,22.850000381469727,21.649999618530273
"Apr 16, 2020",22.719999313354492,22.90999984741211,23.100000381469727,22.350000381469727
"Apr 17, 2020",23.719999313354492,23.100000381469727,23.81999969482422,23.030000686645508
"Apr 20, 2020",24.579999923706055,23.299999237060547,24.75,23.1299991607666
"Apr 22, 2020",24.25,25.200000762939453,25.25,24.15999984741211
"Apr 23, 2020",24.200000762939453,24.350000381469727,24.860000610351562,23.520000457763672
"Apr 24, 2020",23.110000610351562,23.600000381469727,24.030000686645508,21.600000381469727
"Apr 27, 2020",23.399999618530273,23.84000015258789,24.100000381469727,23.34000015258789
"Apr 28, 2020",23.40999984741211,23.940000534057617,24.139999389648438,23.40999984741211
"Apr 29, 2020",23.290000915527344,23.739999771118164,24.06999969482422,22.84000015258789
"Apr 30, 2020",22.799999237060547,23.0,23.450000762939453,22.479999542236328
"May 04, 2020",21.709999084472656,21.950000762939453,22.5,21.5
"May 05, 2020",21.520000457763672,22.06999969482422,22.40999984741211,21.520000457763672
"May 06, 2020",21.600000381469727,21.649999618530273,21.979999542236328,21.0
"May 07, 2020",20.979999542236328,21.68000030517578,21.969999313354492,20.860000610351562
"May 08, 2020",20.65999984741211,21.579999923706055,21.649999618530273,20.65999984741211
"May 11, 2020",19.860000610351562,20.690000534057617,20.90999984741211,19.860000610351562
"May 12, 2020",20.0,20.0,20.84000015258789,19.8799991607666
"May 13, 2020",19.610000610351562,20.1299991607666,20.190000534057617,19.34000015258789
"May 14, 2020",20.829999923706055,19.479999542236328,21.239999771118164,19.25
"May 15, 2020",20.149999618530273,20.399999618530273,20.459999084472656,19.5
"May 18, 2020",20.700000762939453,20.799999237060547,20.90999984741211,20.270000457763672
"May 19, 2020",19.959999084472656,20.950000762939453,21.100000381469727,19.959999084472656
"May 20, 2020",20.8700008392334,20.1299991607666,21.020000457763672,20.100000381469727
"May 21, 2020",22.079999923706055,20.81999969482422,22.290000915527344,20.81999969482422
"May 22, 2020",22.229999542236328,21.850000381469727,22.489999771118164,21.25
"May 25, 2020",23.0,22.600000381469727,23.469999313354492,22.479999542236328
"May 26, 2020",23.100000381469727,23.5,24.0,23.100000381469727
"May 27, 2020",23.350000381469727,24.5,25.0,23.170000076293945
"May 28, 2020",22.860000610351562,23.5,23.510000228881836,22.549999237060547
"May 29, 2020",23.350000381469727,22.899999618530273,23.610000610351562,22.559999465942383
"Jun 01, 2020",23.989999771118164,23.350000381469727,23.989999771118164,23.100000381469727
"Jun 02, 2020",25.610000610351562,24.1299991607666,25.860000610351562,24.1299991607666
"Jun 03, 2020",25.850000381469727,25.979999542236328,27.190000534057617,25.459999084472656
"Jun 04, 2020",25.200000762939453,25.799999237060547,25.90999984741211,24.700000762939453
"Jun 05, 2020",25.790000915527344,25.989999771118164,26.15999984741211,25.65999984741211
"Jun 08, 2020",26.059999465942383,26.010000228881836,26.479999542236328,25.920000076293945
"Jun 09, 2020",25.59000015258789,25.690000534057617,26.1200008392334,24.829999923706055
"Jun 10, 2020",25.3799991607666,25.520000457763672,25.860000610351562,24.979999542236328
"Jun 12, 2020",24.90999984741211,24.280000686645508,24.959999084472656,23.799999237060547
"Jun 15, 2020",24.780000686645508,24.1299991607666,25.0,23.920000076293945
"Jun 16, 2020",25.0,25.510000228881836,25.709999084472656,24.670000076293945
"Jun 17, 2020",26.190000534057617,25.0,26.190000534057617,24.8700008392334
"Jun 18, 2020",26.0,26.100000381469727,26.350000381469727,25.459999084472656
"Jun 19, 2020",25.110000610351562,26.420000076293945,26.459999084472656,25.100000381469727
"Jun 22, 2020",24.799999237060547,25.299999237060547,25.549999237060547,24.799999237060547
"Jun 23, 2020",25.149999618530273,25.299999237060547,26.0,24.700000762939453
"Jun 24, 2020",24.559999465942383,25.0,25.5,24.479999542236328
"Jun 25, 2020",24.940000534057617,24.6200008392334,25.270000457763672,24.399999618530273
"Jun 26, 2020",24.360000610351562,24.920000076293945,25.06999969482422,24.200000762939453
"Jun 29, 2020",24.610000610351562,24.309999465942383,24.649999618530273,24.100000381469727
"Jun 30, 2020",24.59000015258789,24.469999313354492,25.040000915527344,24.389999389648438
"Jul 01, 2020",24.920000076293945,24.90999984741211,25.290000915527344,24.6299991607666
"Jul 02, 2020",24.649999618530273,25.200000762939453,25.399999618530273,24.6200008392334
"Jul 03, 2020",24.790000915527344,24.649999618530273,24.889999389648438,24.540000915527344
"Jul 06, 2020",24.979999542236328,25.229999542236328,25.350000381469727,24.93000030517578
"Jul 07, 2020",25.739999771118164,25.049999237060547,25.739999771118164,24.969999313354492
"Jul 08, 2020",26.270000457763672,25.860000610351562,26.600000381469727,25.799999237060547
"Jul 09, 2020",25.700000762939453,26.3700008392334,26.420000076293945,25.700000762939453
"Jul 10, 2020",25.440000534057617,25.600000381469727,25.84000015258789,25.399999618530273
"Jul 13, 2020",25.6299991607666,25.510000228881836,26.219999313354492,25.299999237060547
"Jul 14, 2020",25.6299991607666,25.520000457763672,25.65999984741211,24.860000610351562
"Jul 15, 2020",26.3700008392334,25.84000015258789,26.3700008392334,25.600000381469727
"Jul 16, 2020",25.809999465942383,26.399999618530273,26.399999618530273,25.559999465942383
"Jul 17, 2020",25.899999618530273,25.920000076293945,26.1299991607666,25.719999313354492
"Jul 20, 2020",25.510000228881836,26.040000915527344,26.079999923706055,25.31999969482422
"Jul 21, 2020",25.25,25.690000534057617,25.799999237060547,25.0
"Jul 22, 2020",24.950000762939453,25.329999923706055,25.600000381469727,24.690000534057617
"Jul 23, 2020",24.290000915527344,25.0,25.260000228881836,24.209999084472656
"Jul 24, 2020",24.43000030517578,24.299999237060547,24.549999237060547,23.829999923706055
"Jul 27, 2020",24.299999237060547,24.579999923706055,24.959999084472656,24.299999237060547
"Jul 28, 2020",24.540000915527344,24.489999771118164,24.65999984741211,24.1299991607666
"Jul 29, 2020",24.889999389648438,24.700000762939453,25.149999618530273,24.440000534057617
"Jul 30, 2020",25.6299991607666,24.90999984741211,25.729999542236328,24.600000381469727
"Jul 31, 2020",25.610000610351562,24.75,25.770000457763672,24.600000381469727
"Aug 03, 2020",26.440000534057617,25.690000534057617,26.8700008392334,25.5
"Aug 04, 2020",26.100000381469727,26.520000457763672,27.239999771118164,25.770000457763672
"Aug 05, 2020",26.200000762939453,26.510000228881836,26.940000534057617,25.93000030517578
"Aug 06, 2020",25.899999618530273,26.309999465942383,26.56999969482422,25.799999237060547
"Aug 07, 2020",26.040000915527344,25.770000457763672,26.5,25.299999237060547
"Aug 10, 2020",25.979999542236328,26.139999389648438,26.350000381469727,25.700000762939453
"Aug 11, 2020",25.959999084472656,26.100000381469727,26.469999313354492,25.8799991607666
"Aug 12, 2020",25.15999984741211,26.06999969482422,26.079999923706055,24.90999984741211
"Aug 13, 2020",25.020000457763672,25.299999237060547,25.68000030517578,25.0
"Aug 14, 2020",24.760000228881836,24.8700008392334,25.1299991607666,24.200000762939453
"Aug 17, 2020",24.360000610351562,24.770000457763672,24.979999542236328,23.920000076293945
"Aug 18, 2020",24.989999771118164,24.65999984741211,25.100000381469727,24.520000457763672
"Aug 19, 2020",24.75,25.100000381469727,25.290000915527344,24.5
"Aug 20, 2020",24.68000030517578,24.290000915527344,24.899999618530273,24.139999389648438
"Aug 21, 2020",24.979999542236328,24.600000381469727,25.239999771118164,24.510000228881836
"Aug 24, 2020",25.0,25.010000228881836,25.399999618530273,24.6299991607666
"Aug 25, 2020",25.450000762939453,25.200000762939453,25.450000762939453,25.010000228881836
"Aug 26, 2020",25.1200008392334,25.440000534057617,25.68000030517578,24.959999084472656
"Aug 27, 2020",25.270000457763672,25.170000076293945,25.520000457763672,25.100000381469727
"Aug 28, 2020",25.829999923706055,25.31999969482422,25.989999771118164,25.299999237060547
"Aug 31, 2020",26.100000381469727,25.799999237060547,26.350000381469727,25.520000457763672
