﻿"Date","Price","Open","High","Low","Vol.","Change %"
"Apr 20, 2015","10.85","10.88","10.99","10.74","3.95M","-0.73%"
"Apr 22, 2015","10.97","10.78","11.03","10.76","6.35M","1.11%"
"Apr 23, 2015","11.26","10.91","11.26","10.91","1.42M","2.64%"
"Apr 24, 2015","10.92","11.26","11.26","10.87","4.09M","-3.02%"
"Apr 27, 2015","10.68","10.90","10.99","10.58","2.28M","-2.20%"
"Apr 28, 2015","10.44","10.74","10.74","10.38","5.25M","-2.25%"
"Apr 29, 2015","10.26","10.31","10.40","10.23","7.11M","-1.72%"
"Apr 30, 2015","10.40","10.13","10.57","10.12","2.89M","1.36%"
"May 04, 2015","10.51","10.53","10.53","10.33","2.70M","1.06%"
"May 05, 2015","10.35","10.46","10.49","10.32","3.99M","-1.52%"
"May 06, 2015","10.25","10.39","10.39","10.11","3.66M","-0.97%"
"May 07, 2015","10.19","10.14","10.25","10.08","2.33M","-0.59%"
"May 08, 2015","10.40","10.28","10.40","10.11","2.15M","2.06%"
"May 11, 2015","10.11","10.40","10.40","10.09","4.75M","-2.79%"
"May 12, 2015","10.24","10.13","10.37","10.10","3.34M","1.29%"
"May 13, 2015","10.35","10.16","10.39","10.13","3.80M","1.07%"
"May 14, 2015","10.47","10.40","10.52","10.24","2.64M","1.16%"
"May 15, 2015","10.18","10.37","10.52","10.05","3.72M","-2.77%"
"May 18, 2015","10.10","10.25","10.32","10.05","2.05M","-0.79%"
"May 19, 2015","9.91","10.11","10.15","9.85","5.67M","-1.88%"
"May 20, 2015","9.98","9.92","10.06","9.88","1.95M","0.71%"
"May 21, 2015","9.92","9.93","9.94","9.62","1.94M","-0.60%"
"May 22, 2015","9.64","9.92","9.97","9.61","2.50M","-2.82%"
"May 25, 2015","9.77","9.67","9.87","9.58","1.16M","1.35%"
"May 26, 2015","9.53","9.76","9.77","9.48","4.96M","-2.46%"
"May 27, 2015","9.65","9.54","9.77","9.53","3.36M","1.26%"
"May 28, 2015","9.58","9.59","9.66","9.52","2.03M","-0.73%"
"May 29, 2015","9.52","9.55","9.58","9.48","4.18M","-0.63%"
"Jun 01, 2015","9.60","9.48","9.60","9.48","1.98M","0.84%"
"Jun 02, 2015","9.73","9.55","9.73","9.55","2.75M","1.35%"
"Jun 03, 2015","9.72","9.74","9.74","9.61","2.15M","-0.10%"
"Jun 05, 2015","9.66","9.58","9.74","9.54","2.88M","-0.62%"
"Jun 08, 2015","9.55","9.65","9.68","9.52","1.79M","-1.14%"
"Jun 09, 2015","9.65","9.61","9.66","9.49","1.82M","1.05%"
"Jun 10, 2015","9.86","9.65","9.93","9.61","4.76M","2.18%"
"Jun 11, 2015","9.87","9.84","9.93","9.76","3.78M","0.10%"
"Jun 12, 2015","9.84","9.80","9.87","9.79","2.66M","-0.30%"
"Jun 15, 2015","9.80","9.76","9.85","9.69","1.57M","-0.41%"
"Jun 16, 2015","9.72","9.87","9.88","9.70","1.65M","-0.82%"
"Jun 17, 2015","9.68","9.69","9.78","9.68","2.96M","-0.41%"
"Jun 18, 2015","9.70","9.74","9.83","9.62","2.60M","0.21%"
"Jun 19, 2015","9.64","9.63","9.81","9.57","2.30M","-0.62%"
"Jun 22, 2015","9.57","9.70","9.83","9.52","2.00M","-0.73%"
"Jun 23, 2015","9.54","9.62","9.67","9.54","1.16M","-0.31%"
"Jun 24, 2015","9.40","9.59","9.59","9.37","2.91M","-1.47%"
"Jun 25, 2015","9.34","9.40","9.43","9.30","2.67M","-0.64%"
"Jun 26, 2015","9.27","9.39","9.55","9.23","2.75M","-0.75%"
"Jun 29, 2015","9.24","9.24","9.31","9.13","1.58M","-0.32%"
"Jun 30, 2015","9.15","9.23","9.37","9.11","3.66M","-0.97%"
"Jul 01, 2015","9.40","9.21","9.48","9.18","2.09M","2.73%"
"Jul 02, 2015","9.24","9.42","9.58","9.24","1.60M","-1.70%"
"Jul 03, 2015","9.07","9.18","9.27","9.05","1.37M","-1.84%"
"Jul 06, 2015","9.06","9.07","9.17","8.95","996.03K","-0.11%"
"Jul 07, 2015","9.04","9.00","9.12","8.97","1.05M","-0.22%"
"Jul 08, 2015","8.98","9.04","9.04","8.92","3.30M","-0.66%"
"Jul 10, 2015","8.92","9.04","9.10","8.92","3.67M","-0.67%"
"Jul 13, 2015","8.83","8.94","9.01","8.83","2.49M","-1.01%"
"Jul 14, 2015","8.98","8.85","9.09","8.85","2.14M","1.70%"
"Jul 15, 2015","8.98","9.04","9.04","8.87","1.60M","0.00%"
"Jul 16, 2015","9.09","9.03","9.20","8.92","1.80M","1.22%"
"Jul 17, 2015","8.98","9.07","9.22","8.87","3.06M","-1.21%"
"Jul 20, 2015","8.88","8.98","8.98","8.71","2.33M","-1.11%"
"Jul 21, 2015","8.79","8.97","8.97","8.79","1.86M","-1.01%"
"Jul 22, 2015","9.10","8.72","9.10","8.64","2.67M","3.53%"
"Jul 23, 2015","8.46","9.03","9.03","8.31","3.99M","-7.03%"
"Jul 24, 2015","8.49","8.56","8.71","8.38","7.19M","0.35%"
"Jul 27, 2015","8.41","8.43","8.54","8.22","3.60M","-0.94%"
"Jul 28, 2015","8.35","8.41","8.45","8.13","4.57M","-0.71%"
"Jul 29, 2015","8.38","8.29","8.45","8.26","3.42M","0.36%"
"Jul 30, 2015","8.35","8.44","8.48","8.30","2.92M","-0.36%"
"Jul 31, 2015","8.41","8.34","8.56","8.28","2.66M","0.72%"
"Aug 03, 2015","8.20","8.35","8.38","8.10","3.30M","-2.50%"
"Aug 04, 2015","8.27","8.21","8.27","8.09","2.14M","0.85%"
"Aug 05, 2015","8.29","8.38","8.38","8.20","1.99M","0.24%"
"Aug 06, 2015","7.90","8.23","8.23","7.86","2.80M","-4.70%"
"Aug 07, 2015","7.93","7.84","7.93","7.79","5.32M","0.38%"
"Aug 10, 2015","8.08","7.93","8.10","7.85","3.46M","1.89%"
"Aug 11, 2015","8.03","7.99","8.08","7.93","1.97M","-0.62%"
"Aug 12, 2015","7.82","8.03","8.08","7.78","2.32M","-2.62%"
"Aug 13, 2015","7.75","7.85","7.89","7.54","2.95M","-0.90%"
"Aug 14, 2015","7.45","7.64","7.70","7.42","3.76M","-3.87%"
"Aug 17, 2015","7.52","7.42","7.60","7.42","3.36M","0.94%"
"Aug 18, 2015","7.46","7.45","7.55","7.39","5.77M","-0.80%"
"Aug 19, 2015","7.40","7.41","7.47","7.26","3.48M","-0.80%"
"Aug 20, 2015","7.13","7.35","7.35","7.12","3.55M","-3.65%"
"Aug 21, 2015","7.09","7.06","7.11","6.88","4.66M","-0.56%"
"Aug 24, 2015","7.03","6.67","7.08","6.43","4.62M","-0.85%"
"Aug 25, 2015","6.91","7.09","7.18","6.91","3.32M","-1.71%"
"Aug 26, 2015","7.00","6.96","7.05","6.82","3.34M","1.30%"
"Aug 27, 2015","7.15","7.00","7.21","6.98","3.34M","2.14%"
"Aug 28, 2015","7.18","7.06","7.30","6.98","4.69M","0.42%"
"Aug 31, 2015","6.70","7.13","7.13","6.70","7.29M","-6.69%"
"Sep 01, 2015","6.42","6.63","6.70","6.33","9.18M","-4.18%"
"Sep 02, 2015","6.32","6.44","6.56","6.30","6.37M","-1.56%"
"Sep 03, 2015","6.52","6.36","6.55","6.32","3.49M","3.16%"
"Sep 04, 2015","6.43","6.39","6.68","6.32","5.00M","-1.38%"
"Sep 08, 2015","6.47","6.47","6.53","6.39","3.98M","0.62%"
"Sep 09, 2015","6.48","6.48","6.52","6.32","5.78M","0.15%"
"Sep 10, 2015","6.31","6.32","6.39","6.19","10.19M","-2.62%"
"Sep 11, 2015","6.43","6.27","6.46","6.21","9.15M","1.90%"
"Sep 14, 2015","6.54","6.41","6.64","6.38","5.40M","1.71%"
"Sep 15, 2015","6.57","6.46","6.57","6.35","3.39M","0.46%"
"Sep 16, 2015","6.86","6.58","6.89","6.57","7.23M","4.41%"
"Sep 17, 2015","7.18","6.86","7.30","6.69","4.58M","4.66%"
"Sep 18, 2015","6.70","7.07","7.38","6.70","3.23M","-6.69%"
"Sep 21, 2015","6.85","6.66","6.91","6.63","2.03M","2.24%"
"Sep 22, 2015","7.30","6.72","7.31","6.71","4.52M","6.57%"
"Sep 23, 2015","7.31","7.33","7.58","7.06","3.27M","0.14%"
"Sep 24, 2015","7.49","7.03","7.62","7.00","2.83M","2.46%"
"Sep 25, 2015","7.36","7.56","7.57","7.25","2.42M","-1.74%"
"Sep 28, 2015","7.41","7.21","7.52","7.10","3.26M","0.68%"
"Sep 29, 2015","7.18","7.41","7.61","7.18","3.03M","-3.10%"
"Sep 30, 2015","7.31","7.29","7.49","7.26","2.78M","1.81%"
"Oct 01, 2015","7.13","7.41","7.45","7.06","3.80M","-2.46%"
"Oct 02, 2015","7.39","7.13","7.39","7.01","3.73M","3.65%"
"Oct 05, 2015","7.65","7.60","7.73","7.34","3.16M","3.52%"
"Oct 06, 2015","7.49","7.56","7.80","7.39","3.24M","-2.09%"
"Oct 07, 2015","7.61","7.70","7.76","7.55","7.13M","1.60%"
"Oct 08, 2015","7.84","7.56","8.07","7.56","6.04M","3.02%"
"Oct 09, 2015","8.01","7.88","8.12","7.85","5.03M","2.17%"
"Oct 13, 2015","7.82","8.01","8.12","7.73","5.36M","-2.37%"
"Oct 14, 2015","7.64","7.77","7.88","7.50","5.60M","-2.30%"
"Oct 15, 2015","7.49","7.58","7.88","7.43","2.56M","-1.96%"
"Oct 16, 2015","7.61","7.49","7.68","7.42","3.96M","1.60%"
"Oct 19, 2015","7.67","7.61","7.78","7.45","2.31M","0.79%"
"Oct 20, 2015","7.52","7.68","7.70","7.44","3.19M","-1.96%"
"Oct 21, 2015","7.34","7.52","7.52","7.28","2.25M","-2.39%"
"Oct 22, 2015","7.37","7.35","7.56","7.24","4.21M","0.41%"
"Oct 23, 2015","7.70","7.79","7.86","7.64","4.72M","4.48%"
"Oct 26, 2015","7.74","7.70","7.85","7.64","1.91M","0.52%"
"Oct 27, 2015","7.51","7.74","7.74","7.51","2.40M","-2.97%"
"Oct 28, 2015","7.68","7.51","7.68","7.36","3.48M","2.26%"
"Oct 29, 2015","7.45","7.57","7.73","7.45","2.25M","-2.99%"
"Oct 30, 2015","7.82","7.45","7.82","7.41","2.10M","4.97%"
"Nov 03, 2015","8.06","7.83","8.06","7.83","4.37M","3.07%"
"Nov 04, 2015","8.44","8.13","8.57","8.13","4.85M","4.71%"
"Nov 05, 2015","8.78","8.44","8.93","8.28","4.91M","4.03%"
"Nov 06, 2015","8.73","8.72","8.86","8.32","3.03M","-0.57%"
"Nov 09, 2015","8.47","8.72","8.72","8.47","3.11M","-2.98%"
"Nov 10, 2015","8.13","8.42","8.42","7.91","3.43M","-4.01%"
"Nov 11, 2015","8.21","8.13","8.27","8.01","2.62M","0.98%"
"Nov 12, 2015","8.21","8.22","8.42","8.13","2.51M","0.00%"
"Nov 13, 2015","8.39","8.15","8.41","8.07","2.31M","2.19%"
"Nov 16, 2015","8.17","8.43","8.45","8.02","3.03M","-2.62%"
"Nov 17, 2015","8.14","8.21","8.27","8.07","3.34M","-0.37%"
"Nov 18, 2015","8.25","8.13","8.51","8.12","1.99M","1.35%"
"Nov 19, 2015","8.50","8.31","8.55","8.31","1.92M","3.03%"
"Nov 23, 2015","8.67","8.55","8.77","8.55","1.25M","2.00%"
"Nov 24, 2015","8.56","8.62","8.65","8.40","3.52M","-1.27%"
"Nov 25, 2015","8.41","8.48","8.49","8.27","1.68M","-1.75%"
"Nov 26, 2015","8.43","8.35","8.53","8.30","2.04M","0.24%"
"Nov 27, 2015","8.28","8.37","8.45","8.19","2.15M","-1.78%"
"Nov 30, 2015","8.00","8.22","8.28","7.94","3.98M","-3.38%"
"Dec 01, 2015","7.64","8.06","8.06","7.58","5.07M","-4.50%"
"Dec 02, 2015","7.71","7.59","7.89","7.59","4.64M","0.92%"
"Dec 03, 2015","7.82","7.97","8.07","7.79","2.89M","1.43%"
"Dec 04, 2015","7.45","7.77","7.88","7.29","4.73M","-4.73%"
"Dec 07, 2015","7.67","7.50","7.88","7.34","2.49M","2.95%"
"Dec 08, 2015","7.28","7.73","7.73","7.28","2.28M","-5.08%"
"Dec 09, 2015","7.67","7.39","7.79","7.32","3.10M","5.36%"
"Dec 10, 2015","7.52","7.67","7.67","7.33","1.65M","-1.96%"
"Dec 11, 2015","7.37","7.47","7.51","7.36","1.64M","-1.99%"
"Dec 14, 2015","7.46","7.37","7.46","7.15","1.45M","1.22%"
"Dec 15, 2015","7.43","7.51","7.53","7.33","1.75M","-0.40%"
"Dec 16, 2015","7.47","7.38","7.60","7.14","2.59M","0.54%"
"Dec 17, 2015","7.64","7.52","7.80","7.52","2.55M","2.28%"
"Dec 18, 2015","7.42","7.52","7.56","7.29","3.90M","-2.88%"
"Dec 21, 2015","7.37","7.39","7.59","7.26","2.65M","-0.67%"
"Dec 22, 2015","7.48","7.41","7.52","7.29","3.50M","1.49%"
"Dec 23, 2015","7.73","7.53","7.78","7.43","1.87M","3.34%"
"Dec 28, 2015","7.58","7.79","7.79","7.42","1.60M","-1.94%"
"Dec 29, 2015","7.36","7.59","7.79","7.33","1.90M","-2.90%"
"Dec 30, 2015","7.47","7.40","7.47","7.25","1.83M","1.49%"
"Jan 04, 2016","7.07","7.27","7.32","6.97","2.59M","-5.35%"
"Jan 05, 2016","7.25","7.12","7.33","7.07","1.83M","2.55%"
"Jan 06, 2016","7.31","7.20","7.42","7.12","2.28M","0.83%"
"Jan 07, 2016","7.27","7.24","7.27","7.04","2.83M","-0.55%"
"Jan 08, 2016","7.27","7.26","7.39","7.20","2.40M","0.00%"
"Jan 11, 2016","7.28","7.31","7.50","7.17","1.94M","0.14%"
"Jan 12, 2016","6.84","7.25","7.27","6.84","6.78M","-6.04%"
"Jan 13, 2016","6.88","6.93","6.97","6.75","5.19M","0.58%"
"Jan 14, 2016","7.00","6.84","7.05","6.78","2.65M","1.74%"
"Jan 15, 2016","6.78","6.87","6.94","6.68","7.04M","-3.14%"
"Jan 18, 2016","6.64","6.83","6.83","6.59","1.53M","-2.06%"
"Jan 19, 2016","6.60","6.83","6.85","6.50","3.85M","-0.60%"
"Jan 20, 2016","6.40","6.56","6.66","6.26","3.32M","-3.03%"
"Jan 21, 2016","6.30","6.35","6.65","6.30","4.07M","-1.56%"
"Jan 22, 2016","6.21","6.31","6.37","6.18","3.17M","-1.43%"
"Jan 26, 2016","6.23","6.14","6.31","6.05","5.63M","0.32%"
"Jan 27, 2016","6.41","6.23","6.55","6.18","2.31M","2.89%"
"Jan 28, 2016","6.27","6.41","6.61","6.21","2.91M","-2.18%"
"Jan 29, 2016","6.64","6.33","6.64","6.28","5.84M","5.90%"
"Feb 01, 2016","6.80","6.75","6.80","6.57","3.55M","2.41%"
"Feb 02, 2016","6.66","6.64","6.84","6.61","4.17M","-2.06%"
"Feb 03, 2016","6.76","6.70","6.76","6.53","2.23M","1.50%"
"Feb 04, 2016","6.81","6.84","7.10","6.68","6.17M","0.74%"
"Feb 05, 2016","6.66","6.87","6.91","6.66","1.99M","-2.20%"
"Feb 10, 2016","6.53","6.65","6.66","6.45","2.39M","-1.95%"
"Feb 11, 2016","6.37","6.43","6.50","6.33","1.74M","-2.45%"
"Feb 12, 2016","6.38","6.32","6.48","6.32","1.41M","0.16%"
"Feb 15, 2016","6.37","6.51","6.67","6.37","845.78K","-0.16%"
"Feb 16, 2016","6.57","6.45","6.57","6.36","5.03M","3.14%"
"Feb 17, 2016","6.57","6.66","6.67","6.54","7.59M","0.00%"
"Feb 18, 2016","6.61","6.51","6.68","6.51","2.07M","0.61%"
"Feb 19, 2016","6.48","6.50","6.61","6.45","2.75M","-1.97%"
"Feb 22, 2016","7.03","6.62","7.03","6.57","3.76M","8.49%"
"Feb 23, 2016","6.75","7.05","7.07","6.69","1.48M","-3.98%"
"Feb 24, 2016","6.80","6.68","6.84","6.52","1.41M","0.74%"
"Feb 25, 2016","7.05","6.80","7.07","6.68","949.41K","3.68%"
"Feb 26, 2016","6.88","7.08","7.35","6.88","1.22M","-2.41%"
"Feb 29, 2016","6.96","7.02","7.32","6.91","3.11M","1.16%"
"Mar 01, 2016","7.23","7.07","7.32","7.02","4.22M","3.88%"
"Mar 02, 2016","7.48","7.28","7.51","7.21","2.80M","3.46%"
"Mar 03, 2016","7.65","7.56","7.94","7.43","5.20M","2.27%"
"Mar 04, 2016","8.28","7.67","8.60","7.67","11.93M","8.24%"
"Mar 07, 2016","8.51","8.44","8.69","8.14","3.37M","2.78%"
"Mar 08, 2016","8.48","8.43","8.78","8.23","5.51M","-0.35%"
"Mar 09, 2016","8.45","8.57","8.77","8.45","4.42M","-0.35%"
"Mar 10, 2016","8.38","8.62","8.73","8.14","6.88M","-0.83%"
"Mar 11, 2016","8.24","8.48","8.52","8.05","3.83M","-1.67%"
"Mar 14, 2016","8.28","8.24","8.55","8.07","2.03M","0.49%"
"Mar 15, 2016","8.14","8.17","8.23","7.69","4.21M","-1.69%"
"Mar 16, 2016","8.28","7.96","8.28","7.92","3.68M","1.72%"
"Mar 17, 2016","8.65","8.78","8.90","8.52","6.64M","4.47%"
"Mar 18, 2016","8.96","8.63","8.98","8.58","6.33M","3.58%"
"Mar 21, 2016","8.99","9.01","9.13","8.84","4.02M","0.33%"
"Mar 22, 2016","8.87","8.99","9.05","8.79","2.51M","-1.33%"
"Mar 23, 2016","8.70","8.77","8.82","8.66","2.27M","-1.92%"
"Mar 24, 2016","8.33","8.50","8.57","8.33","2.68M","-4.25%"
"Mar 28, 2016","8.54","8.48","8.59","8.37","2.81M","2.52%"
"Mar 29, 2016","8.87","8.58","8.90","8.48","3.33M","3.86%"
"Mar 30, 2016","9.12","8.87","9.36","8.78","7.61M","2.82%"
"Mar 31, 2016","9.00","9.02","9.26","8.97","5.03M","-1.32%"
"Apr 01, 2016","9.23","8.98","9.43","8.96","3.78M","2.56%"
"Apr 04, 2016","9.14","9.16","9.22","8.94","6.72M","-0.98%"
"Apr 05, 2016","9.55","9.05","9.64","9.04","4.24M","4.49%"
"Apr 06, 2016","9.53","9.43","9.59","9.28","3.56M","-0.21%"
"Apr 07, 2016","9.60","9.61","9.66","9.41","3.09M","0.73%"
"Apr 08, 2016","9.85","9.80","9.90","9.68","2.85M","2.60%"
"Apr 11, 2016","9.78","9.98","10.07","9.64","3.69M","-0.71%"
"Apr 12, 2016","10.14","9.87","10.17","9.70","3.73M","3.68%"
"Apr 13, 2016","10.02","10.25","10.77","10.02","5.13M","-1.18%"
"Apr 14, 2016","9.99","10.06","10.21","9.97","3.03M","-0.30%"
"Apr 15, 2016","10.10","10.07","10.25","9.95","2.99M","1.10%"
"Apr 18, 2016","9.90","10.10","10.12","9.85","1.67M","-1.98%"
"Apr 19, 2016","10.16","9.90","10.39","9.90","2.31M","2.63%"
"Apr 20, 2016","10.07","10.05","10.20","9.98","1.93M","-0.89%"
"Apr 22, 2016","9.50","9.85","10.10","9.38","3.34M","-5.66%"
"Apr 25, 2016","9.36","9.56","9.56","9.15","3.87M","-1.47%"
"Apr 26, 2016","10.04","9.64","10.17","9.64","4.73M","7.26%"
"Apr 27, 2016","10.38","10.11","10.75","10.07","4.78M","3.39%"
"Apr 28, 2016","10.39","10.39","10.46","10.17","2.32M","0.10%"
"Apr 29, 2016","10.05","10.25","10.55","10.05","5.04M","-3.27%"
"May 02, 2016","10.36","10.08","10.64","10.00","5.08M","3.08%"
"May 03, 2016","10.36","10.24","10.55","10.24","2.27M","0.00%"
"May 04, 2016","10.51","10.39","10.54","10.19","5.21M","1.45%"
"May 05, 2016","10.33","10.62","10.63","10.31","2.53M","-1.71%"
"May 06, 2016","10.58","10.30","10.75","10.29","3.16M","2.42%"
"May 09, 2016","10.59","10.58","10.71","10.21","2.94M","0.09%"
"May 10, 2016","11.01","10.77","11.04","10.77","2.52M","3.97%"
"May 11, 2016","11.00","11.15","11.29","11.00","3.29M","-0.09%"
"May 12, 2016","11.20","11.17","11.30","11.01","4.16M","1.82%"
"May 13, 2016","11.11","11.08","11.18","10.85","3.65M","-0.80%"
"May 16, 2016","10.73","11.15","11.15","10.73","2.36M","-3.42%"
"May 17, 2016","10.18","10.76","10.90","10.12","2.89M","-5.13%"
"May 18, 2016","10.15","10.11","10.38","9.99","4.71M","-0.29%"
"May 19, 2016","10.33","10.02","10.36","10.02","2.82M","1.77%"
"May 20, 2016","10.33","10.37","10.49","10.27","4.54M","0.00%"
"May 23, 2016","10.14","10.17","10.22","9.95","2.34M","-1.84%"
"May 24, 2016","10.30","10.21","10.38","10.14","1.38M","1.58%"
"May 25, 2016","10.24","10.26","10.39","10.21","1.94M","-0.58%"
"May 27, 2016","9.96","10.21","10.37","9.95","1.70M","-2.73%"
"May 30, 2016","9.91","9.98","10.05","9.75","2.70M","-0.50%"
"May 31, 2016","10.13","9.83","10.20","9.83","5.37M","2.22%"
"Jun 01, 2016","10.11","10.24","10.26","9.91","2.70M","-0.20%"
"Jun 02, 2016","10.07","10.12","10.12","9.95","3.12M","-0.40%"
"Jun 03, 2016","10.32","10.15","10.33","10.12","3.90M","2.48%"
"Jun 06, 2016","10.21","10.37","10.46","10.03","1.84M","-1.07%"
"Jun 07, 2016","9.85","10.13","10.24","9.80","3.18M","-3.53%"
"Jun 08, 2016","10.13","9.87","10.23","9.85","13.61M","2.84%"
"Jun 09, 2016","10.21","10.08","10.30","10.00","8.38M","0.79%"
"Jun 10, 2016","10.18","10.21","10.30","10.12","2.50M","-0.29%"
"Jun 13, 2016","10.14","10.02","10.17","9.92","1.79M","-0.39%"
"Jun 14, 2016","9.87","10.14","10.14","9.80","2.87M","-2.66%"
"Jun 15, 2016","9.99","9.87","10.08","9.65","3.59M","1.22%"
"Jun 16, 2016","10.25","9.90","10.25","9.80","1.61M","2.60%"
"Jun 17, 2016","10.39","10.24","10.53","10.24","2.74M","1.37%"
"Jun 20, 2016","10.64","10.59","10.71","10.49","2.32M","2.41%"
"Jun 21, 2016","11.20","10.57","11.23","10.56","4.96M","5.26%"
"Jun 22, 2016","10.57","11.19","11.20","10.46","3.56M","-5.63%"
"Jun 23, 2016","10.76","10.66","10.91","10.49","2.53M","1.80%"
"Jun 24, 2016","10.49","10.33","10.55","10.23","1.97M","-2.51%"
"Jun 27, 2016","10.49","10.30","10.65","10.26","2.53M","0.00%"
"Jun 28, 2016","10.71","10.66","10.81","10.58","4.42M","2.10%"
"Jun 29, 2016","10.62","10.83","10.90","10.52","2.87M","-0.84%"
"Jun 30, 2016","10.51","10.53","10.58","10.36","5.13M","-1.04%"
"Jul 01, 2016","10.66","10.52","10.74","10.52","3.34M","1.43%"
"Jul 04, 2016","10.62","10.69","10.71","10.47","729.23K","-0.38%"
"Jul 05, 2016","10.15","10.61","10.61","10.04","2.92M","-4.43%"
"Jul 06, 2016","10.23","10.16","10.26","10.03","2.68M","0.79%"
"Jul 07, 2016","10.32","10.33","10.40","10.17","1.91M","0.88%"
"Jul 08, 2016","10.63","10.44","10.69","10.42","2.03M","3.00%"
"Jul 11, 2016","10.61","10.63","10.72","10.48","1.34M","-0.19%"
"Jul 12, 2016","10.75","10.72","10.86","10.60","3.01M","1.32%"
"Jul 13, 2016","10.71","10.67","10.80","10.54","2.57M","-0.37%"
"Jul 14, 2016","10.87","10.83","11.05","10.72","4.70M","1.49%"
"Jul 15, 2016","11.09","10.86","11.12","10.82","2.83M","2.02%"
"Jul 18, 2016","11.30","11.19","11.36","11.19","6.27M","1.89%"
"Jul 19, 2016","11.36","11.30","11.39","11.13","3.32M","0.53%"
"Jul 20, 2016","11.29","11.42","11.44","11.18","2.91M","-0.62%"
"Jul 21, 2016","11.26","11.36","11.44","11.01","1.57M","-0.27%"
"Jul 22, 2016","11.88","11.61","11.98","11.54","9.20M","5.51%"
"Jul 25, 2016","11.74","11.86","11.86","11.54","4.79M","-1.18%"
"Jul 26, 2016","11.70","11.71","11.75","11.58","2.95M","-0.34%"
"Jul 27, 2016","11.68","11.67","11.70","11.63","5.46M","-0.17%"
"Jul 28, 2016","11.94","11.82","11.94","11.36","2.39M","2.23%"
"Jul 29, 2016","12.34","11.98","12.34","11.84","3.22M","3.35%"
"Aug 01, 2016","12.40","12.34","12.43","12.14","2.10M","0.49%"
"Aug 02, 2016","12.20","12.26","12.34","12.08","3.00M","-1.61%"
"Aug 03, 2016","12.44","12.12","12.45","11.88","1.89M","1.97%"
"Aug 04, 2016","12.62","12.48","12.77","12.27","2.58M","1.45%"
"Aug 05, 2016","12.89","12.71","13.02","12.60","2.91M","2.14%"
"Aug 08, 2016","12.84","12.87","12.93","12.75","1.09M","-0.39%"
"Aug 09, 2016","13.09","12.83","13.14","12.83","1.66M","1.95%"
"Aug 10, 2016","13.04","13.17","13.25","12.95","1.30M","-0.38%"
"Aug 11, 2016","13.32","12.99","13.37","12.95","2.33M","2.15%"
"Aug 12, 2016","12.92","13.24","13.45","12.88","2.37M","-3.00%"
"Aug 15, 2016","13.14","12.95","13.18","12.94","1.91M","1.70%"
"Aug 16, 2016","12.86","13.14","13.14","12.77","1.56M","-2.13%"
"Aug 17, 2016","12.92","12.79","12.92","12.35","4.80M","0.47%"
"Aug 18, 2016","12.71","12.99","13.04","12.65","1.65M","-1.63%"
"Aug 19, 2016","12.69","12.61","12.69","12.42","1.79M","-0.16%"
"Aug 22, 2016","12.39","12.54","12.59","12.37","926.73K","-2.36%"
"Aug 23, 2016","12.34","12.37","12.59","12.28","2.25M","-0.40%"
"Aug 24, 2016","12.38","12.14","12.53","12.14","1.62M","0.32%"
"Aug 25, 2016","12.17","12.44","12.44","12.16","3.64M","-1.70%"
"Aug 26, 2016","12.14","12.27","12.39","11.97","3.42M","-0.25%"
"Aug 29, 2016","12.40","12.08","12.53","12.08","3.73M","2.14%"
"Aug 30, 2016","12.46","12.40","12.48","12.24","1.70M","0.48%"
"Aug 31, 2016","12.34","12.39","12.51","12.12","2.54M","-0.96%"
"Sep 01, 2016","12.45","12.28","12.59","12.21","2.08M","0.89%"
"Sep 02, 2016","12.88","12.59","12.88","12.48","2.55M","3.45%"
"Sep 05, 2016","12.92","12.94","13.08","12.75","1.50M","0.31%"
"Sep 06, 2016","13.21","13.06","13.25","12.78","4.06M","2.24%"
"Sep 08, 2016","13.27","13.32","13.32","12.98","2.41M","0.45%"
"Sep 09, 2016","12.55","13.08","13.26","12.54","4.46M","-5.43%"
"Sep 12, 2016","12.62","12.49","12.65","12.36","1.86M","0.56%"
"Sep 13, 2016","12.31","12.41","12.48","12.07","4.79M","-2.46%"
"Sep 14, 2016","12.14","12.20","12.38","12.05","1.79M","-1.38%"
"Sep 15, 2016","12.12","12.22","12.26","12.03","2.08M","-0.16%"
"Sep 16, 2016","12.22","12.12","12.28","11.96","2.60M","0.83%"
"Sep 19, 2016","12.34","12.25","12.43","12.21","2.49M","0.98%"
"Sep 20, 2016","12.67","12.46","12.68","12.22","2.11M","2.67%"
"Sep 21, 2016","12.79","12.68","12.79","12.12","3.44M","0.95%"
"Sep 22, 2016","12.47","12.87","12.94","12.33","4.38M","-2.50%"
"Sep 23, 2016","12.33","12.45","12.59","12.22","2.34M","-1.12%"
"Sep 26, 2016","12.28","12.19","12.39","12.11","1.45M","-0.41%"
"Sep 27, 2016","12.20","12.28","12.43","12.07","2.57M","-0.65%"
"Sep 28, 2016","12.25","12.27","12.47","12.11","2.16M","0.41%"
"Sep 29, 2016","12.15","12.30","12.47","12.06","3.11M","-0.82%"
"Sep 30, 2016","12.15","12.22","12.40","12.15","2.50M","0.00%"
"Oct 03, 2016","12.58","12.18","12.62","12.15","2.04M","3.54%"
"Oct 04, 2016","12.58","12.62","12.62","12.43","2.83M","0.00%"
"Oct 05, 2016","12.68","12.63","12.74","12.59","2.30M","0.79%"
"Oct 06, 2016","12.61","12.64","12.68","12.47","1.99M","-0.55%"
"Oct 07, 2016","12.76","12.67","12.76","12.36","2.34M","1.19%"
"Oct 10, 2016","12.64","12.82","12.86","12.52","1.76M","-0.94%"
"Oct 11, 2016","12.64","12.67","12.73","12.55","2.49M","0.00%"
"Oct 13, 2016","12.79","12.57","12.94","12.48","5.34M","1.19%"
"Oct 14, 2016","12.55","12.93","13.00","12.41","2.33M","-1.88%"
"Oct 17, 2016","12.42","12.55","12.58","12.41","3.17M","-1.04%"
"Oct 18, 2016","12.61","12.43","12.61","12.34","5.27M","1.53%"
"Oct 19, 2016","12.83","12.61","12.97","12.49","5.20M","1.74%"
"Oct 20, 2016","13.10","12.84","13.10","12.65","1.74M","2.10%"
"Oct 21, 2016","12.55","13.04","13.10","12.46","6.15M","-4.20%"
"Oct 24, 2016","12.00","12.64","12.74","12.00","4.32M","-4.38%"
"Oct 25, 2016","12.49","12.02","12.51","12.02","5.86M","4.08%"
"Oct 26, 2016","12.30","12.49","12.61","12.22","3.65M","-1.52%"
"Oct 27, 2016","12.02","12.30","12.44","12.02","3.17M","-2.28%"
"Oct 28, 2016","12.33","12.09","12.37","12.04","3.62M","2.58%"
"Oct 31, 2016","12.19","12.27","12.33","12.08","3.36M","-1.14%"
"Nov 01, 2016","11.61","12.28","12.28","11.56","4.74M","-4.76%"
"Nov 03, 2016","11.57","11.61","11.69","11.46","5.44M","-0.34%"
"Nov 04, 2016","11.73","11.57","11.84","11.51","2.71M","1.38%"
"Nov 07, 2016","12.26","11.85","12.26","11.74","1.68M","4.52%"
"Nov 08, 2016","11.91","12.31","12.33","11.81","2.07M","-2.85%"
"Nov 09, 2016","11.62","11.67","11.84","11.25","2.45M","-2.43%"
"Nov 10, 2016","11.10","11.64","11.77","10.63","5.57M","-4.48%"
"Nov 11, 2016","10.82","10.85","11.27","10.47","5.60M","-2.52%"
"Nov 14, 2016","10.75","10.67","10.95","10.41","5.44M","-0.65%"
"Nov 16, 2016","10.80","10.62","10.98","10.41","4.35M","0.47%"
"Nov 17, 2016","10.35","10.96","10.97","10.30","4.86M","-4.17%"
"Nov 18, 2016","10.33","10.24","10.55","10.24","2.73M","-0.19%"
"Nov 21, 2016","10.74","10.46","10.79","10.31","5.58M","3.97%"
"Nov 22, 2016","11.26","10.92","11.34","10.76","7.17M","4.84%"
"Nov 23, 2016","11.29","11.26","11.30","10.92","5.62M","0.27%"
"Nov 24, 2016","11.13","11.20","11.28","11.05","1.14M","-1.42%"
"Nov 25, 2016","11.01","10.89","11.09","10.84","1.73M","-1.08%"
"Nov 28, 2016","11.00","10.96","11.12","10.86","3.05M","-0.09%"
"Nov 29, 2016","10.24","10.97","11.00","10.24","7.57M","-6.91%"
"Nov 30, 2016","10.66","10.42","10.76","10.33","6.74M","4.10%"
"Dec 01, 2016","9.99","10.57","10.57","9.81","6.41M","-6.29%"
"Dec 02, 2016","10.08","9.80","10.26","9.69","4.58M","0.90%"
"Dec 05, 2016","9.84","10.04","10.11","9.70","5.53M","-2.38%"
"Dec 06, 2016","10.61","10.24","10.66","10.19","12.95M","7.83%"
"Dec 07, 2016","10.98","10.62","11.07","10.53","6.47M","3.49%"
"Dec 08, 2016","10.89","11.07","11.07","10.68","3.21M","-0.82%"
"Dec 09, 2016","10.76","10.94","11.09","10.58","4.64M","-1.19%"
"Dec 12, 2016","10.42","10.59","10.59","10.24","1.56M","-3.16%"
"Dec 13, 2016","10.67","10.30","10.67","10.11","3.57M","2.40%"
"Dec 14, 2016","10.46","10.69","10.71","10.37","3.82M","-1.97%"
"Dec 15, 2016","10.21","10.35","10.38","9.99","3.76M","-2.39%"
"Dec 16, 2016","10.15","10.30","10.43","10.15","3.03M","-0.59%"
"Dec 19, 2016","10.20","10.15","10.36","10.11","2.44M","0.49%"
"Dec 20, 2016","10.23","10.26","10.28","10.15","3.11M","0.29%"
"Dec 21, 2016","10.44","10.22","10.49","10.22","1.72M","2.05%"
"Dec 22, 2016","10.40","10.32","10.50","10.22","3.38M","-0.38%"
"Dec 23, 2016","10.68","10.52","10.85","10.36","1.58M","2.69%"
"Dec 26, 2016","10.52","10.66","10.72","10.39","1.18M","-1.50%"
"Dec 27, 2016","10.48","10.58","10.60","10.31","1.87M","-0.38%"
"Dec 28, 2016","10.25","10.43","10.55","10.21","3.81M","-2.19%"
"Dec 29, 2016","10.59","10.26","10.59","10.16","3.38M","3.32%"
"Jan 02, 2017","10.81","10.49","10.86","10.44","1.74M","2.08%"
"Jan 03, 2017","11.27","10.91","11.28","10.82","3.69M","4.26%"
"Jan 04, 2017","11.45","11.16","11.49","11.09","3.57M","1.60%"
"Jan 05, 2017","11.28","11.55","11.55","11.18","2.86M","-1.48%"
"Jan 06, 2017","11.27","11.28","11.28","11.10","1.84M","-0.09%"
"Jan 09, 2017","11.41","11.33","11.78","11.20","4.64M","1.24%"
"Jan 10, 2017","11.31","11.50","11.53","11.27","6.76M","-0.88%"
"Jan 11, 2017","11.26","11.29","11.40","11.03","3.15M","-0.44%"
"Jan 12, 2017","12.07","11.68","12.17","11.64","11.28M","7.19%"
"Jan 13, 2017","11.83","12.01","12.06","11.67","5.07M","-1.99%"
"Jan 16, 2017","11.76","11.85","11.91","11.68","1.99M","-0.59%"
"Jan 17, 2017","11.68","11.73","11.81","11.59","4.65M","-0.68%"
"Jan 18, 2017","11.38","11.73","11.75","11.28","4.74M","-2.57%"
"Jan 19, 2017","11.45","11.43","11.55","11.17","4.63M","0.62%"
"Jan 20, 2017","11.41","11.53","11.56","11.23","4.73M","-0.35%"
"Jan 23, 2017","11.30","11.41","11.51","11.23","7.62M","-0.96%"
"Jan 24, 2017","11.64","11.28","11.85","11.23","7.36M","3.01%"
"Jan 26, 2017","11.90","11.70","12.12","11.70","7.52M","2.23%"
"Jan 27, 2017","11.76","11.92","11.94","11.64","2.77M","-1.18%"
"Jan 30, 2017","11.38","11.66","11.67","11.30","2.52M","-3.23%"
"Jan 31, 2017","11.41","11.28","11.60","11.19","2.97M","0.26%"
"Feb 01, 2017","11.72","11.55","11.73","11.46","4.16M","2.72%"
"Feb 02, 2017","12.08","11.71","12.11","11.51","4.61M","3.07%"
"Feb 03, 2017","11.84","12.04","12.07","11.57","7.57M","-1.99%"
"Feb 06, 2017","11.38","11.90","11.90","11.38","5.54M","-3.89%"
"Feb 07, 2017","11.68","11.47","11.71","11.32","3.66M","2.64%"
"Feb 08, 2017","12.15","11.73","12.20","11.66","5.23M","4.02%"
"Feb 09, 2017","11.95","12.10","12.28","11.90","4.75M","-1.65%"
"Feb 10, 2017","12.04","12.02","12.11","11.96","3.53M","0.75%"
"Feb 13, 2017","12.04","12.02","12.18","12.02","3.56M","0.00%"
"Feb 14, 2017","12.54","12.15","12.61","12.05","5.78M","4.15%"
"Feb 15, 2017","12.61","12.62","12.69","12.47","3.69M","0.56%"
"Feb 16, 2017","12.31","12.59","12.63","12.24","4.39M","-2.38%"
"Feb 17, 2017","12.03","12.20","12.40","11.93","3.68M","-2.27%"
"Feb 20, 2017","12.15","12.15","12.24","12.04","2.05M","1.00%"
"Feb 21, 2017","12.23","12.09","12.27","12.09","2.33M","0.66%"
"Feb 22, 2017","12.13","12.25","12.35","11.99","3.02M","-0.82%"
"Feb 23, 2017","12.23","12.13","12.42","12.13","4.51M","0.82%"
"Feb 24, 2017","11.93","12.10","12.16","11.78","3.31M","-2.45%"
"Mar 01, 2017","11.87","11.91","12.02","11.73","1.98M","-0.50%"
"Mar 02, 2017","11.68","11.80","11.90","11.58","4.00M","-1.60%"
"Mar 03, 2017","12.01","11.70","12.01","11.70","3.16M","2.83%"
"Mar 06, 2017","12.07","11.98","12.22","11.96","3.67M","0.50%"
"Mar 07, 2017","12.07","12.22","12.24","12.06","4.50M","0.00%"
"Mar 08, 2017","11.98","12.04","12.09","11.85","2.85M","-0.75%"
"Mar 09, 2017","11.83","12.04","12.04","11.67","2.65M","-1.25%"
"Mar 10, 2017","12.46","11.97","12.46","11.83","4.44M","5.33%"
"Mar 13, 2017","12.46","12.54","12.67","12.35","4.40M","0.00%"
"Mar 14, 2017","12.61","12.43","12.79","12.35","4.59M","1.20%"
"Mar 15, 2017","12.93","12.70","13.03","12.59","4.50M","2.54%"
"Mar 16, 2017","13.48","13.02","13.60","12.96","7.15M","4.25%"
"Mar 17, 2017","13.21","13.45","13.73","12.95","6.33M","-2.00%"
"Mar 20, 2017","13.50","13.18","13.50","13.11","3.14M","2.20%"
"Mar 21, 2017","13.13","13.45","13.51","13.00","4.94M","-2.74%"
"Mar 22, 2017","13.13","12.96","13.28","12.87","5.16M","0.00%"
"Mar 23, 2017","13.02","12.99","13.20","12.94","5.35M","-0.84%"
"Mar 24, 2017","13.02","13.00","13.15","12.98","4.13M","0.00%"
"Mar 27, 2017","13.05","12.90","13.08","12.89","2.57M","0.23%"
"Mar 28, 2017","13.02","12.96","13.17","12.93","4.43M","-0.23%"
"Mar 29, 2017","13.02","13.02","13.05","12.94","2.83M","0.00%"
"Mar 30, 2017","12.94","13.08","13.09","12.89","2.29M","-0.61%"
"Mar 31, 2017","12.92","12.81","13.05","12.80","5.76M","-0.15%"
"Apr 03, 2017","13.02","12.88","13.07","12.86","4.16M","0.77%"
"Apr 04, 2017","13.33","13.02","13.33","12.91","15.20M","2.38%"
"Apr 05, 2017","13.46","13.33","13.77","13.21","4.99M","0.98%"
"Apr 06, 2017","13.32","13.33","13.51","13.22","2.77M","-1.04%"
"Apr 07, 2017","13.45","13.37","13.65","13.24","3.66M","0.98%"
"Apr 10, 2017","13.33","13.46","13.77","13.33","3.26M","-0.89%"
"Apr 11, 2017","13.41","13.41","13.45","13.02","3.54M","0.60%"
"Apr 12, 2017","13.55","13.48","13.59","13.24","3.59M","1.04%"
"Apr 13, 2017","13.52","13.52","13.58","13.41","4.08M","-0.22%"
"Apr 17, 2017","13.92","13.52","13.99","13.50","3.07M","2.96%"
"Apr 18, 2017","13.62","13.88","13.90","13.58","3.45M","-2.16%"
"Apr 19, 2017","13.58","13.58","13.68","13.47","4.55M","-0.29%"
"Apr 20, 2017","13.61","13.54","13.75","13.44","2.23M","0.22%"
"Apr 24, 2017","13.77","13.64","13.85","13.64","2.13M","1.18%"
"Apr 25, 2017","13.64","13.64","13.72","13.52","2.88M","-0.94%"
"Apr 26, 2017","13.64","13.58","13.69","13.36","3.34M","0.00%"
"Apr 27, 2017","14.20","13.80","14.22","13.76","4.17M","4.11%"
"Apr 28, 2017","14.66","14.18","14.79","14.14","5.91M","3.24%"
"May 02, 2017","14.76","14.52","14.76","14.47","5.30M","0.68%"
"May 03, 2017","14.97","14.75","15.05","14.65","4.18M","1.42%"
"May 04, 2017","14.65","14.83","14.99","14.40","7.02M","-2.14%"
"May 05, 2017","14.88","14.58","14.94","14.58","2.80M","1.57%"
"May 08, 2017","15.13","14.79","15.13","14.79","2.29M","1.68%"
"May 09, 2017","15.17","15.13","15.23","15.08","3.89M","0.26%"
"May 10, 2017","15.77","15.17","15.77","15.08","3.19M","3.96%"
"May 11, 2017","15.53","15.77","15.77","15.53","3.56M","-1.52%"
"May 12, 2017","15.59","15.75","15.75","15.35","4.22M","0.39%"
"May 15, 2017","15.53","15.65","15.67","15.36","3.72M","-0.38%"
"May 16, 2017","15.55","15.53","15.64","15.27","4.21M","0.13%"
"May 17, 2017","15.20","15.40","15.46","15.01","3.32M","-2.25%"
"May 18, 2017","14.13","12.92","14.13","12.76","10.94M","-7.04%"
"May 19, 2017","13.99","14.06","14.56","13.96","7.92M","-0.99%"
"May 22, 2017","13.41","13.78","13.86","12.89","6.17M","-4.15%"
"May 23, 2017","13.80","13.60","13.93","13.44","4.38M","2.91%"
"May 24, 2017","14.27","14.00","14.49","13.71","10.58M","3.41%"
"May 25, 2017","14.12","14.26","14.40","14.00","4.47M","-1.05%"
"May 26, 2017","14.27","14.29","14.48","14.12","3.48M","1.06%"
"May 29, 2017","14.34","14.29","14.40","13.90","1.88M","0.49%"
"May 30, 2017","14.13","14.34","14.34","14.12","2.23M","-1.46%"
"May 31, 2017","14.15","14.25","14.25","13.76","5.38M","0.14%"
"Jun 01, 2017","14.31","14.23","14.64","14.08","4.93M","1.13%"
"Jun 02, 2017","14.38","14.32","14.68","14.32","2.55M","0.49%"
"Jun 05, 2017","14.12","14.33","14.38","14.12","2.78M","-1.81%"
"Jun 06, 2017","14.19","14.05","14.36","13.89","2.31M","0.50%"
"Jun 07, 2017","14.51","14.36","14.51","14.19","3.39M","2.26%"
"Jun 08, 2017","14.28","14.39","14.46","14.08","2.99M","-1.59%"
"Jun 09, 2017","14.37","14.28","14.38","14.02","2.96M","0.63%"
"Jun 12, 2017","14.17","14.26","14.36","13.99","3.47M","-1.39%"
"Jun 13, 2017","14.12","14.05","14.25","13.93","3.96M","-0.35%"
"Jun 14, 2017","13.99","14.26","14.34","13.91","5.49M","-0.92%"
"Jun 16, 2017","14.06","13.87","14.15","13.87","7.67M","0.50%"
"Jun 19, 2017","14.39","14.00","14.41","13.96","2.49M","2.35%"
"Jun 20, 2017","14.17","14.28","14.49","14.03","6.50M","-1.53%"
"Jun 21, 2017","13.82","14.14","14.18","13.77","3.91M","-2.47%"
"Jun 22, 2017","14.03","13.89","14.17","13.66","4.09M","1.52%"
"Jun 23, 2017","14.30","14.03","14.37","13.96","3.26M","1.92%"
"Jun 26, 2017","14.54","14.44","14.55","14.32","3.12M","1.68%"
"Jun 27, 2017","14.23","14.52","14.52","14.06","5.04M","-2.13%"
"Jun 28, 2017","14.32","14.19","14.35","14.09","1.40M","0.63%"
"Jun 29, 2017","14.40","14.39","14.45","14.07","2.96M","0.56%"
"Jun 30, 2017","14.70","14.38","14.88","14.37","4.47M","2.08%"
"Jul 03, 2017","14.88","14.77","14.99","14.57","3.09M","1.22%"
"Jul 04, 2017","14.79","14.86","14.96","14.72","1.15M","-0.60%"
"Jul 05, 2017","14.88","14.80","14.95","14.51","2.52M","0.61%"
"Jul 06, 2017","14.78","14.78","14.93","14.61","4.00M","-0.67%"
"Jul 07, 2017","14.91","14.92","14.98","14.81","2.53M","0.88%"
"Jul 10, 2017","14.99","14.85","15.19","14.85","3.85M","0.54%"
"Jul 11, 2017","15.30","14.94","15.30","14.94","3.04M","2.07%"
"Jul 12, 2017","15.56","15.36","15.74","15.25","6.96M","1.70%"
"Jul 13, 2017","16.18","15.65","16.24","15.60","4.58M","3.98%"
"Jul 14, 2017","16.07","16.26","16.38","15.97","2.11M","-0.68%"
"Jul 17, 2017","15.93","16.07","16.22","15.76","2.86M","-0.87%"
"Jul 18, 2017","16.08","16.01","16.08","15.77","3.14M","0.94%"
"Jul 19, 2017","16.01","16.12","16.18","15.95","2.85M","-0.44%"
"Jul 20, 2017","16.12","16.08","16.16","15.91","2.33M","0.69%"
"Jul 21, 2017","16.83","16.59","16.99","16.47","7.75M","4.40%"
"Jul 24, 2017","16.98","17.13","17.14","16.90","4.57M","0.89%"
"Jul 25, 2017","16.83","17.04","17.12","16.83","2.90M","-0.88%"
"Jul 26, 2017","16.89","16.87","17.04","16.73","2.93M","0.36%"
"Jul 27, 2017","16.99","16.97","17.14","16.82","1.96M","0.59%"
"Jul 28, 2017","16.95","16.91","17.11","16.80","2.52M","-0.24%"
"Jul 31, 2017","16.96","16.94","17.01","16.81","2.06M","0.06%"
"Aug 01, 2017","17.04","16.99","17.07","16.83","4.39M","0.47%"
"Aug 02, 2017","17.26","16.98","17.26","16.95","2.31M","1.29%"
"Aug 03, 2017","16.85","17.21","17.24","16.70","3.36M","-2.38%"
"Aug 04, 2017","16.70","16.98","16.98","16.59","2.80M","-0.89%"
"Aug 07, 2017","16.77","16.85","16.91","16.57","2.89M","0.42%"
"Aug 08, 2017","16.78","16.77","17.01","16.71","1.89M","0.06%"
"Aug 09, 2017","17.32","16.64","17.38","16.60","6.42M","3.22%"
"Aug 10, 2017","16.93","17.35","17.48","16.90","2.89M","-2.25%"
"Aug 11, 2017","16.99","16.93","17.17","16.81","2.61M","0.35%"
"Aug 14, 2017","16.97","16.93","17.24","16.87","2.76M","-0.12%"
"Aug 15, 2017","17.08","17.02","17.19","16.99","1.36M","0.65%"
"Aug 16, 2017","17.51","17.08","17.71","16.89","4.20M","2.52%"
"Aug 17, 2017","17.50","17.52","17.52","17.18","2.42M","-0.06%"
"Aug 18, 2017","18.02","17.52","18.02","17.48","4.04M","2.97%"
"Aug 21, 2017","18.04","18.07","18.15","17.72","4.05M","0.11%"
"Aug 22, 2017","18.63","18.14","18.65","18.14","5.21M","3.27%"
"Aug 23, 2017","18.63","18.72","18.72","18.47","2.61M","0.00%"
"Aug 24, 2017","19.10","18.63","19.10","18.63","3.89M","2.52%"
"Aug 25, 2017","19.26","19.09","19.31","18.90","4.32M","0.84%"
"Aug 28, 2017","19.48","19.25","19.73","19.21","4.96M","1.14%"
"Aug 29, 2017","19.59","19.34","19.79","19.33","4.11M","0.56%"
"Aug 30, 2017","19.37","19.57","19.70","19.19","2.45M","-1.12%"
"Aug 31, 2017","19.46","19.53","19.55","19.27","3.91M","0.46%"
"Sep 01, 2017","19.66","19.71","19.74","19.39","2.82M","1.03%"
"Sep 04, 2017","20.00","19.64","20.07","19.53","1.40M","1.73%"
"Sep 05, 2017","20.21","20.26","20.26","20.02","2.85M","1.05%"
"Sep 06, 2017","20.26","20.26","20.75","20.20","4.14M","0.25%"
"Sep 08, 2017","20.67","20.23","20.82","19.93","3.76M","2.02%"
"Sep 11, 2017","20.85","20.68","21.09","20.68","2.06M","0.87%"
"Sep 12, 2017","20.82","20.91","21.24","20.61","1.67M","-0.14%"
"Sep 13, 2017","20.15","20.85","20.85","19.91","5.31M","-3.22%"
"Sep 14, 2017","20.05","20.18","20.21","19.98","2.95M","-0.50%"
"Sep 15, 2017","20.16","20.15","20.35","20.10","9.38M","0.55%"
"Sep 18, 2017","19.95","20.11","20.23","19.95","7.06M","-1.04%"
"Sep 19, 2017","20.33","19.94","20.40","19.94","2.07M","1.90%"
"Sep 20, 2017","19.97","20.38","20.44","19.79","3.13M","-1.77%"
"Sep 21, 2017","20.17","20.01","20.56","19.94","4.18M","1.00%"
"Sep 22, 2017","19.93","20.07","20.15","19.70","11.10M","-1.19%"
"Sep 25, 2017","19.81","20.00","20.21","19.60","2.96M","-0.60%"
"Sep 26, 2017","19.54","19.88","19.94","19.53","4.57M","-1.36%"
"Sep 27, 2017","19.28","19.51","19.67","19.09","3.80M","-1.33%"
"Sep 28, 2017","18.92","19.09","19.49","18.76","11.29M","-1.87%"
"Sep 29, 2017","18.82","19.07","19.09","18.80","6.01M","-0.53%"
"Oct 02, 2017","19.03","18.90","19.24","18.23","9.12M","1.12%"
"Oct 03, 2017","19.57","19.25","19.78","19.16","10.12M","2.84%"
"Oct 04, 2017","19.72","19.77","19.83","19.57","3.31M","0.77%"
"Oct 05, 2017","19.25","19.86","19.94","19.25","7.95M","-2.38%"
"Oct 06, 2017","19.18","19.24","19.24","18.87","3.62M","-0.36%"
"Oct 09, 2017","19.31","19.24","19.43","18.87","3.43M","0.68%"
"Oct 10, 2017","19.32","19.55","19.60","19.16","5.05M","0.05%"
"Oct 11, 2017","18.92","19.33","19.35","18.71","4.11M","-2.07%"
"Oct 13, 2017","18.86","18.98","19.17","18.73","4.89M","-0.32%"
"Oct 16, 2017","19.00","18.86","19.06","18.55","4.81M","0.74%"
"Oct 17, 2017","18.56","19.03","19.07","18.36","5.58M","-2.32%"
"Oct 18, 2017","19.07","18.59","19.24","18.52","3.88M","2.75%"
"Oct 19, 2017","19.33","19.08","19.56","18.71","3.38M","1.36%"
"Oct 20, 2017","19.24","19.40","19.49","19.03","7.08M","-0.47%"
"Oct 23, 2017","19.24","19.30","19.36","18.88","3.35M","0.00%"
"Oct 24, 2017","19.37","19.32","19.37","19.12","1.67M","0.68%"
"Oct 25, 2017","19.32","19.53","19.67","18.86","3.09M","-0.26%"
"Oct 26, 2017","18.87","19.39","19.47","18.77","2.95M","-2.33%"
"Oct 27, 2017","19.24","18.85","19.27","18.76","3.87M","1.96%"
"Oct 30, 2017","18.92","19.32","19.32","18.55","3.64M","-1.66%"
"Oct 31, 2017","18.87","18.98","18.98","18.58","3.10M","-0.26%"
"Nov 01, 2017","18.81","19.08","19.13","18.72","2.91M","-0.32%"
"Nov 03, 2017","18.75","18.81","18.94","17.97","5.81M","-0.32%"
"Nov 06, 2017","18.64","18.49","18.69","18.41","4.63M","-0.59%"
"Nov 07, 2017","19.64","19.34","19.92","19.28","14.78M","5.36%"
"Nov 08, 2017","19.93","19.57","20.06","19.50","4.22M","1.48%"
"Nov 09, 2017","19.84","19.93","20.04","19.47","3.75M","-0.45%"
"Nov 10, 2017","19.91","19.84","19.93","19.57","5.45M","0.35%"
"Nov 13, 2017","19.44","20.09","20.15","19.19","9.24M","-2.36%"
"Nov 14, 2017","19.29","19.48","19.48","19.17","3.76M","-0.77%"
"Nov 16, 2017","19.93","19.15","20.13","19.10","4.18M","3.32%"
"Nov 17, 2017","20.47","19.74","20.47","19.74","2.52M","2.71%"
"Nov 21, 2017","20.55","20.47","20.55","20.16","2.50M","0.39%"
"Nov 22, 2017","20.41","20.38","20.49","20.21","2.27M","-0.68%"
"Nov 23, 2017","20.39","20.62","20.68","20.18","2.23M","-0.10%"
"Nov 24, 2017","20.42","20.53","20.53","19.72","2.72M","0.15%"
"Nov 27, 2017","20.35","20.41","20.41","19.83","1.58M","-0.34%"
"Nov 28, 2017","20.56","20.46","20.69","20.23","1.68M","1.03%"
"Nov 29, 2017","20.25","20.55","20.77","20.07","2.30M","-1.51%"
"Nov 30, 2017","19.60","20.25","20.31","19.42","5.08M","-3.21%"
"Dec 01, 2017","20.10","19.57","20.25","19.57","1.74M","2.55%"
"Dec 04, 2017","20.23","20.15","20.44","19.96","2.16M","0.65%"
"Dec 05, 2017","20.06","20.37","20.68","19.77","2.01M","-0.84%"
"Dec 06, 2017","20.71","19.85","20.92","19.76","2.84M","3.24%"
"Dec 07, 2017","20.55","20.54","20.71","20.00","2.35M","-0.77%"
"Dec 08, 2017","20.69","20.83","20.96","20.59","1.62M","0.68%"
"Dec 11, 2017","20.69","20.75","20.93","20.45","2.60M","0.00%"
"Dec 12, 2017","20.58","20.68","20.68","20.16","2.51M","-0.53%"
"Dec 13, 2017","20.38","20.82","20.94","20.11","5.73M","-0.97%"
"Dec 14, 2017","20.48","20.38","20.63","20.01","2.11M","0.49%"
"Dec 15, 2017","20.73","20.32","21.01","20.24","3.94M","1.22%"
"Dec 18, 2017","20.93","20.92","21.00","20.73","2.72M","0.96%"
"Dec 19, 2017","20.68","20.94","20.94","20.50","1.82M","-1.19%"
"Dec 20, 2017","20.89","20.69","21.01","20.64","3.10M","1.02%"
"Dec 21, 2017","21.20","20.78","21.21","20.56","2.04M","1.48%"
"Dec 22, 2017","21.00","21.06","21.39","20.92","1.03M","-0.94%"
"Dec 26, 2017","21.18","21.03","21.19","20.90","1.22M","0.86%"
"Dec 27, 2017","21.92","21.21","21.96","21.21","1.39M","3.49%"
"Dec 28, 2017","21.65","21.93","21.95","21.45","2.85M","-1.23%"
"Jan 02, 2018","22.34","21.93","22.55","21.70","2.14M","3.19%"
"Jan 03, 2018","22.64","22.61","22.92","22.29","2.27M","1.34%"
"Jan 04, 2018","22.97","22.72","23.05","22.49","1.98M","1.46%"
"Jan 05, 2018","22.63","22.96","22.96","22.13","1.80M","-1.48%"
"Jan 08, 2018","22.53","22.63","22.68","22.30","1.30M","-0.44%"
"Jan 09, 2018","22.34","22.53","22.54","22.08","1.68M","-0.84%"
"Jan 10, 2018","22.29","22.10","22.43","21.91","1.36M","-0.22%"
"Jan 11, 2018","22.77","22.51","22.77","22.14","1.55M","2.15%"
"Jan 12, 2018","22.36","22.67","22.69","22.22","1.64M","-1.80%"
"Jan 15, 2018","23.07","22.43","23.07","22.43","1.11M","3.18%"
"Jan 16, 2018","23.51","23.09","23.51","22.82","1.83M","1.91%"
"Jan 17, 2018","24.14","23.35","24.14","23.24","1.91M","2.68%"
"Jan 18, 2018","23.90","24.12","24.12","23.48","3.35M","-0.99%"
"Jan 19, 2018","23.55","24.02","24.02","23.34","1.91M","-1.46%"
"Jan 22, 2018","23.09","23.56","23.61","22.64","3.24M","-1.95%"
"Jan 23, 2018","22.52","23.13","23.23","22.21","2.20M","-2.47%"
"Jan 24, 2018","23.72","22.74","23.85","22.63","4.15M","5.33%"
"Jan 26, 2018","24.59","24.04","24.62","23.80","5.29M","3.67%"
"Jan 29, 2018","24.68","24.24","24.74","24.07","2.03M","0.37%"
"Jan 30, 2018","24.34","24.54","24.75","24.13","2.89M","-1.38%"
"Jan 31, 2018","25.30","24.68","25.66","24.48","5.03M","3.94%"
"Feb 01, 2018","25.00","25.35","25.58","24.83","6.33M","-1.19%"
"Feb 02, 2018","24.93","24.56","25.10","24.44","3.83M","-0.28%"
"Feb 05, 2018","24.54","24.82","24.86","24.46","1.60M","-1.56%"
"Feb 06, 2018","24.23","24.05","24.45","23.69","4.91M","-1.26%"
"Feb 07, 2018","24.32","24.29","24.63","23.81","2.82M","0.37%"
"Feb 08, 2018","24.01","24.34","24.67","23.70","2.34M","-1.27%"
"Feb 09, 2018","23.45","23.86","24.01","23.09","5.43M","-2.33%"
"Feb 14, 2018","24.53","23.69","24.59","23.68","2.74M","4.61%"
"Feb 15, 2018","24.19","24.54","24.79","24.13","2.21M","-1.39%"
"Feb 16, 2018","24.29","24.24","24.41","23.69","3.19M","0.41%"
"Feb 19, 2018","23.20","23.17","23.21","22.90","903.84K","-4.50%"
"Feb 20, 2018","23.62","23.20","23.62","22.89","3.05M","1.81%"
"Feb 21, 2018","23.50","23.60","23.73","23.23","3.99M","-0.51%"
"Feb 22, 2018","23.99","23.46","24.04","23.41","5.71M","2.10%"
"Feb 23, 2018","24.37","24.10","24.37","23.70","3.51M","1.59%"
"Feb 26, 2018","24.29","24.57","24.60","24.03","4.27M","-0.34%"
"Feb 27, 2018","24.17","24.38","24.38","23.76","3.09M","-0.46%"
"Feb 28, 2018","24.14","24.20","24.24","23.75","3.49M","-0.15%"
"Mar 01, 2018","23.91","23.92","24.47","23.57","2.69M","-0.93%"
"Mar 02, 2018","24.07","23.63","24.07","23.37","2.43M","0.66%"
"Mar 05, 2018","24.22","24.18","24.22","23.87","1.76M","0.62%"
"Mar 06, 2018","24.61","24.34","24.65","24.05","3.45M","1.61%"
"Mar 07, 2018","24.43","24.61","24.80","24.22","7.14M","-0.76%"
"Mar 08, 2018","25.73","25.22","26.34","25.22","13.94M","5.33%"
"Mar 09, 2018","27.36","25.88","27.36","25.77","5.75M","6.33%"
"Mar 12, 2018","27.64","27.46","27.92","27.22","3.79M","1.02%"
"Mar 13, 2018","26.80","27.73","28.00","26.68","7.54M","-3.03%"
"Mar 14, 2018","26.39","27.11","27.15","26.01","3.28M","-1.53%"
"Mar 15, 2018","26.14","26.17","26.44","25.88","3.52M","-0.95%"
"Mar 16, 2018","25.77","25.90","26.27","25.39","3.94M","-1.39%"
"Mar 19, 2018","25.58","25.45","26.03","25.31","2.08M","-0.76%"
"Mar 20, 2018","25.26","25.69","25.80","25.23","7.88M","-1.24%"
"Mar 21, 2018","25.97","25.27","25.97","25.01","8.46M","2.80%"
"Mar 22, 2018","26.24","26.20","26.24","25.69","4.21M","1.04%"
"Mar 23, 2018","25.87","26.13","26.44","25.50","3.43M","-1.42%"
"Mar 26, 2018","26.43","26.27","26.43","25.67","2.82M","2.16%"
"Mar 27, 2018","26.05","26.52","26.52","25.87","2.82M","-1.41%"
"Mar 28, 2018","26.16","26.01","26.27","25.64","2.64M","0.39%"
"Mar 29, 2018","26.78","26.11","26.78","26.03","4.67M","2.40%"
"Apr 02, 2018","26.39","26.78","26.95","26.13","2.91M","-1.46%"
"Apr 03, 2018","26.86","26.39","26.95","26.06","5.69M","1.77%"
"Apr 04, 2018","27.42","26.33","27.60","26.25","4.18M","2.08%"
"Apr 05, 2018","27.09","27.89","27.93","26.92","11.53M","-1.19%"
"Apr 06, 2018","27.05","27.12","27.23","26.49","2.83M","-0.14%"
"Apr 09, 2018","26.86","27.05","27.22","26.54","2.54M","-0.72%"
"Apr 10, 2018","27.60","26.83","27.60","26.73","5.53M","2.74%"
"Apr 11, 2018","27.45","27.56","27.56","27.05","3.12M","-0.54%"
"Apr 12, 2018","27.54","27.50","27.75","27.09","2.80M","0.34%"
"Apr 13, 2018","27.50","27.37","27.73","27.12","2.57M","-0.14%"
"Apr 16, 2018","27.05","27.33","27.72","26.78","4.10M","-1.66%"
"Apr 17, 2018","27.07","26.97","27.15","26.73","2.86M","0.10%"
"Apr 18, 2018","27.69","27.22","27.69","27.09","3.88M","2.27%"
"Apr 19, 2018","27.72","27.39","27.87","27.35","3.51M","0.10%"
"Apr 20, 2018","27.31","27.42","27.67","27.11","2.51M","-1.48%"
"Apr 23, 2018","27.05","27.05","27.50","26.88","1.93M","-0.96%"
"Apr 24, 2018","26.81","27.16","27.42","26.56","5.34M","-0.86%"
"Apr 25, 2018","27.70","26.58","27.71","26.32","4.73M","3.30%"
"Apr 26, 2018","27.52","27.93","27.94","26.97","6.13M","-0.64%"
"Apr 27, 2018","26.21","27.68","27.70","25.88","11.12M","-4.78%"
"Apr 30, 2018","26.01","26.43","26.56","25.43","4.09M","-0.75%"
"May 02, 2018","25.16","25.74","25.81","24.55","8.85M","-3.26%"
"May 03, 2018","24.79","25.34","25.55","24.51","9.36M","-1.48%"
"May 04, 2018","24.74","24.58","25.04","24.41","5.76M","-0.19%"
"May 07, 2018","24.15","24.58","24.95","24.11","2.23M","-2.41%"
"May 08, 2018","24.56","23.81","24.62","23.14","8.78M","1.74%"
"May 09, 2018","25.04","24.66","25.21","24.23","5.92M","1.94%"
"May 10, 2018","25.12","25.53","25.56","24.99","5.53M","0.34%"
"May 11, 2018","24.24","24.96","25.06","23.95","5.36M","-3.53%"
"May 14, 2018","23.48","24.40","24.71","22.95","5.61M","-3.12%"
"May 15, 2018","24.01","22.87","24.08","22.29","6.67M","2.26%"
"May 16, 2018","24.38","24.01","24.69","23.79","5.41M","1.51%"
"May 17, 2018","23.14","23.97","24.30","23.01","5.35M","-5.09%"
"May 18, 2018","23.45","22.40","23.45","21.80","8.64M","1.33%"
"May 21, 2018","23.43","23.33","23.56","23.14","4.30M","-0.08%"
"May 22, 2018","24.75","23.78","25.04","23.54","5.46M","5.65%"
"May 23, 2018","24.26","24.39","24.42","24.07","2.66M","-2.00%"
"May 24, 2018","23.87","23.80","24.01","23.29","4.09M","-1.58%"
"May 25, 2018","23.11","23.98","24.18","23.11","3.43M","-3.20%"
"May 28, 2018","22.24","22.57","22.90","22.01","4.22M","-3.75%"
"May 29, 2018","22.76","22.38","23.11","22.38","4.82M","2.35%"
"May 30, 2018","23.06","22.56","23.37","22.35","6.84M","1.31%"
"Jun 01, 2018","24.24","23.46","24.54","22.63","4.13M","5.10%"
"Jun 04, 2018","24.68","24.60","24.93","24.39","3.45M","1.81%"
"Jun 05, 2018","23.18","24.56","24.71","23.06","5.26M","-6.05%"
"Jun 06, 2018","22.38","23.18","23.31","21.95","5.59M","-3.46%"
"Jun 07, 2018","21.73","21.57","21.79","19.45","16.15M","-2.92%"
"Jun 08, 2018","22.38","21.75","22.83","20.94","7.74M","3.00%"
"Jun 11, 2018","21.55","22.38","22.62","21.33","5.63M","-3.71%"
"Jun 12, 2018","21.86","21.38","22.33","21.14","6.18M","1.43%"
"Jun 13, 2018","22.29","21.94","22.74","21.88","6.37M","1.96%"
"Jun 14, 2018","21.71","22.44","22.57","21.64","4.87M","-2.59%"
"Jun 15, 2018","21.11","21.48","21.73","20.62","5.69M","-2.75%"
"Jun 18, 2018","20.97","20.91","21.06","20.31","5.46M","-0.71%"
"Jun 19, 2018","22.32","20.70","22.63","20.61","4.86M","6.45%"
"Jun 20, 2018","21.64","21.79","22.58","21.23","7.13M","-3.05%"
"Jun 21, 2018","20.70","21.28","21.72","20.70","2.74M","-4.31%"
"Jun 22, 2018","21.28","20.99","21.80","20.99","5.29M","2.79%"
"Jun 25, 2018","21.55","21.61","21.82","21.30","3.06M","1.27%"
"Jun 26, 2018","22.58","21.57","22.75","21.36","6.85M","4.76%"
"Jun 27, 2018","21.62","22.38","22.48","21.31","5.86M","-4.25%"
"Jun 28, 2018","22.09","21.62","22.09","21.18","3.92M","2.20%"
"Jun 29, 2018","22.19","22.19","22.42","22.04","4.65M","0.44%"
"Jul 02, 2018","21.62","22.08","22.08","21.29","2.98M","-2.57%"
"Jul 03, 2018","21.93","21.75","22.34","21.70","4.01M","1.43%"
"Jul 04, 2018","22.02","21.84","22.15","21.83","1.32M","0.43%"
"Jul 05, 2018","21.70","22.45","22.83","21.47","4.41M","-1.49%"
"Jul 06, 2018","21.34","21.46","21.73","20.96","3.47M","-1.64%"
"Jul 10, 2018","21.88","21.51","22.04","21.39","3.32M","2.54%"
"Jul 11, 2018","21.01","21.43","21.69","20.99","5.54M","-3.97%"
"Jul 12, 2018","21.40","21.22","21.65","20.90","3.65M","1.82%"
"Jul 13, 2018","22.19","21.39","22.43","21.31","5.05M","3.72%"
"Jul 16, 2018","21.87","22.36","22.55","21.85","2.64M","-1.43%"
"Jul 17, 2018","22.86","22.03","22.99","21.85","3.11M","4.49%"
"Jul 18, 2018","23.10","22.86","23.24","22.53","3.73M","1.06%"
"Jul 19, 2018","22.96","22.91","22.96","22.04","5.72M","-0.61%"
"Jul 20, 2018","23.66","23.73","23.94","23.38","6.46M","3.05%"
"Jul 23, 2018","23.05","23.43","23.57","22.91","3.26M","-2.57%"
"Jul 24, 2018","23.92","23.25","23.97","23.24","4.54M","3.77%"
"Jul 25, 2018","23.99","23.96","24.28","23.87","4.69M","0.27%"
"Jul 26, 2018","23.78","23.93","24.16","23.51","3.45M","-0.86%"
"Jul 27, 2018","23.21","23.82","23.84","22.71","6.61M","-2.40%"
"Jul 30, 2018","23.35","23.28","23.57","23.00","2.28M","0.60%"
"Jul 31, 2018","22.21","23.38","23.49","21.62","6.05M","-4.89%"
"Aug 01, 2018","22.40","22.25","22.67","21.99","3.93M","0.84%"
"Aug 02, 2018","22.18","22.21","22.31","21.79","2.29M","-0.96%"
"Aug 03, 2018","23.23","22.16","23.30","22.14","5.09M","4.72%"
"Aug 06, 2018","23.74","23.25","23.91","23.05","3.49M","2.21%"
"Aug 07, 2018","23.74","23.66","24.02","23.23","5.83M","0.00%"
"Aug 08, 2018","23.01","23.57","23.72","22.84","5.50M","-3.07%"
"Aug 09, 2018","22.45","22.89","23.08","22.22","4.86M","-2.44%"
"Aug 10, 2018","21.71","22.26","22.43","21.41","5.31M","-3.29%"
"Aug 13, 2018","22.01","21.51","22.10","21.42","4.83M","1.38%"
"Aug 14, 2018","22.07","22.29","22.51","21.86","2.10M","0.25%"
"Aug 15, 2018","21.30","21.79","21.86","21.20","3.70M","-3.47%"
"Aug 16, 2018","21.15","21.51","21.68","20.98","8.95M","-0.70%"
"Aug 17, 2018","20.89","20.90","21.20","20.24","5.15M","-1.24%"
"Aug 20, 2018","21.09","20.78","21.34","20.51","4.39M","0.94%"
"Aug 21, 2018","20.11","20.86","20.99","19.93","5.59M","-4.66%"
"Aug 22, 2018","21.08","20.01","21.13","19.88","6.79M","4.84%"
"Aug 23, 2018","20.09","20.88","21.33","19.90","5.59M","-4.70%"
"Aug 24, 2018","20.49","20.39","20.70","20.02","3.07M","2.00%"
"Aug 27, 2018","21.30","20.65","21.30","20.50","2.80M","3.97%"
"Aug 28, 2018","21.43","21.13","21.43","20.93","4.45M","0.61%"
"Aug 29, 2018","21.09","21.44","21.53","21.02","6.93M","-1.61%"
"Aug 30, 2018","20.04","20.85","20.93","19.98","5.28M","-4.97%"
"Aug 31, 2018","20.13","19.98","20.46","19.77","4.03M","0.47%"
"Sep 03, 2018","20.39","19.95","20.69","19.89","1.91M","1.25%"
"Sep 04, 2018","19.55","20.37","20.51","19.54","3.09M","-4.08%"
"Sep 05, 2018","20.00","19.45","20.20","19.33","4.85M","2.30%"
"Sep 06, 2018","20.46","20.29","20.67","20.01","2.83M","2.29%"
"Sep 10, 2018","20.32","20.90","20.90","20.12","2.49M","-0.69%"
"Sep 11, 2018","20.42","19.86","20.42","19.73","2.89M","0.51%"
"Sep 12, 2018","20.34","20.51","20.69","20.09","6.71M","-0.41%"
"Sep 13, 2018","19.59","20.57","20.57","19.41","6.19M","-3.68%"
"Sep 14, 2018","19.78","19.55","20.02","19.38","4.58M","0.95%"
"Sep 17, 2018","20.87","19.68","20.92","19.68","6.27M","5.53%"
"Sep 18, 2018","21.51","20.72","21.75","20.58","5.31M","3.05%"
"Sep 19, 2018","21.30","21.19","21.79","20.87","3.37M","-0.96%"
"Sep 20, 2018","21.23","21.37","21.71","20.97","2.43M","-0.35%"
"Sep 21, 2018","22.05","21.51","22.26","21.35","4.48M","3.88%"
"Sep 24, 2018","21.31","21.97","21.97","21.09","3.00M","-3.35%"
"Sep 25, 2018","21.02","20.90","21.05","20.70","8.39M","-1.36%"
"Sep 26, 2018","21.16","20.95","21.42","20.85","3.88M","0.67%"
"Sep 27, 2018","21.57","21.04","21.79","21.04","2.95M","1.90%"
"Sep 28, 2018","21.34","21.22","21.76","21.03","2.06M","-1.06%"
"Oct 01, 2018","20.50","21.36","21.65","20.49","5.53M","-3.91%"
"Oct 02, 2018","21.48","21.10","21.71","20.88","16.58M","4.76%"
"Oct 03, 2018","23.03","22.98","23.49","22.35","12.76M","7.21%"
"Oct 04, 2018","22.46","22.95","22.95","21.92","6.95M","-2.44%"
"Oct 05, 2018","22.65","22.60","22.97","22.18","4.62M","0.84%"
"Oct 08, 2018","23.75","24.39","24.55","23.53","10.06M","4.84%"
"Oct 09, 2018","23.22","23.78","23.81","22.92","7.87M","-2.21%"
"Oct 10, 2018","22.66","22.89","23.25","22.54","7.35M","-2.42%"
"Oct 11, 2018","22.60","22.81","23.31","22.32","5.83M","-0.25%"
"Oct 15, 2018","22.51","23.00","23.07","22.26","4.77M","-0.41%"
"Oct 16, 2018","23.69","22.89","23.86","22.80","5.77M","5.25%"
"Oct 17, 2018","23.96","23.45","24.22","23.37","5.20M","1.15%"
"Oct 18, 2018","23.41","24.00","24.00","23.09","5.65M","-2.31%"
"Oct 19, 2018","23.94","23.62","24.12","23.59","3.86M","2.24%"
"Oct 22, 2018","24.43","24.17","24.84","24.12","4.29M","2.08%"
"Oct 23, 2018","24.25","24.20","24.50","23.96","5.26M","-0.77%"
"Oct 24, 2018","23.68","24.38","24.68","23.59","8.10M","-2.32%"
"Oct 25, 2018","24.39","23.68","25.00","22.84","9.61M","2.97%"
"Oct 26, 2018","24.97","24.40","24.97","23.90","7.17M","2.38%"
"Oct 29, 2018","24.66","25.44","25.96","24.13","9.81M","-1.24%"
"Oct 30, 2018","26.04","25.08","26.04","24.79","7.94M","5.59%"
"Oct 31, 2018","26.97","26.07","26.97","25.51","12.05M","3.57%"
"Nov 01, 2018","27.08","27.01","27.57","26.67","6.06M","0.42%"
"Nov 05, 2018","26.73","27.08","27.27","26.47","5.34M","-1.28%"
"Nov 06, 2018","26.64","26.61","26.89","26.22","2.92M","-0.35%"
"Nov 07, 2018","25.93","26.72","26.89","25.61","5.30M","-2.64%"
"Nov 08, 2018","24.97","26.16","26.35","24.95","5.19M","-3.73%"
"Nov 09, 2018","25.29","24.97","25.51","24.58","4.05M","1.28%"
"Nov 12, 2018","25.54","25.48","25.97","25.21","3.55M","1.00%"
"Nov 13, 2018","25.15","25.70","25.87","24.85","4.18M","-1.54%"
"Nov 14, 2018","25.16","25.30","25.52","24.70","4.12M","0.07%"
"Nov 16, 2018","26.02","25.49","26.02","24.84","6.17M","3.39%"
"Nov 19, 2018","26.61","25.94","26.64","25.51","4.60M","2.27%"
"Nov 21, 2018","26.49","26.12","26.56","25.75","3.51M","-0.46%"
"Nov 22, 2018","26.10","26.23","26.47","25.97","2.28M","-1.45%"
"Nov 23, 2018","26.17","26.10","26.26","25.67","2.67M","0.25%"
"Nov 26, 2018","25.88","26.54","26.81","25.64","3.83M","-1.11%"
"Nov 27, 2018","26.26","26.08","26.92","25.77","4.90M","1.49%"
"Nov 28, 2018","26.28","26.41","26.57","25.71","7.47M","0.07%"
"Nov 29, 2018","26.09","26.01","26.44","25.79","4.74M","-0.71%"
"Nov 30, 2018","25.24","26.03","26.03","25.20","7.74M","-3.27%"
"Dec 03, 2018","24.91","25.70","25.82","24.88","6.11M","-1.30%"
"Dec 04, 2018","24.73","25.12","25.37","24.30","5.05M","-0.72%"
"Dec 05, 2018","24.85","24.91","25.16","24.65","2.01M","0.49%"
"Dec 06, 2018","25.42","24.61","25.49","24.42","4.99M","2.26%"
"Dec 07, 2018","25.39","25.53","26.06","25.18","6.46M","-0.11%"
"Dec 10, 2018","25.15","25.49","25.56","24.96","4.76M","-0.96%"
"Dec 11, 2018","25.54","25.32","25.89","25.17","6.54M","1.57%"
"Dec 12, 2018","26.18","25.61","26.67","25.61","6.13M","2.50%"
"Dec 13, 2018","26.21","26.26","26.76","26.08","4.45M","0.14%"
"Dec 14, 2018","26.54","26.07","26.70","25.86","6.76M","1.25%"
"Dec 17, 2018","26.00","26.34","26.66","25.82","4.12M","-2.05%"
"Dec 18, 2018","25.91","26.01","26.25","25.91","2.89M","-0.36%"
"Dec 19, 2018","26.10","26.21","26.70","26.04","3.12M","0.76%"
"Dec 20, 2018","26.37","26.29","26.49","25.84","3.45M","1.03%"
"Dec 21, 2018","27.23","26.33","27.54","26.24","8.35M","3.28%"
"Dec 26, 2018","27.08","26.92","27.27","26.65","3.12M","-0.55%"
"Dec 27, 2018","27.27","27.09","27.35","26.71","2.75M","0.69%"
"Dec 28, 2018","27.98","27.31","27.98","27.30","3.42M","2.59%"
"Jan 02, 2019","29.03","27.98","29.23","27.50","5.04M","3.76%"
"Jan 03, 2019","28.55","28.46","28.91","28.20","5.29M","-1.65%"
"Jan 04, 2019","28.26","28.56","28.74","27.89","4.63M","-1.02%"
"Jan 07, 2019","27.73","27.99","28.30","27.33","3.87M","-1.86%"
"Jan 08, 2019","27.75","27.87","28.17","27.35","5.39M","0.07%"
"Jan 09, 2019","28.40","27.73","28.62","27.68","3.30M","2.34%"
"Jan 10, 2019","28.26","28.37","28.82","28.21","5.05M","-0.50%"
"Jan 11, 2019","27.72","28.26","28.49","27.52","4.30M","-1.90%"
"Jan 14, 2019","27.62","27.74","28.20","27.35","4.25M","-0.37%"
"Jan 15, 2019","27.11","27.42","27.60","26.76","6.51M","-1.84%"
"Jan 16, 2019","27.31","27.34","27.73","26.85","7.89M","0.73%"
"Jan 17, 2019","29.02","27.08","29.29","26.95","15.61M","6.27%"
"Jan 18, 2019","29.32","29.02","29.84","28.93","5.09M","1.04%"
"Jan 21, 2019","30.38","29.92","30.87","29.78","8.85M","3.59%"
"Jan 22, 2019","29.91","30.38","30.51","29.35","6.04M","-1.55%"
"Jan 23, 2019","30.17","29.90","30.28","29.71","3.38M","0.88%"
"Jan 24, 2019","30.30","30.18","30.65","30.06","4.33M","0.44%"
"Jan 28, 2019","30.10","30.39","30.99","29.88","4.71M","-0.65%"
"Jan 29, 2019","30.00","30.23","31.24","30.00","5.07M","-0.34%"
"Jan 30, 2019","31.22","30.24","31.46","30.17","5.42M","4.08%"
"Jan 31, 2019","31.32","31.50","31.97","31.00","5.00M","0.30%"
"Feb 01, 2019","30.85","31.50","31.75","30.10","12.78M","-1.50%"
"Feb 04, 2019","30.89","30.85","31.11","29.95","10.24M","0.15%"
"Feb 05, 2019","30.28","30.87","31.08","29.89","7.89M","-1.98%"
"Feb 06, 2019","29.49","29.93","30.13","29.45","9.38M","-2.61%"
"Feb 07, 2019","29.87","29.53","30.24","29.17","14.63M","1.28%"
"Feb 08, 2019","31.30","29.59","31.30","29.58","8.71M","4.79%"
"Feb 11, 2019","30.76","31.17","31.23","30.33","6.42M","-1.71%"
"Feb 12, 2019","31.29","30.98","31.31","30.58","7.77M","1.71%"
"Feb 13, 2019","31.47","31.36","31.79","31.09","8.22M","0.57%"
"Feb 14, 2019","32.34","31.56","32.44","30.75","7.47M","2.78%"
"Feb 15, 2019","32.14","32.26","32.26","31.49","3.49M","-0.61%"
"Feb 18, 2019","32.25","32.16","32.25","31.65","3.23M","0.32%"
"Feb 19, 2019","32.13","32.21","32.62","31.80","5.32M","-0.35%"
"Feb 20, 2019","31.57","32.13","32.34","31.20","4.86M","-1.76%"
"Feb 21, 2019","31.97","31.69","31.97","31.30","4.28M","1.28%"
"Feb 22, 2019","32.60","32.57","32.84","31.24","5.68M","1.97%"
"Feb 25, 2019","32.76","32.78","33.55","32.39","6.28M","0.49%"
"Feb 26, 2019","33.01","32.70","33.21","32.54","3.51M","0.75%"
"Feb 27, 2019","32.55","33.03","33.15","32.22","3.43M","-1.40%"
"Feb 28, 2019","32.49","32.60","32.61","31.79","4.69M","-0.17%"
"Mar 01, 2019","31.60","32.44","32.69","31.57","6.11M","-2.75%"
"Mar 06, 2019","31.74","31.76","32.10","31.40","4.16M","0.45%"
"Mar 07, 2019","31.15","31.90","31.90","30.89","4.03M","-1.87%"
"Mar 08, 2019","31.83","31.11","32.04","30.80","3.57M","2.20%"
"Mar 11, 2019","33.09","32.05","33.29","32.01","5.98M","3.96%"
"Mar 12, 2019","32.90","33.10","33.15","32.28","2.82M","-0.60%"
"Mar 13, 2019","32.30","32.81","32.81","31.66","7.76M","-1.80%"
"Mar 14, 2019","32.60","32.44","32.60","31.90","4.00M","0.90%"
"Mar 15, 2019","32.35","32.43","32.92","32.11","5.14M","-0.75%"
"Mar 18, 2019","32.54","32.50","32.54","32.14","3.86M","0.58%"
"Mar 19, 2019","32.21","32.32","32.60","32.10","4.57M","-1.01%"
"Mar 20, 2019","31.60","32.21","32.38","31.50","4.40M","-1.90%"
"Mar 21, 2019","31.17","31.61","31.67","30.63","4.22M","-1.37%"
"Mar 22, 2019","30.31","30.42","31.13","29.95","5.65M","-2.75%"
"Mar 25, 2019","30.44","30.05","30.97","29.90","2.77M","0.43%"
"Mar 26, 2019","30.68","30.38","31.00","30.34","3.48M","0.77%"
"Mar 27, 2019","29.61","30.24","30.55","29.31","5.77M","-3.49%"
"Mar 28, 2019","30.55","29.29","30.77","29.07","5.30M","3.19%"
"Mar 29, 2019","31.18","30.68","31.40","30.49","3.89M","2.07%"
"Apr 01, 2019","31.16","31.44","31.57","30.96","2.65M","-0.06%"
"Apr 02, 2019","31.27","31.46","31.46","30.64","4.14M","0.33%"
"Apr 03, 2019","30.13","31.54","31.65","29.87","8.72M","-3.65%"
"Apr 04, 2019","30.09","30.05","30.45","29.71","3.46M","-0.13%"
"Apr 05, 2019","30.07","30.06","30.26","29.38","7.25M","-0.06%"
"Apr 08, 2019","29.58","30.11","30.32","29.33","4.10M","-1.63%"
"Apr 09, 2019","28.86","29.58","29.76","28.77","7.02M","-2.42%"
"Apr 10, 2019","29.79","29.19","29.79","28.63","8.35M","3.20%"
"Apr 11, 2019","29.99","29.53","30.11","29.12","4.70M","0.70%"
"Apr 12, 2019","29.95","29.59","30.41","29.31","11.73M","-0.16%"
"Apr 15, 2019","30.65","30.18","31.22","30.01","7.77M","2.36%"
"Apr 16, 2019","30.82","30.48","31.41","30.37","6.67M","0.55%"
"Apr 17, 2019","30.64","31.01","31.04","30.43","7.84M","-0.61%"
"Apr 18, 2019","30.90","30.57","31.12","30.44","2.78M","0.86%"
"Apr 22, 2019","31.15","30.63","31.38","30.52","2.10M","0.79%"
"Apr 23, 2019","32.14","31.31","32.31","31.19","6.13M","3.18%"
"Apr 24, 2019","31.62","32.00","32.00","31.21","5.59M","-1.61%"
"Apr 25, 2019","32.35","31.54","32.90","31.30","7.53M","2.33%"
"Apr 26, 2019","33.83","32.59","34.09","32.59","11.69M","4.58%"
"Apr 29, 2019","34.19","33.83","34.86","33.58","4.77M","1.06%"
"Apr 30, 2019","34.14","34.33","34.69","33.88","5.38M","-0.14%"
"May 02, 2019","33.92","34.23","34.65","33.88","4.66M","-0.66%"
"May 03, 2019","33.81","33.89","34.21","33.63","3.52M","-0.31%"
"May 06, 2019","33.31","33.31","34.00","33.14","2.31M","-1.51%"
"May 07, 2019","33.05","33.04","33.39","32.51","4.42M","-0.76%"
"May 08, 2019","34.63","33.29","34.70","33.26","4.42M","4.77%"
"May 09, 2019","34.27","34.25","34.62","33.51","2.57M","-1.04%"
"May 10, 2019","34.66","34.06","34.66","33.62","2.61M","1.16%"
"May 13, 2019","33.02","33.59","34.06","32.97","6.87M","-4.74%"
"May 14, 2019","33.94","33.48","33.94","33.14","3.39M","2.77%"
"May 15, 2019","33.96","33.15","34.01","32.84","3.74M","0.06%"
"May 16, 2019","33.68","33.38","34.27","33.20","5.12M","-0.81%"
"May 17, 2019","32.89","33.36","33.88","32.75","4.86M","-2.35%"
"May 20, 2019","34.34","32.88","34.64","32.80","4.89M","4.42%"
"May 21, 2019","34.26","34.34","34.63","33.95","2.60M","-0.25%"
"May 22, 2019","33.97","34.34","34.43","33.75","2.07M","-0.85%"
"May 23, 2019","34.31","33.97","34.48","33.58","2.03M","1.00%"
"May 24, 2019","34.30","34.31","34.91","33.93","2.91M","-0.03%"
"May 27, 2019","35.12","34.30","35.64","34.26","3.29M","2.39%"
"May 28, 2019","35.69","35.39","35.69","34.73","6.47M","1.64%"
"May 29, 2019","35.98","35.47","36.09","35.21","4.14M","0.79%"
"May 30, 2019","36.00","35.92","36.23","35.46","3.86M","0.08%"
"May 31, 2019","35.89","35.84","36.19","35.34","3.27M","-0.31%"
"Jun 03, 2019","36.12","35.98","36.75","35.98","3.50M","0.63%"
"Jun 04, 2019","35.85","36.41","36.47","35.48","3.43M","-0.73%"
"Jun 05, 2019","35.43","36.08","36.47","35.14","2.97M","-1.18%"
"Jun 06, 2019","36.14","35.48","36.75","35.44","8.76M","2.00%"
"Jun 07, 2019","36.61","36.28","36.65","35.80","1.98M","1.31%"
"Jun 10, 2019","36.54","36.16","36.72","36.00","2.44M","-0.18%"
"Jun 11, 2019","37.08","36.75","37.46","36.72","3.86M","1.47%"
"Jun 12, 2019","36.79","37.10","37.72","36.37","8.59M","-0.79%"
"Jun 13, 2019","37.19","37.03","37.48","36.79","5.73M","1.10%"
"Jun 14, 2019","37.15","37.18","37.55","36.86","2.30M","-0.10%"
"Jun 17, 2019","37.50","37.18","38.15","36.97","4.61M","0.94%"
"Jun 18, 2019","37.85","37.85","38.26","37.58","4.11M","0.93%"
"Jun 19, 2019","38.65","37.85","38.89","37.66","4.53M","2.09%"
"Jun 21, 2019","38.59","38.53","39.14","38.33","4.04M","-0.15%"
"Jun 24, 2019","39.22","38.78","39.22","38.43","1.47M","1.64%"
"Jun 25, 2019","38.11","38.97","38.97","37.79","3.86M","-2.83%"
"Jun 26, 2019","38.16","38.23","38.52","37.57","3.24M","0.12%"
"Jun 27, 2019","38.09","37.75","38.38","37.48","3.16M","-0.17%"
"Jun 28, 2019","38.76","38.47","38.76","38.14","2.96M","1.76%"
"Jul 01, 2019","38.59","38.76","38.83","38.30","2.47M","-0.44%"
"Jul 02, 2019","38.87","38.69","38.87","38.24","3.26M","0.71%"
"Jul 03, 2019","39.55","38.42","39.83","38.34","3.84M","1.75%"
"Jul 04, 2019","40.34","40.10","40.67","39.82","3.09M","2.01%"
"Jul 05, 2019","40.56","39.99","41.05","39.57","3.60M","0.54%"
"Jul 08, 2019","41.15","40.58","41.77","40.58","4.16M","1.45%"
"Jul 10, 2019","41.74","41.15","41.94","40.51","5.08M","1.45%"
"Jul 11, 2019","40.78","41.79","41.80","40.46","4.91M","-2.31%"
"Jul 12, 2019","39.96","40.78","41.21","39.49","7.62M","-1.99%"
"Jul 15, 2019","39.71","40.01","40.34","39.45","4.73M","-0.64%"
"Jul 16, 2019","40.67","39.76","40.79","39.68","3.98M","2.43%"
"Jul 17, 2019","40.85","40.83","41.48","40.70","5.43M","0.44%"
"Jul 18, 2019","41.24","41.15","41.43","40.61","1.89M","0.95%"
"Jul 19, 2019","40.54","40.96","41.17","40.35","1.88M","-1.70%"
"Jul 22, 2019","40.74","40.85","41.59","40.39","3.28M","0.49%"
"Jul 23, 2019","40.20","40.87","40.87","40.01","2.75M","-1.32%"
"Jul 24, 2019","40.88","40.15","41.16","40.15","4.09M","1.69%"
"Jul 25, 2019","40.96","40.91","41.08","40.25","3.27M","0.19%"
"Jul 26, 2019","40.89","40.87","41.19","40.54","2.32M","-0.16%"
"Jul 29, 2019","41.43","40.77","41.43","40.55","1.59M","1.32%"
"Jul 30, 2019","41.62","41.50","42.03","41.05","2.35M","0.46%"
"Jul 31, 2019","41.62","41.94","41.98","40.87","4.11M","0.00%"
"Aug 01, 2019","42.45","42.09","42.50","41.23","6.90M","2.00%"
"Aug 02, 2019","43.24","42.96","43.42","41.25","6.84M","1.85%"
"Aug 05, 2019","41.71","42.37","42.63","41.05","5.87M","-3.52%"
"Aug 06, 2019","42.47","41.99","42.55","41.62","5.17M","1.81%"
"Aug 07, 2019","41.14","41.70","42.04","41.05","4.86M","-3.14%"
"Aug 08, 2019","42.56","41.44","42.56","41.32","6.91M","3.47%"
"Aug 09, 2019","42.19","42.71","43.25","41.83","3.39M","-0.89%"
"Aug 12, 2019","41.54","41.57","41.61","41.15","3.76M","-1.52%"
"Aug 13, 2019","42.55","41.43","42.55","40.93","4.77M","2.41%"
"Aug 14, 2019","41.68","41.92","42.24","41.32","5.69M","-2.02%"
"Aug 15, 2019","41.10","42.10","42.10","40.30","4.48M","-1.41%"
"Aug 16, 2019","42.55","41.38","42.55","40.84","3.67M","3.54%"
"Aug 19, 2019","42.33","42.94","43.04","41.85","3.51M","-0.53%"
"Aug 20, 2019","41.88","42.33","42.33","41.29","4.58M","-1.05%"
"Aug 21, 2019","42.94","42.56","43.20","42.12","3.71M","2.53%"
"Aug 22, 2019","42.21","43.22","43.22","42.10","2.72M","-1.70%"
"Aug 23, 2019","41.39","41.80","42.10","40.89","3.53M","-1.95%"
"Aug 26, 2019","40.59","41.85","41.85","40.36","3.30M","-1.94%"
"Aug 27, 2019","42.28","40.76","42.38","40.76","5.97M","4.17%"
"Aug 28, 2019","42.63","42.08","42.68","41.44","2.11M","0.83%"
"Aug 29, 2019","43.70","42.63","43.78","42.20","4.60M","2.51%"
"Aug 30, 2019","44.49","44.17","45.19","43.94","5.40M","1.82%"
"Sep 02, 2019","44.36","44.46","44.91","44.08","1.91M","-0.30%"
"Sep 03, 2019","44.04","44.30","45.45","43.76","4.12M","-0.72%"
"Sep 04, 2019","44.63","44.56","44.91","43.84","2.74M","1.33%"
"Sep 05, 2019","44.69","44.91","45.44","44.37","3.32M","0.15%"
"Sep 06, 2019","44.30","44.84","45.10","43.91","2.02M","-0.89%"
"Sep 09, 2019","43.06","44.36","44.83","42.92","6.50M","-2.80%"
"Sep 10, 2019","42.56","42.87","43.23","41.12","10.28M","-1.16%"
"Sep 11, 2019","43.28","42.90","43.47","42.78","4.79M","1.69%"
"Sep 12, 2019","43.09","43.69","43.86","42.78","3.46M","-0.44%"
"Sep 13, 2019","41.56","43.09","43.37","41.43","9.61M","-3.54%"
"Sep 16, 2019","41.94","41.71","42.21","41.31","4.59M","0.91%"
"Sep 17, 2019","42.19","41.63","42.79","41.40","5.66M","0.59%"
"Sep 18, 2019","42.78","41.81","42.89","41.57","5.25M","1.42%"
"Sep 19, 2019","43.49","42.91","43.89","42.90","5.41M","1.64%"
"Sep 20, 2019","43.58","43.87","43.87","42.62","5.48M","0.22%"
"Sep 23, 2019","42.13","42.94","42.99","41.93","5.71M","-3.33%"
"Sep 24, 2019","41.33","42.21","42.28","40.94","5.68M","-1.89%"
"Sep 25, 2019","42.32","41.23","42.63","41.20","4.42M","2.39%"
"Sep 26, 2019","42.06","42.58","42.82","42.05","2.09M","-0.60%"
"Sep 27, 2019","41.87","42.06","42.71","41.75","2.18M","-0.47%"
"Sep 30, 2019","43.10","41.96","43.37","41.88","4.97M","2.94%"
"Oct 01, 2019","42.10","43.14","43.14","41.76","4.85M","-2.31%"
"Oct 02, 2019","40.48","41.71","41.71","40.21","6.52M","-3.85%"
"Oct 03, 2019","40.90","40.48","41.03","39.34","8.50M","1.03%"
"Oct 04, 2019","41.57","41.12","41.98","40.77","3.14M","1.65%"
"Oct 07, 2019","40.96","41.19","41.48","40.64","2.92M","-1.48%"
"Oct 08, 2019","40.72","41.16","41.57","40.14","3.52M","-0.58%"
"Oct 09, 2019","40.84","41.13","41.13","40.41","1.85M","0.30%"
"Oct 10, 2019","39.88","40.77","40.95","39.70","6.40M","-2.34%"
"Oct 11, 2019","41.05","40.18","41.70","40.10","5.67M","2.92%"
"Oct 14, 2019","41.77","41.05","41.77","40.79","2.13M","1.76%"
"Oct 15, 2019","42.58","41.59","42.94","41.32","4.37M","1.93%"
"Oct 16, 2019","41.99","42.70","42.81","41.44","6.10M","-1.38%"
"Oct 17, 2019","41.94","42.21","42.28","41.68","2.25M","-0.11%"
"Oct 18, 2019","42.60","42.09","42.60","41.54","2.27M","1.56%"
"Oct 21, 2019","42.28","42.61","43.02","41.71","3.70M","-0.73%"
"Oct 22, 2019","42.37","42.34","42.85","42.00","4.10M","0.20%"
"Oct 23, 2019","42.07","42.49","42.58","41.08","5.08M","-0.69%"
"Oct 24, 2019","39.48","39.92","40.66","39.16","26.80M","-6.17%"
"Oct 25, 2019","39.60","39.63","39.81","38.33","16.70M","0.31%"
"Oct 28, 2019","39.28","39.72","39.96","39.12","5.98M","-0.81%"
"Oct 29, 2019","39.28","39.29","39.60","38.89","6.42M","0.00%"
"Oct 30, 2019","40.70","39.34","40.80","39.28","6.96M","3.62%"
"Oct 31, 2019","40.94","40.58","40.94","39.87","5.02M","0.58%"
"Nov 01, 2019","41.05","40.93","41.57","40.54","6.32M","0.28%"
"Nov 04, 2019","40.05","41.03","41.23","40.04","6.49M","-2.42%"
"Nov 05, 2019","39.99","40.24","40.26","39.40","5.63M","-0.17%"
"Nov 06, 2019","40.00","39.99","40.37","39.47","5.68M","0.02%"
"Nov 07, 2019","40.15","40.09","40.58","39.61","8.74M","0.38%"
"Nov 08, 2019","39.39","39.94","39.96","38.90","4.50M","-1.89%"
"Nov 11, 2019","39.94","39.25","40.08","39.10","4.44M","1.40%"
"Nov 12, 2019","39.14","39.67","40.00","38.58","5.07M","-1.99%"
"Nov 13, 2019","39.02","39.06","39.58","38.58","4.63M","-0.31%"
"Nov 14, 2019","39.58","39.06","39.81","38.81","3.44M","1.43%"
"Nov 18, 2019","39.01","39.82","39.98","39.01","3.86M","-1.44%"
"Nov 19, 2019","38.89","39.28","39.61","38.42","4.65M","-0.32%"
"Nov 21, 2019","41.07","38.89","41.07","38.60","5.69M","5.61%"
"Nov 22, 2019","41.97","41.07","41.97","40.59","4.80M","2.19%"
"Nov 25, 2019","41.77","41.91","42.03","41.18","4.13M","-0.47%"
"Nov 26, 2019","41.26","41.77","41.77","40.36","6.42M","-1.23%"
"Nov 27, 2019","41.02","41.26","41.47","40.41","2.14M","-0.57%"
"Nov 28, 2019","42.42","40.86","42.42","40.83","4.28M","3.42%"
"Nov 29, 2019","42.70","42.52","42.70","41.83","3.47M","0.65%"
"Dec 02, 2019","42.24","42.66","42.66","41.81","3.50M","-1.07%"
"Dec 03, 2019","42.51","42.42","42.73","41.62","3.26M","0.63%"
"Dec 04, 2019","42.09","42.65","43.14","41.77","4.07M","-0.98%"
"Dec 05, 2019","42.70","42.26","42.70","41.74","2.12M","1.44%"
"Dec 06, 2019","43.33","42.70","43.74","42.54","3.29M","1.47%"
"Dec 09, 2019","42.79","43.54","43.77","42.47","2.76M","-1.23%"
"Dec 10, 2019","42.14","42.79","42.84","41.81","3.61M","-1.53%"
"Dec 11, 2019","43.24","42.14","43.69","42.14","3.90M","2.61%"
"Dec 12, 2019","44.35","43.37","44.35","43.25","3.38M","2.57%"
"Dec 13, 2019","44.40","44.56","45.03","43.89","4.61M","0.11%"
"Dec 16, 2019","45.03","44.42","45.41","44.28","4.55M","1.43%"
"Dec 17, 2019","44.84","45.05","45.39","44.36","3.35M","-0.42%"
"Dec 18, 2019","45.92","44.96","45.92","44.43","9.91M","2.39%"
"Dec 19, 2019","46.46","45.68","46.89","45.21","5.96M","1.18%"
"Dec 20, 2019","45.43","46.53","46.53","45.33","6.21M","-2.21%"
"Dec 23, 2019","46.68","45.83","46.68","45.24","3.04M","2.76%"
"Dec 26, 2019","48.14","46.71","48.43","46.12","3.55M","3.12%"
"Dec 27, 2019","47.84","48.13","48.16","47.06","3.87M","-0.62%"
"Dec 30, 2019","47.29","47.84","48.17","47.18","2.70M","-1.15%"
"Jan 02, 2020","49.50","48.10","49.50","47.49","3.09M","4.66%"
"Jan 03, 2020","48.78","48.97","49.63","48.43","5.06M","-1.45%"
"Jan 06, 2020","48.21","48.43","48.77","47.71","3.67M","-1.17%"
"Jan 07, 2020","48.68","48.08","48.68","47.76","4.37M","0.97%"
"Jan 08, 2020","48.44","48.82","49.36","48.10","3.55M","-0.49%"
"Jan 09, 2020","48.70","48.24","49.11","48.06","3.16M","0.54%"
"Jan 10, 2020","47.73","48.76","49.18","47.48","4.51M","-1.99%"
"Jan 13, 2020","47.88","47.99","48.27","47.61","6.27M","0.31%"
"Jan 14, 2020","48.08","47.72","48.08","47.33","5.63M","0.42%"
"Jan 15, 2020","48.09","47.97","48.34","47.64","9.84M","0.02%"
"Jan 16, 2020","49.03","48.54","49.03","47.98","5.64M","1.95%"
"Jan 17, 2020","49.37","49.08","49.37","48.63","2.68M","0.69%"
"Jan 20, 2020","49.48","49.17","49.85","48.93","4.09M","0.22%"
"Jan 21, 2020","49.08","49.28","49.69","48.69","2.85M","-0.81%"
"Jan 22, 2020","49.71","49.68","49.71","48.91","2.39M","1.28%"
"Jan 23, 2020","51.61","49.40","51.70","48.59","7.39M","3.83%"
"Jan 24, 2020","51.28","51.57","51.97","51.06","4.41M","-0.64%"
"Jan 27, 2020","51.31","50.28","52.01","49.28","3.85M","0.06%"
"Jan 28, 2020","52.77","51.27","53.07","50.90","4.59M","2.84%"
"Jan 29, 2020","54.12","52.77","54.42","52.65","5.81M","2.55%"
"Jan 30, 2020","53.70","54.04","54.04","52.61","5.90M","-0.77%"
"Jan 31, 2020","53.50","53.02","53.53","52.80","4.74M","-0.37%"
"Feb 03, 2020","54.33","53.52","55.21","53.20","5.59M","1.55%"
"Feb 04, 2020","54.86","54.98","55.36","54.29","3.30M","0.99%"
"Feb 05, 2020","55.38","55.16","56.07","55.16","3.57M","0.95%"
"Feb 06, 2020","53.71","55.60","56.14","53.17","4.25M","-3.03%"
"Feb 07, 2020","52.80","53.54","54.02","52.05","4.85M","-1.69%"
"Feb 10, 2020","52.19","53.77","53.77","51.63","4.43M","-1.15%"
"Feb 11, 2020","53.97","52.55","54.08","52.21","3.58M","3.40%"
"Feb 12, 2020","55.34","54.11","55.34","53.24","5.58M","2.55%"
"Feb 13, 2020","54.88","54.14","55.05","53.89","3.22M","-0.83%"
"Feb 14, 2020","54.86","54.76","55.05","54.09","2.46M","-0.04%"
"Feb 17, 2020","55.09","55.01","55.98","54.68","3.91M","0.42%"
"Feb 18, 2020","55.16","54.68","55.44","54.20","2.89M","0.13%"
"Feb 19, 2020","54.91","54.67","55.52","54.53","4.29M","-0.45%"
"Feb 20, 2020","54.59","54.38","54.86","54.08","3.48M","-0.60%"
"Feb 21, 2020","54.27","54.00","54.54","53.48","3.07M","-0.58%"
"Feb 26, 2020","50.51","51.07","51.87","49.93","6.31M","-6.93%"
"Feb 27, 2020","49.23","49.91","51.08","49.23","6.50M","-2.53%"
"Feb 28, 2020","49.42","49.23","49.42","46.94","12.15M","0.39%"
"Mar 02, 2020","49.73","48.84","50.31","48.68","7.19M","0.63%"
"Mar 03, 2020","49.54","48.88","51.47","48.64","8.36M","-0.38%"
"Mar 04, 2020","50.67","50.38","51.12","49.98","6.03M","2.30%"
"Mar 05, 2020","48.13","49.97","50.64","46.32","8.69M","-5.02%"
"Mar 06, 2020","44.94","45.99","46.34","44.04","14.12M","-6.63%"
"Mar 09, 2020","39.70","42.69","42.69","38.44","17.09M","-11.65%"
"Mar 10, 2020","41.85","41.00","42.22","39.89","16.26M","5.40%"
"Mar 11, 2020","38.86","40.70","41.41","37.41","14.34M","-7.13%"
"Mar 12, 2020","32.92","30.03","34.10","28.98","12.60M","-15.30%"
"Mar 13, 2020","35.91","38.41","39.50","31.58","16.17M","9.09%"
"Mar 16, 2020","27.50","30.20","31.37","27.50","13.40M","-23.42%"
"Mar 17, 2020","27.70","28.22","28.96","25.94","22.95M","0.73%"
"Mar 18, 2020","23.87","24.68","24.99","20.61","24.75M","-13.83%"
"Mar 19, 2020","26.08","22.00","28.50","21.91","15.58M","9.26%"
"Mar 20, 2020","27.55","27.00","28.65","25.11","16.06M","5.64%"
"Mar 23, 2020","24.10","27.52","28.11","22.95","13.28M","-12.52%"
"Mar 24, 2020","27.18","26.60","28.15","24.89","17.26M","12.78%"
"Mar 25, 2020","34.47","27.10","35.20","26.81","9.42M","26.82%"
"Mar 26, 2020","34.69","33.75","36.07","32.01","16.14M","0.64%"
"Mar 27, 2020","31.32","32.70","32.80","30.30","12.33M","-9.71%"
"Mar 30, 2020","28.70","31.55","31.79","28.34","10.93M","-8.37%"
"Mar 31, 2020","26.30","28.84","29.30","25.50","11.12M","-8.36%"
"Apr 01, 2020","23.70","25.40","25.40","23.32","12.42M","-9.89%"
"Apr 02, 2020","26.14","23.95","26.14","23.14","9.88M","10.30%"
"Apr 03, 2020","23.31","25.77","25.77","22.51","13.34M","-10.83%"
"Apr 06, 2020","28.00","25.15","29.07","25.11","13.81M","20.12%"
"Apr 07, 2020","29.22","30.80","31.40","28.12","15.03M","4.36%"
"Apr 08, 2020","31.90","29.42","33.48","28.54","15.15M","9.17%"
"Apr 09, 2020","30.15","32.17","33.60","30.10","14.46M","-5.49%"
"Apr 13, 2020","29.75","30.00","30.46","28.68","9.17M","-1.33%"
"Apr 14, 2020","30.49","30.52","31.50","29.85","7.93M","2.49%"
"Apr 15, 2020","30.12","29.85","31.85","29.29","11.21M","-1.21%"
"Apr 16, 2020","29.56","30.88","30.88","29.30","10.57M","-1.86%"
"Apr 17, 2020","32.03","30.45","32.21","30.08","11.54M","8.36%"