Date,Price,Open,High,Low,Vol.,Change %
"Apr 20, 2015",1193.50,1205.70,1206.90,1191.00,0.07K,"-0,78%"
"Apr 21, 2015",1202.90,1193.20,1202.20,1192.80,0.03K,"0,79%"
"Apr 22, 2015",1186.90,1199.10,1202.60,1185.20,0.09K,"-1,33%"
"Apr 23, 2015",1194.40,1187.20,1197.00,1186.10,0.33K,"0,63%"
"Apr 24, 2015",1175.20,1192.30,1194.70,1174.60,0.05K,"-1,61%"
"Apr 27, 2015",1203.30,1182.30,1206.70,1181.40,0.19K,"2,39%"
"Apr 28, 2015",1214.00,1199.70,1205.90,1199.70,0.01K,"0,89%"
"Apr 29, 2015",1209.80,1211.20,1212.60,1201.90,0.11K,"-0,35%"
"Apr 30, 2015",1182.40,1203.10,1205.90,1176.70,0.14K,"-2,26%"
"May 01, 2015",1174.50,1178.10,1178.10,1170.00,0.02K,"-0,67%"
"May 04, 2015",1186.80,1177.50,1189.40,1177.50,0.04K,"1,05%"
"May 05, 2015",1193.20,1187.50,1198.70,1186.90,0.05K,"0,54%"
"May 06, 2015",1190.30,1194.50,1194.60,1189.90,0.01K,"-0,24%"
"May 07, 2015",1182.40,1181.50,1186.00,1179.70,0.04K,"-0,66%"
"May 08, 2015",1189.10,1183.30,1187.50,1182.90,0.05K,"0,57%"
"May 11, 2015",1183.20,1189.70,1190.50,1179.30,0.03K,"-0,50%"
"May 12, 2015",1192.60,1194.60,1194.80,1189.70,0.01K,"0,79%"
"May 13, 2015",1218.40,1192.70,1217.30,1191.00,0.03K,"2,16%"
"May 14, 2015",1225.40,1214.50,1225.60,1214.50,0.04K,"0,57%"
"May 15, 2015",1225.50,1218.50,1224.70,1214.80,0.01K,"0,01%"
"May 18, 2015",1227.80,1224.50,1228.10,1222.60,0.01K,"0,19%"
"May 19, 2015",1206.90,1223.90,1223.90,1206.00,0.01K,"-1,70%"
"May 20, 2015",1208.90,1205.10,1210.80,1205.10,0.01K,"0,17%"
"May 21, 2015",1204.40,1204.50,1204.50,1203.70,0.04K,"-0,37%"
"May 22, 2015",1204.30,1211.60,1211.90,1205.70,0.01K,"-0,01%"
"May 24, 2015",1204.40,1205.80,1205.80,1203.90,-,"0,01%"
"May 25, 2015",1207.40,1204.60,1209.00,1203.30,-,"0,25%"
"May 26, 2015",1187.20,1193.60,1195.00,1186.00,0.04K,"-1,67%"
"May 27, 2015",1185.90,1185.90,1185.90,1185.90,0.03K,"-0,11%"
"May 28, 2015",1188.10,1187.10,1192.00,1179.60,52.71K,"0,19%"
"May 29, 2015",1189.40,1187.80,1193.30,1185.70,4.75K,"0,11%"
"Jun 01, 2015",1188.30,1190.60,1204.00,1184.30,1.24K,"-0,09%"
"Jun 02, 2015",1194.10,1189.00,1194.90,1186.00,1.00K,"0,49%"
"Jun 03, 2015",1184.70,1193.90,1193.90,1179.10,0.63K,"-0,79%"
"Jun 04, 2015",1174.90,1184.90,1185.50,1173.00,0.45K,"-0,83%"
"Jun 05, 2015",1167.80,1176.40,1177.30,1163.30,0.39K,"-0,60%"
"Jun 08, 2015",1173.20,1169.50,1176.10,1169.10,0.17K,"0,46%"
"Jun 09, 2015",1177.30,1172.90,1181.60,1172.70,0.14K,"0,35%"
"Jun 10, 2015",1186.10,1176.10,1190.10,1175.60,0.30K,"0,75%"
"Jun 11, 2015",1179.90,1183.20,1183.20,1174.40,0.07K,"-0,52%"
"Jun 12, 2015",1178.80,1180.40,1181.20,1176.20,0.14K,"-0,09%"
"Jun 15, 2015",1185.30,1179.90,1188.50,1172.70,0.10K,"0,55%"
"Jun 16, 2015",1180.50,1186.50,1186.50,1175.90,0.03K,"-0,40%"
"Jun 17, 2015",1176.40,1177.60,1186.30,1174.90,0.17K,"-0,35%"
"Jun 18, 2015",1201.50,1183.40,1202.00,1183.40,0.13K,"2,13%"
"Jun 19, 2015",1201.50,1199.70,1203.10,1199.70,0.14K,"0,00%"
"Jun 22, 2015",1183.70,1197.80,1197.80,1182.70,0.03K,"-1,48%"
"Jun 23, 2015",1176.20,1183.80,1186.00,1176.80,0.06K,"-0,63%"
"Jun 24, 2015",1172.60,1176.60,1177.40,1170.70,0.26K,"-0,31%"
"Jun 25, 2015",1171.50,1175.80,1175.90,1171.70,0.10K,"-0,09%"
"Jun 26, 2015",1172.90,1170.50,1170.50,1170.50,0.03K,"0,12%"
"Jun 29, 2015",1178.50,1185.10,1186.00,1173.80,0.17K,"0,48%"
"Jun 30, 2015",1171.50,1176.30,1176.40,1166.60,0.22K,"-0,59%"
"Jul 01, 2015",1169.00,1173.10,1173.10,1166.60,0.46K,"-0,21%"
"Jul 02, 2015",1163.00,1166.40,1168.10,1155.50,0.32K,"-0,51%"
"Jul 03, 2015",1167.80,1164.70,1169.00,1164.60,-,"0,41%"
"Jul 06, 2015",1172.90,1163.90,1173.00,1162.20,0.63K,"0,44%"
"Jul 07, 2015",1152.40,1166.80,1166.80,1149.50,0.47K,"-1,75%"
"Jul 08, 2015",1163.30,1152.60,1161.70,1146.40,0.07K,"0,95%"
"Jul 09, 2015",1159.00,1154.80,1163.60,1154.80,0.07K,"-0,37%"
"Jul 10, 2015",1157.70,1160.10,1162.90,1157.50,0.03K,"-0,11%"
"Jul 13, 2015",1155.20,1159.00,1159.00,1151.20,0.01K,"-0,22%"
"Jul 14, 2015",1153.30,1157.20,1157.20,1153.00,0.04K,"-0,16%"
"Jul 15, 2015",1147.20,1154.00,1154.20,1144.80,0.02K,"-0,53%"
"Jul 16, 2015",1143.80,1146.20,1146.20,1142.90,0.01K,"-0,30%"
"Jul 17, 2015",1131.80,1144.00,1144.00,1130.20,0.12K,"-1,05%"
"Jul 20, 2015",1106.70,1130.40,1130.70,1095.10,0.19K,"-2,22%"
"Jul 21, 2015",1103.40,1097.10,1106.40,1097.10,0.12K,"-0,30%"
"Jul 22, 2015",1091.40,1093.00,1095.00,1086.00,0.05K,"-1,09%"
"Jul 23, 2015",1094.00,1097.40,1097.60,1087.80,0.06K,"0,24%"
"Jul 24, 2015",1085.60,1078.60,1100.70,1078.60,0.05K,"-0,77%"
"Jul 27, 2015",1096.50,1100.00,1102.50,1093.90,0.02K,"1,00%"
"Jul 28, 2015",1096.30,1097.20,1097.70,1097.00,0.03K,"-0,02%"
"Jul 29, 2015",1092.70,1096.40,1096.90,1093.60,0.01K,"-0,33%"
"Jul 30, 2015",1088.40,1096.10,1097.50,1081.00,49.30K,"-0,39%"
"Jul 31, 2015",1094.90,1087.70,1102.80,1079.10,5.70K,"0,60%"
"Aug 03, 2015",1089.40,1095.50,1097.10,1085.00,2.42K,"-0,50%"
"Aug 04, 2015",1090.70,1085.10,1093.90,1080.50,1.14K,"0,12%"
"Aug 05, 2015",1085.70,1086.50,1090.60,1082.50,1.21K,"-0,46%"
"Aug 06, 2015",1090.20,1084.40,1092.20,1083.60,0.27K,"0,41%"
"Aug 07, 2015",1094.10,1088.90,1098.30,1081.70,0.61K,"0,36%"
"Aug 10, 2015",1104.20,1093.20,1107.60,1089.50,0.90K,"0,92%"
"Aug 11, 2015",1107.60,1103.80,1116.70,1094.00,1.00K,"0,31%"
"Aug 12, 2015",1123.20,1106.00,1124.50,1101.50,0.80K,"1,41%"
"Aug 13, 2015",1115.70,1124.30,1124.30,1113.00,0.44K,"-0,67%"
"Aug 14, 2015",1112.90,1113.90,1118.80,1112.50,0.91K,"-0,25%"
"Aug 17, 2015",1118.60,1113.80,1122.00,1113.80,0.40K,"0,51%"
"Aug 18, 2015",1117.10,1118.20,1118.40,1110.00,0.48K,"-0,13%"
"Aug 19, 2015",1128.10,1117.00,1134.30,1116.80,0.35K,"0,98%"
"Aug 20, 2015",1153.00,1132.80,1153.30,1132.80,0.41K,"2,21%"
"Aug 21, 2015",1159.60,1154.10,1166.50,1150.50,0.26K,"0,57%"
"Aug 24, 2015",1153.40,1164.00,1169.00,1147.50,0.30K,"-0,53%"
"Aug 25, 2015",1138.20,1151.50,1155.50,1134.00,0.22K,"-1,32%"
"Aug 26, 2015",1124.60,1139.20,1143.00,1119.60,0.12K,"-1,19%"
"Aug 27, 2015",1122.40,1127.20,1127.40,1118.40,0.13K,"-0,20%"
"Aug 28, 2015",1133.10,1125.30,1139.00,1123.60,0.28K,"0,95%"
"Aug 31, 2015",1131.60,1131.10,1134.00,1124.80,0.19K,"-0,13%"
"Sep 01, 2015",1138.70,1133.50,1144.70,1133.50,0.38K,"0,63%"
"Sep 02, 2015",1132.50,1137.30,1140.40,1130.80,0.20K,"-0,54%"
"Sep 03, 2015",1123.70,1130.30,1132.90,1120.30,0.12K,"-0,78%"
"Sep 04, 2015",1120.60,1123.40,1125.20,1116.20,0.05K,"-0,28%"
"Sep 06, 2015",1119.90,1122.30,1123.10,1119.60,-,"-0,06%"
"Sep 07, 2015",1119.90,1119.50,1124.00,1115.20,-,"0,00%"
"Sep 08, 2015",1120.40,1119.80,1122.50,1116.40,0.14K,"0,04%"
"Sep 09, 2015",1102.20,1123.50,1123.50,1102.10,0.15K,"-1,62%"
"Sep 10, 2015",1109.50,1107.30,1113.50,1105.50,0.06K,"0,66%"
"Sep 11, 2015",1103.50,1110.80,1111.70,1098.20,0.08K,"-0,54%"
"Sep 14, 2015",1107.70,1107.80,1108.60,1104.10,0.02K,"0,38%"
"Sep 15, 2015",1102.80,1104.50,1104.50,1103.00,0.01K,"-0,44%"
"Sep 16, 2015",1119.20,1109.80,1119.90,1109.80,0.03K,"1,49%"
"Sep 17, 2015",1117.30,1118.60,1130.50,1117.10,0.01K,"-0,17%"
"Sep 18, 2015",1138.10,1128.30,1141.20,1127.80,0.06K,"1,86%"
"Sep 21, 2015",1133.10,1137.60,1138.50,1130.80,0.02K,"-0,44%"
"Sep 22, 2015",1125.00,1132.60,1135.00,1122.50,0.04K,"-0,71%"
"Sep 23, 2015",1131.60,1128.60,1132.20,1128.30,0.03K,"0,59%"
"Sep 24, 2015",1153.80,1133.00,1155.90,1133.00,0.04K,"1,96%"
"Sep 25, 2015",1146.00,1149.80,1149.80,1143.40,0.06K,"-0,68%"
"Sep 28, 2015",1132.00,1133.20,1133.20,1133.10,0.01K,"-1,22%"
"Sep 29, 2015",1127.10,1132.20,1134.40,1124.30,2.42K,"-0,43%"
"Sep 30, 2015",1115.50,1124.30,1126.00,1112.10,0.87K,"-1,03%"
"Oct 01, 2015",1114.20,1115.20,1119.00,1113.30,1.18K,"-0,12%"
"Oct 02, 2015",1137.10,1112.20,1141.20,1105.80,0.32K,"2,06%"
"Oct 05, 2015",1138.10,1137.10,1141.70,1132.50,0.23K,"0,09%"
"Oct 06, 2015",1146.80,1136.30,1150.00,1136.30,0.15K,"0,76%"
"Oct 07, 2015",1149.00,1147.60,1152.90,1143.00,0.10K,"0,19%"
"Oct 08, 2015",1144.70,1142.70,1146.70,1138.70,0.14K,"-0,37%"
"Oct 09, 2015",1156.30,1151.60,1157.20,1151.60,0.02K,"1,01%"
"Oct 12, 2015",1164.90,1155.90,1166.80,1155.90,0.04K,"0,74%"
"Oct 13, 2015",1165.80,1163.50,1166.20,1154.90,0.13K,"0,08%"
"Oct 14, 2015",1180.10,1172.40,1189.00,1167.30,0.14K,"1,23%"
"Oct 15, 2015",1187.90,1184.20,1188.30,1177.80,0.14K,"0,66%"
"Oct 16, 2015",1183.60,1182.50,1184.10,1176.20,0.24K,"-0,36%"
"Oct 19, 2015",1173.30,1176.50,1177.80,1169.30,0.06K,"-0,87%"
"Oct 20, 2015",1178.00,1168.70,1179.10,1168.70,0.02K,"0,40%"
"Oct 21, 2015",1167.60,1175.90,1176.40,1164.90,0.04K,"-0,88%"
"Oct 22, 2015",1166.60,1166.20,1168.60,1163.50,0.05K,"-0,09%"
"Oct 23, 2015",1163.30,1166.20,1178.70,1163.30,0.04K,"-0,28%"
"Oct 26, 2015",1167.00,1165.10,1170.00,1163.80,0.18K,"0,32%"
"Oct 27, 2015",1166.80,1164.50,1166.10,1162.00,0.30K,"-0,02%"
"Oct 28, 2015",1177.10,1175.10,1182.70,1175.10,0.09K,"0,88%"
"Oct 29, 2015",1147.20,1158.00,1162.00,1144.90,0.33K,"-2,54%"
"Oct 30, 2015",1141.50,1147.50,1147.60,1139.20,0.25K,"-0,50%"
"Nov 02, 2015",1135.80,1137.90,1138.70,1132.60,0.18K,"-0,50%"
"Nov 03, 2015",1114.20,1133.30,1134.70,1114.20,0.19K,"-1,90%"
"Nov 04, 2015",1106.50,1119.00,1121.90,1106.70,0.14K,"-0,69%"
"Nov 05, 2015",1104.40,1107.90,1110.70,1104.50,0.08K,"-0,19%"
"Nov 06, 2015",1087.60,1105.20,1109.50,1084.80,0.08K,"-1,52%"
"Nov 09, 2015",1087.90,1088.60,1088.60,1088.60,0.01K,"0,03%"
"Nov 10, 2015",1088.20,1090.10,1091.30,1085.00,0.02K,"0,03%"
"Nov 11, 2015",1084.70,1091.40,1091.40,1084.20,0.02K,"-0,32%"
"Nov 12, 2015",1080.80,1086.00,1086.60,1086.00,0.00K,"-0,36%"
"Nov 13, 2015",1080.80,1083.10,1085.90,1081.30,0.02K,"0,00%"
"Nov 16, 2015",1083.70,1092.00,1092.40,1085.40,0.01K,"0,27%"
"Nov 17, 2015",1068.70,1075.50,1075.80,1065.10,0.01K,"-1,38%"
"Nov 18, 2015",1068.80,1064.00,1071.90,1064.00,0.01K,"0,01%"
"Nov 19, 2015",1078.00,1077.40,1082.40,1077.40,0.01K,"0,86%"
"Nov 20, 2015",1076.40,1082.90,1082.90,1082.90,0.01K,"-0,15%"
"Nov 23, 2015",1066.80,1070.00,1071.50,1067.30,0.06K,"-0,89%"
"Nov 24, 2015",1074.30,1073.20,1079.40,1073.20,0.22K,"0,70%"
"Nov 25, 2015",1070.50,1070.20,1072.00,1068.50,0.06K,"-0,35%"
"Nov 26, 2015",1070.80,1070.10,1074.20,1069.20,-,"0,03%"
"Nov 27, 2015",1056.20,1070.70,1074.20,1051.10,52.13K,"-1,36%"
"Nov 30, 2015",1065.80,1056.50,1068.40,1052.10,4.60K,"0,91%"
"Dec 01, 2015",1063.80,1064.60,1074.60,1063.40,3.44K,"-0,19%"
"Dec 02, 2015",1054.20,1068.70,1069.50,1049.60,0.50K,"-0,90%"
"Dec 03, 2015",1061.70,1054.40,1064.60,1046.20,1.16K,"0,71%"
"Dec 04, 2015",1084.50,1063.00,1088.80,1058.70,0.89K,"2,15%"
"Dec 07, 2015",1076.40,1084.90,1086.50,1067.40,0.66K,"-0,75%"
"Dec 08, 2015",1076.30,1071.00,1078.40,1069.60,0.31K,"-0,01%"
"Dec 09, 2015",1077.60,1075.10,1086.00,1070.60,0.39K,"0,12%"
"Dec 10, 2015",1073.10,1073.00,1076.30,1071.70,0.23K,"-0,42%"
"Dec 11, 2015",1076.90,1067.80,1079.40,1064.40,0.41K,"0,35%"
"Dec 14, 2015",1064.70,1074.00,1076.70,1060.00,0.51K,"-1,13%"
"Dec 15, 2015",1062.90,1064.60,1066.20,1061.80,0.22K,"-0,17%"
"Dec 16, 2015",1078.00,1064.80,1078.70,1064.30,0.08K,"1,42%"
"Dec 17, 2015",1050.80,1072.60,1072.60,1050.50,0.06K,"-2,52%"
"Dec 18, 2015",1066.20,1053.70,1070.30,1052.70,0.25K,"1,47%"
"Dec 21, 2015",1081.90,1070.20,1081.50,1070.20,0.03K,"1,47%"
"Dec 22, 2015",1074.80,1078.60,1078.60,1073.80,0.11K,"-0,66%"
"Dec 23, 2015",1069.40,1074.50,1074.80,1070.00,0.20K,"-0,50%"
"Dec 24, 2015",1077.20,1074.30,1077.80,1073.50,0.02K,"0,73%"
"Dec 28, 2015",1070.50,1077.90,1098.80,1073.60,0.36K,"-0,62%"
"Dec 29, 2015",1077.50,1079.10,1079.70,1079.10,0.07K,"0,65%"
"Dec 30, 2015",1060.10,1068.60,1070.20,1059.70,0.07K,"-1,61%"
"Dec 31, 2015",1060.30,1061.90,1062.00,1058.50,0.01K,"0,02%"
"Jan 04, 2016",1075.10,1063.40,1082.50,1063.20,0.14K,"1,40%"
"Jan 05, 2016",1078.40,1075.60,1081.50,1075.30,0.08K,"0,31%"
"Jan 06, 2016",1091.90,1081.60,1093.70,1081.60,0.05K,"1,25%"
"Jan 07, 2016",1107.70,1091.60,1109.40,1091.60,0.12K,"1,45%"
"Jan 08, 2016",1097.80,1111.10,1111.10,1093.00,0.10K,"-0,89%"
"Jan 11, 2016",1096.50,1105.70,1107.90,1096.50,0.04K,"-0,12%"
"Jan 12, 2016",1085.60,1093.80,1098.50,1084.00,0.09K,"-0,99%"
"Jan 13, 2016",1087.50,1081.50,1093.90,1081.50,0.05K,"0,18%"
"Jan 14, 2016",1073.90,1091.50,1091.50,1073.70,0.06K,"-1,25%"
"Jan 15, 2016",1091.50,1085.00,1095.80,1081.80,0.04K,"1,64%"
"Jan 17, 2016",1090.30,1088.60,1090.80,1088.60,-,"-0,11%"
"Jan 18, 2016",1088.50,1090.20,1093.30,1087.40,-,"-0,17%"
"Jan 19, 2016",1089.90,1089.80,1094.40,1084.90,0.02K,"0,13%"
"Jan 20, 2016",1107.10,1099.80,1109.80,1099.80,0.03K,"1,58%"
"Jan 21, 2016",1099.10,1103.60,1103.60,1094.10,0.02K,"-0,72%"
"Jan 22, 2016",1097.20,1098.00,1103.20,1098.00,0.00K,"-0,17%"
"Jan 25, 2016",1106.20,1099.30,1109.30,1099.30,0.01K,"0,82%"
"Jan 26, 2016",1121.70,1115.10,1115.90,1114.30,0.18K,"1,40%"
"Jan 27, 2016",1116.10,1117.80,1117.80,1115.80,0.01K,"-0,50%"
"Jan 28, 2016",1115.60,1125.40,1125.70,1109.80,52.86K,"-0,04%"
"Jan 29, 2016",1116.40,1114.40,1118.60,1108.80,6.96K,"0,07%"
"Feb 01, 2016",1127.90,1116.70,1130.00,1115.30,1.68K,"1,03%"
"Feb 02, 2016",1127.30,1128.30,1131.40,1123.00,1.23K,"-0,05%"
"Feb 03, 2016",1141.30,1128.50,1146.00,1125.00,1.63K,"1,24%"
"Feb 04, 2016",1157.60,1142.50,1157.30,1141.00,0.77K,"1,43%"
"Feb 05, 2016",1157.80,1155.60,1174.80,1146.00,0.88K,"0,02%"
"Feb 08, 2016",1197.90,1173.50,1200.40,1165.00,0.93K,"3,46%"
"Feb 09, 2016",1198.70,1188.70,1199.20,1186.70,0.70K,"0,07%"
"Feb 10, 2016",1194.70,1189.80,1197.70,1182.10,0.67K,"-0,33%"
"Feb 11, 2016",1247.90,1205.60,1260.80,1204.60,1.00K,"4,45%"
"Feb 12, 2016",1239.10,1247.80,1247.80,1233.50,0.25K,"-0,71%"
"Feb 14, 2016",1233.60,1235.70,1235.90,1231.40,-,"-0,44%"
"Feb 15, 2016",1208.10,1234.00,1235.10,1202.80,-,"-2,07%"
"Feb 16, 2016",1207.90,1233.10,1233.60,1193.60,0.42K,"-0,02%"
"Feb 17, 2016",1211.10,1196.50,1212.90,1196.50,0.05K,"0,26%"
"Feb 18, 2016",1226.10,1209.60,1239.20,1201.60,0.32K,"1,24%"
"Feb 19, 2016",1230.40,1230.80,1232.80,1221.80,0.08K,"0,35%"
"Feb 22, 2016",1209.50,1226.10,1226.10,1203.00,0.28K,"-1,70%"
"Feb 23, 2016",1222.30,1207.40,1226.10,1207.40,0.35K,"1,06%"
"Feb 24, 2016",1238.70,1230.00,1250.10,1230.00,0.11K,"1,34%"
"Feb 25, 2016",1238.20,1239.40,1241.50,1235.00,0.05K,"-0,04%"
"Feb 26, 2016",1219.80,1232.40,1239.10,1212.20,0.66K,"-1,49%"
"Feb 29, 2016",1233.90,1218.60,1241.00,1218.60,0.58K,"1,16%"
"Mar 01, 2016",1230.30,1240.50,1248.40,1229.00,0.48K,"-0,29%"
"Mar 02, 2016",1241.10,1232.80,1242.60,1226.00,0.27K,"0,88%"
"Mar 03, 2016",1257.40,1238.40,1267.90,1238.00,0.12K,"1,31%"
"Mar 04, 2016",1269.90,1263.00,1279.90,1250.90,0.27K,"0,99%"
"Mar 07, 2016",1263.20,1259.80,1272.30,1259.70,0.07K,"-0,53%"
"Mar 08, 2016",1262.10,1268.70,1276.30,1261.00,0.04K,"-0,09%"
"Mar 09, 2016",1256.60,1254.50,1260.00,1244.80,0.08K,"-0,44%"
"Mar 10, 2016",1272.00,1250.00,1273.00,1237.50,0.12K,"1,23%"
"Mar 11, 2016",1258.70,1270.00,1280.70,1249.40,0.09K,"-1,05%"
"Mar 14, 2016",1244.40,1256.00,1258.00,1234.50,0.06K,"-1,14%"
"Mar 15, 2016",1230.40,1228.30,1236.00,1228.00,0.04K,"-1,13%"
"Mar 16, 2016",1229.30,1229.50,1263.80,1228.90,0.05K,"-0,09%"
"Mar 17, 2016",1264.50,1261.50,1270.10,1255.90,0.03K,"2,86%"
"Mar 18, 2016",1253.80,1257.10,1264.40,1251.50,0.54K,"-0,85%"
"Mar 21, 2016",1243.80,1256.20,1256.20,1243.40,1.06K,"-0,80%"
"Mar 22, 2016",1248.20,1244.00,1252.40,1243.80,0.02K,"0,35%"
"Mar 23, 2016",1223.70,1247.70,1247.70,1218.60,0.03K,"-1,96%"
"Mar 24, 2016",1221.40,1214.20,1221.30,1214.20,0.01K,"-0,19%"
"Mar 25, 2016",1216.70,1216.70,1216.70,1216.70,-,"-0,38%"
"Mar 28, 2016",1219.90,1211.50,1222.20,1210.00,0.03K,"0,26%"
"Mar 29, 2016",1235.60,1217.80,1217.80,1217.70,0.04K,"1,29%"
"Mar 30, 2016",1226.90,1241.40,1245.00,1223.40,48.25K,"-0,70%"
"Mar 31, 2016",1234.20,1225.60,1239.60,1224.50,3.38K,"0,59%"
"Apr 01, 2016",1222.20,1232.30,1235.20,1209.20,1.60K,"-0,97%"
"Apr 04, 2016",1218.00,1221.70,1222.30,1215.00,2.04K,"-0,34%"
"Apr 05, 2016",1228.40,1215.40,1236.70,1215.40,0.48K,"0,85%"
"Apr 06, 2016",1222.50,1230.40,1230.40,1217.60,0.25K,"-0,48%"
"Apr 07, 2016",1236.20,1224.80,1242.90,1224.60,0.38K,"1,12%"
"Apr 08, 2016",1242.50,1241.00,1242.80,1232.00,0.41K,"0,51%"
"Apr 11, 2016",1256.70,1241.50,1258.70,1241.50,0.44K,"1,14%"
"Apr 12, 2016",1259.40,1260.00,1261.70,1253.70,0.19K,"0,21%"
"Apr 13, 2016",1246.80,1256.50,1256.90,1241.30,0.20K,"-1,00%"
"Apr 14, 2016",1225.00,1231.40,1243.70,1224.50,0.26K,"-1,75%"
"Apr 15, 2016",1233.10,1225.70,1235.00,1225.70,0.10K,"0,66%"
"Apr 18, 2016",1233.60,1238.70,1241.10,1232.20,0.30K,"0,04%"
"Apr 19, 2016",1253.00,1231.60,1256.20,1228.80,0.39K,"1,57%"
"Apr 20, 2016",1253.20,1256.10,1256.10,1243.00,0.18K,"0,02%"
"Apr 21, 2016",1249.00,1247.70,1270.60,1247.60,0.12K,"-0,34%"
"Apr 22, 2016",1228.70,1248.50,1248.50,1228.00,0.19K,"-1,63%"
"Apr 25, 2016",1238.90,1231.60,1240.90,1231.60,0.44K,"0,83%"
"Apr 26, 2016",1242.20,1239.80,1244.20,1233.00,0.10K,"0,27%"
"Apr 27, 2016",1249.20,1248.60,1249.50,1248.60,0.04K,"0,56%"
"Apr 28, 2016",1265.50,1245.90,1270.10,1238.50,0.89K,"1,30%"
"Apr 29, 2016",1289.20,1267.30,1295.50,1267.20,0.46K,"1,87%"
"May 02, 2016",1294.70,1292.10,1304.40,1290.40,0.19K,"0,43%"
"May 03, 2016",1290.70,1292.70,1301.50,1284.50,0.15K,"-0,31%"
"May 04, 2016",1273.30,1286.90,1290.00,1273.00,0.11K,"-1,35%"
"May 05, 2016",1271.40,1282.90,1286.00,1270.80,0.33K,"-0,15%"
"May 06, 2016",1292.90,1278.60,1295.60,1276.90,0.31K,"1,69%"
"May 09, 2016",1265.60,1286.50,1286.50,1262.30,0.34K,"-2,11%"
"May 10, 2016",1263.90,1265.10,1267.40,1258.70,0.02K,"-0,13%"
"May 11, 2016",1274.60,1266.90,1279.20,1266.90,0.05K,"0,85%"
"May 12, 2016",1270.30,1267.00,1281.20,1264.00,0.10K,"-0,34%"
"May 13, 2016",1271.90,1271.40,1275.70,1264.60,0.07K,"0,13%"
"May 16, 2016",1273.40,1272.80,1287.80,1272.80,0.04K,"0,12%"
"May 17, 2016",1276.20,1272.50,1281.60,1270.80,0.02K,"0,22%"
"May 18, 2016",1273.70,1276.40,1276.40,1256.80,0.02K,"-0,20%"
"May 19, 2016",1254.20,1248.00,1255.50,1247.50,0.07K,"-1,53%"
"May 20, 2016",1252.40,1256.60,1256.60,1255.40,0.04K,"-0,14%"
"May 23, 2016",1251.10,1251.60,1251.60,1247.50,0.06K,"-0,10%"
"May 24, 2016",1228.90,1240.00,1240.00,1228.20,0.02K,"-1,77%"
"May 25, 2016",1223.50,1219.30,1219.30,1218.60,0.01K,"-0,44%"
"May 26, 2016",1220.10,1232.60,1232.60,1230.60,0.00K,"-0,28%"
"May 27, 2016",1213.80,1220.30,1223.20,1206.40,63.74K,"-0,52%"
"May 30, 2016",1212.15,1208.25,1213.15,1201.80,-,"-0,14%"
"May 31, 2016",1214.80,1212.50,1217.60,1199.00,6.43K,"0,22%"
"Jun 01, 2016",1211.90,1215.70,1219.80,1205.40,2.72K,"-0,24%"
"Jun 02, 2016",1209.80,1212.40,1217.00,1209.60,1.63K,"-0,17%"
"Jun 03, 2016",1240.10,1209.10,1244.50,1206.40,1.62K,"2,50%"
"Jun 06, 2016",1244.60,1244.40,1247.30,1240.00,1.14K,"0,36%"
"Jun 07, 2016",1244.40,1244.00,1244.90,1236.50,0.28K,"-0,02%"
"Jun 08, 2016",1259.80,1247.60,1264.00,1247.30,0.41K,"1,24%"
"Jun 09, 2016",1270.20,1262.50,1271.40,1258.10,0.38K,"0,83%"
"Jun 10, 2016",1273.40,1267.60,1278.00,1265.30,0.40K,"0,25%"
"Jun 13, 2016",1284.40,1276.20,1287.30,1273.00,0.33K,"0,86%"
"Jun 14, 2016",1285.60,1281.80,1289.70,1277.80,0.55K,"0,09%"
"Jun 15, 2016",1285.80,1284.60,1296.20,1278.80,0.16K,"0,02%"
"Jun 16, 2016",1296.10,1296.30,1316.40,1281.10,0.25K,"0,80%"
"Jun 17, 2016",1292.50,1280.30,1300.10,1280.30,0.13K,"-0,28%"
"Jun 20, 2016",1290.00,1288.90,1291.20,1280.30,0.15K,"-0,19%"
"Jun 21, 2016",1270.50,1293.90,1293.90,1266.30,0.13K,"-1,51%"
"Jun 22, 2016",1268.00,1267.00,1269.20,1264.90,0.05K,"-0,20%"
"Jun 23, 2016",1261.20,1263.40,1270.50,1255.20,0.22K,"-0,54%"
"Jun 24, 2016",1320.00,1253.70,1355.60,1253.70,0.69K,"4,66%"
"Jun 27, 2016",1322.50,1330.00,1331.70,1320.00,0.09K,"0,19%"
"Jun 28, 2016",1315.30,1314.80,1315.60,1314.10,0.02K,"-0,54%"
"Jun 29, 2016",1323.90,1311.60,1327.40,1311.60,0.41K,"0,65%"
"Jun 30, 2016",1318.40,1315.80,1323.50,1314.50,0.56K,"-0,42%"
"Jul 01, 2016",1336.70,1324.50,1344.20,1321.90,0.14K,"1,39%"
"Jul 03, 2016",1345.50,1344.50,1347.55,1338.85,-,"0,66%"
"Jul 04, 2016",1352.00,1345.00,1360.15,1343.00,-,"0,48%"
"Jul 05, 2016",1356.40,1342.20,1356.80,1339.70,0.09K,"0,33%"
"Jul 06, 2016",1364.90,1359.00,1374.90,1359.00,0.13K,"0,63%"
"Jul 07, 2016",1360.10,1366.80,1368.60,1350.50,0.21K,"-0,35%"
"Jul 08, 2016",1356.60,1361.30,1365.80,1335.00,0.25K,"-0,26%"
"Jul 11, 2016",1355.00,1371.70,1371.80,1353.00,0.03K,"-0,12%"
"Jul 12, 2016",1334.10,1353.60,1356.00,1330.30,0.25K,"-1,54%"
"Jul 13, 2016",1342.40,1341.50,1341.50,1336.70,0.01K,"0,62%"
"Jul 14, 2016",1331.30,1341.40,1341.40,1322.70,0.02K,"-0,83%"
"Jul 15, 2016",1326.50,1333.70,1333.70,1322.90,0.05K,"-0,36%"
"Jul 18, 2016",1328.40,1327.50,1335.00,1326.20,0.05K,"0,14%"
"Jul 19, 2016",1331.50,1328.50,1333.20,1326.40,0.32K,"0,23%"
"Jul 20, 2016",1318.80,1331.00,1337.50,1315.50,0.75K,"-0,95%"
"Jul 21, 2016",1330.50,1312.80,1329.50,1312.80,0.32K,"0,89%"
"Jul 22, 2016",1323.10,1330.70,1330.70,1320.40,0.06K,"-0,56%"
"Jul 25, 2016",1319.30,1315.70,1318.10,1313.80,0.55K,"-0,29%"
"Jul 26, 2016",1320.70,1315.20,1320.30,1315.20,0.06K,"0,11%"
"Jul 27, 2016",1326.60,1326.00,1326.30,1326.00,0.00K,"0,45%"
"Jul 28, 2016",1332.30,1339.50,1344.30,1330.10,56.91K,"0,43%"
"Jul 29, 2016",1349.00,1333.20,1353.30,1325.80,6.08K,"1,25%"
"Aug 01, 2016",1351.40,1348.80,1353.50,1345.60,1.26K,"0,18%"
"Aug 02, 2016",1364.40,1352.10,1366.00,1346.60,2.94K,"0,96%"
"Aug 03, 2016",1356.10,1362.40,1364.70,1353.30,0.72K,"-0,61%"
"Aug 04, 2016",1358.80,1354.40,1361.60,1347.00,0.38K,"0,20%"
"Aug 05, 2016",1336.40,1357.60,1360.80,1333.70,1.11K,"-1,65%"
"Aug 08, 2016",1333.40,1330.00,1335.40,1327.80,0.59K,"-0,22%"
"Aug 09, 2016",1339.00,1331.80,1339.40,1328.50,0.62K,"0,42%"
"Aug 10, 2016",1344.30,1344.80,1354.20,1344.70,0.11K,"0,40%"
"Aug 11, 2016",1342.50,1341.60,1350.40,1334.80,0.67K,"-0,13%"
"Aug 12, 2016",1335.80,1336.80,1351.80,1333.20,0.11K,"-0,50%"
"Aug 15, 2016",1340.30,1336.50,1340.60,1333.60,0.06K,"0,34%"
"Aug 16, 2016",1350.50,1342.20,1355.00,1341.00,0.34K,"0,76%"
"Aug 17, 2016",1342.70,1345.50,1347.30,1338.60,0.14K,"-0,58%"
"Aug 18, 2016",1351.20,1351.30,1354.40,1348.20,0.14K,"0,63%"
"Aug 19, 2016",1340.40,1350.10,1350.10,1338.60,0.20K,"-0,80%"
"Aug 22, 2016",1337.70,1334.40,1337.70,1333.30,0.12K,"-0,20%"
"Aug 23, 2016",1340.60,1337.00,1341.20,1334.30,0.55K,"0,22%"
"Aug 24, 2016",1324.40,1337.20,1337.20,1322.90,0.26K,"-1,21%"
"Aug 25, 2016",1320.10,1321.40,1324.00,1317.00,0.06K,"-0,32%"
"Aug 26, 2016",1321.50,1323.80,1340.50,1320.10,0.14K,"0,11%"
"Aug 29, 2016",1322.90,1315.00,1323.00,1315.00,0.04K,"0,11%"
"Aug 30, 2016",1311.70,1322.00,1322.10,1308.00,0.71K,"-0,85%"
"Aug 31, 2016",1306.90,1310.30,1313.70,1306.30,0.21K,"-0,37%"
"Sep 01, 2016",1312.20,1305.30,1313.10,1301.50,0.23K,"0,41%"
"Sep 02, 2016",1322.10,1309.60,1326.70,1309.20,0.06K,"0,75%"
"Sep 04, 2016",1326.25,1328.20,1328.75,1326.15,-,"0,31%"
"Sep 05, 2016",1331.10,1326.35,1332.15,1325.55,-,"0,37%"
"Sep 06, 2016",1349.40,1323.30,1347.20,1323.20,0.05K,"1,37%"
"Sep 07, 2016",1344.30,1348.40,1350.50,1343.90,0.01K,"-0,38%"
"Sep 08, 2016",1336.80,1344.80,1345.40,1335.70,0.03K,"-0,56%"
"Sep 09, 2016",1330.10,1338.50,1338.50,1328.00,0.04K,"-0,50%"
"Sep 12, 2016",1321.00,1327.00,1329.30,1319.90,0.18K,"-0,68%"
"Sep 13, 2016",1319.00,1324.60,1324.60,1315.00,0.08K,"-0,15%"
"Sep 14, 2016",1321.50,1319.20,1322.30,1319.20,0.07K,"0,19%"
"Sep 15, 2016",1313.50,1320.70,1320.70,1310.80,0.04K,"-0,61%"
"Sep 16, 2016",1305.80,1312.20,1312.60,1311.90,0.00K,"-0,59%"
"Sep 19, 2016",1313.50,1313.50,1313.50,1313.50,0.02K,"0,59%"
"Sep 20, 2016",1313.70,1313.70,1313.70,1313.70,0.10K,"0,02%"
"Sep 21, 2016",1326.90,1326.30,1326.30,1324.00,0.08K,"1,00%"
"Sep 22, 2016",1340.40,1338.60,1338.60,1338.20,0.02K,"1,02%"
"Sep 23, 2016",1337.20,1337.20,1337.20,1337.20,0.04K,"-0,24%"
"Sep 26, 2016",1339.70,1335.20,1341.80,1335.20,0.02K,"0,19%"
"Sep 27, 2016",1325.90,1328.00,1328.70,1327.90,0.05K,"-1,03%"
"Sep 28, 2016",1319.40,1319.40,1319.40,1319.40,0.10K,"-0,49%"
"Sep 29, 2016",1321.70,1321.20,1325.00,1314.70,6.11K,"0,17%"
"Sep 30, 2016",1313.30,1320.60,1327.70,1312.90,0.87K,"-0,64%"
"Oct 03, 2016",1309.00,1313.50,1316.80,1308.20,0.30K,"-0,33%"
"Oct 04, 2016",1266.30,1307.60,1310.20,1266.30,1.89K,"-3,26%"
"Oct 05, 2016",1265.20,1272.10,1274.00,1261.30,0.25K,"-0,09%"
"Oct 06, 2016",1249.80,1265.30,1265.30,1249.90,0.11K,"-1,22%"
"Oct 07, 2016",1248.90,1253.90,1263.60,1249.50,0.17K,"-0,07%"
"Oct 10, 2016",1257.50,1258.80,1260.40,1256.90,0.03K,"0,69%"
"Oct 11, 2016",1253.00,1258.90,1258.90,1253.80,0.03K,"-0,36%"
"Oct 12, 2016",1251.10,1251.70,1254.00,1251.70,0.13K,"-0,15%"
"Oct 13, 2016",1255.00,1258.70,1259.00,1255.20,0.32K,"0,31%"
"Oct 14, 2016",1253.10,1253.90,1253.90,1250.60,0.31K,"-0,15%"
"Oct 17, 2016",1254.40,1249.90,1255.00,1249.90,0.04K,"0,10%"
"Oct 18, 2016",1260.80,1260.90,1261.70,1260.90,0.01K,"0,51%"
"Oct 19, 2016",1267.90,1262.90,1271.50,1262.90,0.22K,"0,56%"
"Oct 20, 2016",1265.60,1270.00,1270.50,1265.50,0.42K,"-0,18%"
"Oct 21, 2016",1265.90,1265.90,1265.90,1265.90,0.22K,"0,02%"
"Oct 24, 2016",1262.00,1269.20,1269.20,1261.80,0.04K,"-0,31%"
"Oct 25, 2016",1271.90,1264.10,1274.10,1264.10,0.06K,"0,78%"
"Oct 26, 2016",1264.80,1274.00,1274.00,1270.00,0.28K,"-0,56%"
"Oct 27, 2016",1267.90,1269.40,1269.40,1269.40,0.07K,"0,25%"
"Oct 28, 2016",1275.50,1270.30,1281.50,1262.00,0.56K,"0,60%"
"Oct 31, 2016",1271.50,1276.60,1276.60,1272.20,0.06K,"-0,31%"
"Nov 01, 2016",1286.40,1279.30,1290.70,1279.00,0.05K,"1,17%"
"Nov 02, 2016",1306.80,1288.30,1307.00,1288.30,0.03K,"1,59%"
"Nov 03, 2016",1302.10,1296.40,1303.10,1287.30,0.07K,"-0,36%"
"Nov 04, 2016",1303.30,1300.00,1300.00,1296.70,0.01K,"0,09%"
"Nov 07, 2016",1278.30,1292.00,1294.50,1280.20,0.03K,"-1,92%"
"Nov 08, 2016",1273.40,1284.10,1289.40,1273.20,0.05K,"-0,38%"
"Nov 09, 2016",1272.60,1272.20,1318.60,1270.00,0.11K,"-0,06%"
"Nov 10, 2016",1265.50,1274.40,1287.50,1253.30,0.06K,"-0,56%"
"Nov 11, 2016",1223.50,1253.70,1258.70,1219.10,0.60K,"-3,32%"
"Nov 14, 2016",1221.20,1227.80,1229.50,1210.40,0.22K,"-0,19%"
"Nov 15, 2016",1224.00,1224.30,1226.00,1222.50,0.02K,"0,23%"
"Nov 16, 2016",1223.40,1229.30,1229.30,1223.00,0.07K,"-0,05%"
"Nov 17, 2016",1216.50,1224.60,1225.00,1211.00,1.14K,"-0,56%"
"Nov 18, 2016",1208.50,1211.90,1211.90,1207.20,0.61K,"-0,66%"
"Nov 21, 2016",1209.60,1209.60,1209.60,1209.60,-,"0,09%"
"Nov 22, 2016",1211.00,1210.40,1211.10,1207.60,0.02K,"0,12%"
"Nov 23, 2016",1189.10,1212.80,1213.80,1186.80,0.31K,"-1,81%"
"Nov 24, 2016",1185.55,1189.20,1190.30,1179.75,-,"-0,30%"
"Nov 25, 2016",1178.20,1177.00,1189.30,1177.00,0.01K,"-0,62%"
"Nov 28, 2016",1190.60,1188.00,1190.20,1188.00,0.02K,"1,05%"
"Nov 29, 2016",1187.90,1193.20,1194.80,1179.40,42.12K,"-0,23%"
"Nov 30, 2016",1170.80,1187.10,1193.30,1167.90,7.16K,"-1,44%"
"Dec 01, 2016",1166.90,1172.70,1174.60,1160.00,1.59K,"-0,33%"
"Dec 02, 2016",1175.10,1172.30,1177.30,1166.40,1.52K,"0,70%"
"Dec 05, 2016",1174.00,1181.80,1186.70,1157.00,0.36K,"-0,09%"
"Dec 06, 2016",1167.60,1170.90,1174.50,1167.10,0.65K,"-0,55%"
"Dec 07, 2016",1175.00,1167.70,1178.50,1166.40,0.18K,"0,63%"
"Dec 08, 2016",1169.80,1173.80,1177.80,1169.10,0.32K,"-0,44%"
"Dec 09, 2016",1159.40,1166.60,1168.80,1156.00,0.37K,"-0,89%"
"Dec 12, 2016",1163.50,1158.30,1163.90,1153.00,0.33K,"0,35%"
"Dec 13, 2016",1156.70,1163.50,1164.00,1155.40,0.64K,"-0,58%"
"Dec 14, 2016",1161.30,1159.80,1164.00,1142.00,0.49K,"0,40%"
"Dec 15, 2016",1127.80,1139.80,1143.30,1123.90,0.24K,"-2,88%"
"Dec 16, 2016",1135.30,1126.90,1140.90,1126.90,0.15K,"0,67%"
"Dec 19, 2016",1140.50,1139.40,1140.70,1137.90,0.25K,"0,46%"
"Dec 20, 2016",1131.50,1133.50,1133.50,1126.50,0.05K,"-0,79%"
"Dec 21, 2016",1131.10,1136.10,1136.10,1130.00,0.05K,"-0,04%"
"Dec 22, 2016",1128.80,1131.20,1132.80,1128.30,0.10K,"-0,20%"
"Dec 23, 2016",1131.90,1130.90,1132.80,1130.30,0.07K,"0,27%"
"Dec 25, 2016",1135.00,1135.00,1135.00,1135.00,-,"0,27%"
"Dec 26, 2016",1134.55,1135.00,1136.05,1134.00,-,"-0,04%"
"Dec 27, 2016",1137.30,1134.30,1142.20,1134.30,0.08K,"0,24%"
"Dec 28, 2016",1139.40,1141.20,1141.20,1138.00,0.21K,"0,18%"
"Dec 29, 2016",1156.40,1143.80,1158.80,1143.60,0.95K,"1,49%"
"Dec 30, 2016",1150.00,1162.00,1162.00,1151.00,0.02K,"-0,55%"
"Jan 02, 2017",1151.05,1151.00,1153.25,1150.00,-,"0,09%"
"Jan 03, 2017",1160.40,1155.20,1160.80,1146.50,0.05K,"0,81%"
"Jan 04, 2017",1163.80,1156.30,1165.00,1156.30,0.04K,"0,29%"
"Jan 05, 2017",1179.70,1172.00,1183.30,1171.50,0.50K,"1,37%"
"Jan 06, 2017",1171.90,1176.50,1176.50,1172.00,0.02K,"-0,66%"
"Jan 09, 2017",1183.50,1173.90,1183.60,1173.00,0.06K,"0,99%"
"Jan 10, 2017",1184.20,1184.30,1188.90,1182.30,0.01K,"0,06%"
"Jan 11, 2017",1195.60,1187.50,1197.00,1176.50,0.02K,"0,96%"
"Jan 12, 2017",1198.90,1192.70,1204.30,1192.30,0.11K,"0,28%"
"Jan 13, 2017",1195.30,1195.70,1196.00,1187.70,0.07K,"-0,30%"
"Jan 15, 2017",1203.35,1197.30,1205.05,1197.30,-,"0,67%"
"Jan 16, 2017",1202.85,1203.25,1208.45,1200.00,-,"-0,04%"
"Jan 17, 2017",1212.00,1205.50,1214.60,1200.80,0.08K,"0,76%"
"Jan 18, 2017",1211.30,1213.60,1214.70,1203.10,0.11K,"-0,06%"
"Jan 19, 2017",1200.90,1200.50,1204.00,1195.80,0.03K,"-0,86%"
"Jan 20, 2017",1204.30,1202.80,1212.10,1202.80,0.04K,"0,28%"
"Jan 23, 2017",1215.00,1212.00,1213.60,1210.00,0.02K,"0,89%"
"Jan 24, 2017",1210.30,1219.00,1219.00,1207.70,0.02K,"-0,39%"
"Jan 25, 2017",1197.30,1202.00,1202.80,1194.90,0.40K,"-1,07%"
"Jan 26, 2017",1189.50,1199.70,1199.70,1185.60,0.02K,"-0,65%"
"Jan 27, 2017",1188.10,1187.90,1188.30,1187.90,0.02K,"-0,12%"
"Jan 30, 2017",1193.20,1191.70,1198.50,1187.10,50.50K,"0,43%"
"Jan 31, 2017",1208.60,1194.90,1214.70,1193.50,3.21K,"1,29%"
"Feb 01, 2017",1205.60,1211.90,1211.90,1197.90,1.15K,"-0,25%"
"Feb 02, 2017",1216.70,1209.70,1224.20,1208.90,1.51K,"0,92%"
"Feb 03, 2017",1218.50,1214.90,1220.60,1206.20,0.87K,"0,15%"
"Feb 06, 2017",1230.00,1221.90,1235.40,1218.50,0.91K,"0,94%"
"Feb 07, 2017",1234.20,1234.20,1236.20,1228.50,1.18K,"0,34%"
"Feb 08, 2017",1237.60,1232.10,1243.90,1231.00,0.29K,"0,28%"
"Feb 09, 2017",1235.10,1239.40,1243.50,1226.90,0.89K,"-0,20%"
"Feb 10, 2017",1234.40,1227.60,1234.30,1221.50,0.39K,"-0,06%"
"Feb 13, 2017",1224.40,1230.50,1231.10,1219.00,0.40K,"-0,81%"
"Feb 14, 2017",1223.90,1225.90,1233.50,1222.10,0.16K,"-0,04%"
"Feb 15, 2017",1231.70,1225.50,1231.50,1217.30,0.18K,"0,64%"
"Feb 16, 2017",1240.00,1234.50,1240.70,1233.20,0.09K,"0,67%"
"Feb 17, 2017",1237.60,1240.70,1241.20,1234.80,0.30K,"-0,19%"
"Feb 19, 2017",1237.30,1236.00,1239.25,1236.00,-,"-0,02%"
"Feb 20, 2017",1238.20,1237.25,1240.15,1233.50,-,"0,07%"
"Feb 21, 2017",1237.50,1237.30,1237.30,1228.10,0.12K,"-0,06%"
"Feb 22, 2017",1232.00,1236.10,1238.60,1231.80,0.04K,"-0,44%"
"Feb 23, 2017",1250.20,1236.10,1250.30,1236.10,0.11K,"1,48%"
"Feb 24, 2017",1256.90,1250.00,1258.80,1250.00,0.09K,"0,54%"
"Feb 27, 2017",1257.40,1254.70,1263.10,1250.40,0.54K,"0,04%"
"Feb 28, 2017",1252.60,1253.60,1257.30,1247.20,0.72K,"-0,38%"
"Mar 01, 2017",1248.90,1247.80,1248.30,1236.90,0.14K,"-0,30%"
"Mar 02, 2017",1231.90,1247.20,1247.60,1230.70,0.08K,"-1,36%"
"Mar 03, 2017",1225.50,1231.70,1235.20,1222.90,0.12K,"-0,52%"
"Mar 06, 2017",1224.50,1235.20,1235.20,1225.70,0.03K,"-0,08%"
"Mar 07, 2017",1215.10,1224.30,1225.40,1213.70,0.05K,"-0,77%"
"Mar 08, 2017",1208.50,1212.20,1212.20,1206.70,0.02K,"-0,54%"
"Mar 09, 2017",1202.40,1204.50,1205.60,1202.30,0.04K,"-0,50%"
"Mar 10, 2017",1200.70,1196.20,1203.30,1196.20,0.00K,"-0,14%"
"Mar 13, 2017",1202.40,1206.20,1210.00,1202.30,0.04K,"0,14%"
"Mar 14, 2017",1201.90,1203.10,1205.90,1196.80,0.02K,"-0,04%"
"Mar 15, 2017",1200.10,1198.20,1221.20,1197.70,0.04K,"-0,15%"
"Mar 16, 2017",1226.50,1222.20,1231.40,1222.20,0.05K,"2,20%"
"Mar 17, 2017",1229.80,1227.10,1230.90,1227.10,0.03K,"0,27%"
"Mar 20, 2017",1233.60,1229.30,1234.40,1229.30,0.02K,"0,31%"
"Mar 21, 2017",1246.10,1226.40,1245.20,1226.40,0.01K,"1,01%"
"Mar 22, 2017",1249.30,1247.90,1249.50,1247.70,0.00K,"0,26%"
"Mar 23, 2017",1246.90,1246.40,1247.50,1244.80,0.02K,"-0,19%"
"Mar 24, 2017",1248.20,1248.00,1248.30,1247.60,0.00K,"0,10%"
"Mar 27, 2017",1255.40,1255.80,1257.70,1253.80,0.07K,"0,58%"
"Mar 28, 2017",1255.30,1255.90,1255.90,1255.90,0.02K,"-0,01%"
"Mar 29, 2017",1253.40,1252.20,1252.20,1252.10,0.04K,"-0,15%"
"Mar 30, 2017",1245.00,1253.10,1253.60,1241.10,51.33K,"-0,67%"
"Mar 31, 2017",1247.30,1242.10,1248.80,1238.70,8.22K,"0,18%"
"Apr 03, 2017",1250.80,1247.50,1252.40,1243.60,1.16K,"0,28%"
"Apr 04, 2017",1255.00,1253.10,1260.30,1253.00,0.72K,"0,34%"
"Apr 05, 2017",1245.40,1255.40,1255.40,1243.00,0.91K,"-0,76%"
"Apr 06, 2017",1250.30,1256.10,1257.50,1249.00,0.17K,"0,39%"
"Apr 07, 2017",1254.30,1249.50,1269.10,1249.50,0.45K,"0,32%"
"Apr 10, 2017",1251.10,1252.70,1255.20,1246.80,0.18K,"-0,26%"
"Apr 11, 2017",1271.20,1254.50,1273.50,1254.50,0.40K,"1,61%"
"Apr 12, 2017",1275.30,1275.00,1285.10,1272.00,0.49K,"0,32%"
"Apr 13, 2017",1285.90,1285.30,1287.60,1282.00,0.92K,"0,83%"
"Apr 14, 2017",1289.65,1289.65,1289.65,1289.65,-,"0,29%"
"Apr 17, 2017",1289.40,1291.80,1294.80,1284.30,0.07K,"-0,02%"
"Apr 18, 2017",1291.70,1283.90,1290.60,1278.60,0.39K,"0,18%"
"Apr 19, 2017",1281.40,1288.00,1288.00,1274.00,0.19K,"-0,80%"
"Apr 20, 2017",1281.90,1279.70,1281.50,1276.20,0.13K,"0,04%"
"Apr 21, 2017",1287.40,1279.80,1287.00,1279.20,0.47K,"0,43%"
"Apr 24, 2017",1275.80,1275.00,1276.40,1265.00,0.61K,"-0,90%"
"Apr 25, 2017",1265.60,1275.60,1276.90,1262.10,0.36K,"-0,80%"
"Apr 26, 2017",1262.10,1266.00,1266.00,1262.40,0.10K,"-0,28%"
"Apr 27, 2017",1263.70,1266.70,1267.20,1262.20,0.21K,"0,13%"
"Apr 28, 2017",1266.10,1265.90,1267.20,1264.70,0.09K,"0,19%"
"May 01, 2017",1253.30,1268.70,1269.30,1254.00,0.03K,"-1,01%"
"May 02, 2017",1255.10,1256.20,1256.20,1251.20,0.09K,"0,14%"
"May 03, 2017",1246.40,1255.10,1255.80,1238.70,0.20K,"-0,69%"
"May 04, 2017",1226.50,1239.80,1239.80,1224.20,0.07K,"-1,60%"
"May 05, 2017",1224.80,1227.00,1233.70,1225.10,0.02K,"-0,14%"
"May 08, 2017",1225.30,1224.00,1234.00,1224.00,0.04K,"0,04%"
"May 09, 2017",1214.30,1226.10,1226.20,1214.00,0.06K,"-0,90%"
"May 10, 2017",1217.30,1219.80,1220.20,1217.80,0.02K,"0,25%"
"May 11, 2017",1222.70,1218.50,1220.00,1218.30,0.01K,"0,44%"
"May 12, 2017",1226.20,1228.00,1229.50,1226.10,0.03K,"0,29%"
"May 15, 2017",1228.60,1227.50,1232.70,1227.50,0.01K,"0,20%"
"May 16, 2017",1235.00,1230.40,1237.30,1230.40,0.02K,"0,52%"
"May 17, 2017",1257.50,1241.00,1259.20,1240.70,0.03K,"1,82%"
"May 18, 2017",1251.70,1254.80,1260.00,1245.80,0.04K,"-0,46%"
"May 19, 2017",1252.70,1252.70,1252.70,1252.70,0.01K,"0,08%"
"May 22, 2017",1260.70,1251.70,1252.00,1251.70,0.01K,"0,64%"
"May 23, 2017",1254.80,1261.50,1261.60,1250.60,0.02K,"-0,47%"
"May 24, 2017",1252.40,1251.90,1257.80,1249.70,0.01K,"-0,19%"
"May 25, 2017",1255.80,1257.10,1258.30,1256.20,0.01K,"0,27%"
"May 26, 2017",1267.60,1267.60,1267.60,1267.60,0.00K,"0,94%"
"May 28, 2017",1268.22,1266.31,1269.02,1266.31,-,"0,05%"
"May 29, 2017",1266.69,1268.02,1268.60,1264.96,-,"-0,12%"
"May 30, 2017",1262.10,1267.40,1270.00,1258.40,129.82K,"-0,36%"
"May 31, 2017",1272.00,1262.40,1273.20,1258.50,2.71K,"0,78%"
"Jun 01, 2017",1267.00,1268.00,1269.20,1260.80,0.83K,"-0,39%"
"Jun 02, 2017",1276.80,1265.20,1279.00,1259.00,1.73K,"0,77%"
"Jun 05, 2017",1279.30,1279.20,1282.00,1277.00,0.43K,"0,20%"
"Jun 06, 2017",1294.40,1279.40,1295.20,1279.40,0.94K,"1,18%"
"Jun 07, 2017",1290.10,1291.60,1293.10,1284.30,0.64K,"-0,33%"
"Jun 08, 2017",1276.30,1285.40,1287.60,1268.10,0.32K,"-1,07%"
"Jun 09, 2017",1268.50,1277.90,1277.90,1264.60,0.47K,"-0,61%"
"Jun 12, 2017",1266.10,1266.40,1269.30,1263.20,0.26K,"-0,19%"
"Jun 13, 2017",1265.80,1264.10,1266.90,1259.70,0.15K,"-0,02%"
"Jun 14, 2017",1272.80,1269.40,1278.00,1256.80,0.34K,"0,55%"
"Jun 15, 2017",1252.20,1263.20,1264.20,1250.30,0.74K,"-1,62%"
"Jun 16, 2017",1254.00,1252.80,1255.30,1251.30,0.03K,"0,14%"
"Jun 19, 2017",1244.20,1252.10,1252.20,1241.90,0.11K,"-0,78%"
"Jun 20, 2017",1241.00,1242.20,1245.50,1240.50,0.08K,"-0,26%"
"Jun 21, 2017",1243.40,1244.10,1245.00,1240.00,0.21K,"0,19%"
"Jun 22, 2017",1247.60,1251.00,1252.70,1246.30,0.16K,"0,34%"
"Jun 23, 2017",1256.20,1250.00,1273.60,1249.80,0.27K,"0,69%"
"Jun 26, 2017",1246.30,1260.20,1260.20,1241.60,0.19K,"-0,79%"
"Jun 27, 2017",1246.40,1251.60,1251.80,1245.90,0.11K,"0,01%"
"Jun 28, 2017",1248.00,1248.50,1248.50,1248.50,0.01K,"0,13%"
"Jun 29, 2017",1244.20,1248.20,1250.70,1238.10,0.54K,"-0,30%"
"Jun 30, 2017",1240.70,1243.70,1243.70,1239.10,0.04K,"-0,28%"
"Jul 03, 2017",1217.90,1236.00,1236.00,1218.30,0.03K,"-1,84%"
"Jul 04, 2017",1227.55,1224.30,1228.03,1221.49,-,"0,79%"
"Jul 05, 2017",1220.40,1222.50,1225.00,1217.10,0.04K,"-0,58%"
"Jul 06, 2017",1222.20,1225.10,1225.10,1222.40,0.01K,"0,15%"
"Jul 07, 2017",1208.60,1219.10,1220.40,1213.20,0.12K,"-1,11%"
"Jul 10, 2017",1212.10,1211.40,1212.00,1209.60,0.03K,"0,29%"
"Jul 11, 2017",1213.60,1208.70,1214.90,1208.70,0.01K,"0,12%"
"Jul 12, 2017",1218.10,1218.30,1219.40,1217.90,0.01K,"0,37%"
"Jul 13, 2017",1216.30,1221.40,1221.40,1216.50,0.01K,"-0,15%"
"Jul 14, 2017",1226.60,1214.90,1227.50,1214.80,0.02K,"0,85%"
"Jul 17, 2017",1232.80,1229.90,1233.40,1229.90,0.01K,"0,51%"
"Jul 18, 2017",1241.10,1236.20,1241.20,1236.20,0.03K,"0,67%"
"Jul 19, 2017",1241.20,1240.40,1240.40,1240.10,0.00K,"0,01%"
"Jul 20, 2017",1244.80,1236.60,1236.80,1236.60,0.01K,"0,29%"
"Jul 21, 2017",1254.30,1250.70,1251.10,1250.50,0.02K,"0,76%"
"Jul 24, 2017",1253.90,1256.00,1256.00,1254.10,0.01K,"-0,03%"
"Jul 25, 2017",1251.70,1252.70,1253.60,1249.20,0.02K,"-0,18%"
"Jul 26, 2017",1249.00,1244.80,1247.40,1244.80,0.01K,"-0,22%"
"Jul 27, 2017",1259.60,1259.60,1259.60,1259.60,0.05K,"0,85%"
"Jul 28, 2017",1268.40,1258.40,1270.00,1256.90,64.18K,"0,70%"
"Jul 31, 2017",1266.60,1268.90,1270.80,1265.80,7.78K,"-0,14%"
"Aug 01, 2017",1272.60,1268.40,1273.30,1262.00,1.06K,"0,47%"
"Aug 02, 2017",1271.80,1268.50,1272.10,1262.90,0.39K,"-0,06%"
"Aug 03, 2017",1267.80,1265.90,1269.80,1256.60,0.88K,"-0,31%"
"Aug 04, 2017",1258.30,1269.00,1269.60,1253.90,0.52K,"-0,75%"
"Aug 07, 2017",1258.20,1258.70,1259.10,1255.30,0.26K,"-0,01%"
"Aug 08, 2017",1256.40,1256.90,1264.10,1251.40,0.56K,"-0,14%"
"Aug 09, 2017",1273.00,1260.20,1277.80,1260.20,0.57K,"1,32%"
"Aug 10, 2017",1283.70,1276.60,1287.40,1274.90,0.61K,"0,84%"
"Aug 11, 2017",1287.70,1286.30,1291.10,1282.00,0.14K,"0,31%"
"Aug 14, 2017",1284.20,1288.40,1288.40,1278.80,0.34K,"-0,27%"
"Aug 15, 2017",1273.70,1280.50,1280.50,1267.40,0.19K,"-0,82%"
"Aug 16, 2017",1276.90,1271.30,1282.60,1269.40,0.11K,"0,25%"
"Aug 17, 2017",1286.40,1283.80,1288.50,1283.20,0.04K,"0,74%"
"Aug 18, 2017",1285.70,1288.60,1300.70,1284.30,0.36K,"-0,05%"
"Aug 21, 2017",1290.80,1285.20,1290.80,1284.70,0.02K,"0,40%"
"Aug 22, 2017",1285.10,1287.20,1288.40,1283.20,0.10K,"-0,44%"
"Aug 23, 2017",1288.90,1289.40,1289.40,1286.90,0.25K,"0,30%"
"Aug 24, 2017",1286.50,1288.70,1288.70,1284.00,0.55K,"-0,19%"
"Aug 25, 2017",1292.50,1285.40,1292.70,1280.30,0.28K,"0,47%"
"Aug 28, 2017",1309.70,1293.50,1311.30,1293.50,0.15K,"1,33%"
"Aug 29, 2017",1313.10,1318.80,1323.80,1314.00,0.30K,"0,26%"
"Aug 30, 2017",1308.10,1308.20,1312.50,1304.90,0.37K,"-0,38%"
"Aug 31, 2017",1316.20,1306.60,1322.30,1301.70,0.31K,"0,62%"
"Sep 01, 2017",1324.50,1320.20,1327.70,1316.90,0.04K,"0,63%"
"Sep 03, 2017",1341.22,1340.54,1342.07,1338.96,-,"1,26%"
"Sep 04, 2017",1338.08,1341.21,1344.59,1337.01,-,"-0,23%"
"Sep 05, 2017",1339.20,1335.20,1337.00,1328.60,0.07K,"0,08%"
"Sep 06, 2017",1333.90,1340.00,1340.30,1332.60,0.02K,"-0,40%"
"Sep 07, 2017",1345.10,1336.40,1349.00,1336.40,0.03K,"0,84%"
"Sep 08, 2017",1346.00,1351.00,1355.80,1345.60,0.04K,"0,07%"
"Sep 11, 2017",1331.00,1330.00,1330.00,1327.30,0.01K,"-1,11%"
"Sep 12, 2017",1328.00,1327.00,1327.00,1325.20,0.02K,"-0,23%"
"Sep 13, 2017",1323.40,1323.40,1323.40,1323.40,0.08K,"-0,35%"
"Sep 14, 2017",1324.70,1319.60,1329.30,1319.60,0.32K,"0,10%"
"Sep 15, 2017",1320.40,1320.60,1321.20,1319.80,0.02K,"-0,32%"
"Sep 18, 2017",1306.30,1309.80,1310.40,1306.00,0.13K,"-1,07%"
"Sep 19, 2017",1306.20,1307.90,1310.30,1305.10,0.02K,"-0,01%"
"Sep 20, 2017",1312.00,1300.90,1300.90,1298.70,0.01K,"0,44%"
"Sep 21, 2017",1290.60,1299.10,1304.10,1290.30,0.34K,"-1,63%"
"Sep 22, 2017",1293.30,1295.00,1295.70,1293.60,0.21K,"0,21%"
"Sep 25, 2017",1306.80,1293.10,1309.20,1291.00,0.05K,"1,04%"
"Sep 26, 2017",1297.00,1304.50,1305.60,1298.70,0.04K,"-0,75%"
"Sep 27, 2017",1283.40,1283.40,1283.40,1283.40,0.02K,"-1,05%"
"Sep 28, 2017",1285.50,1283.10,1288.00,1277.00,5.23K,"0,16%"
"Sep 29, 2017",1281.50,1284.20,1289.40,1281.80,0.49K,"-0,31%"
"Oct 02, 2017",1272.70,1275.00,1276.10,1270.40,0.14K,"-0,69%"
"Oct 03, 2017",1271.50,1269.70,1273.30,1268.60,0.19K,"-0,09%"
"Oct 04, 2017",1273.70,1273.80,1280.80,1270.00,0.22K,"0,17%"
"Oct 05, 2017",1269.90,1277.80,1277.80,1267.60,0.04K,"-0,30%"
"Oct 06, 2017",1271.60,1267.60,1272.00,1260.50,0.05K,"0,13%"
"Oct 09, 2017",1281.80,1280.60,1284.00,1279.00,0.02K,"0,80%"
"Oct 10, 2017",1290.60,1282.60,1293.00,1281.70,0.02K,"0,69%"
"Oct 11, 2017",1285.80,1287.30,1292.00,1284.90,0.02K,"-0,37%"
"Oct 12, 2017",1293.30,1291.50,1294.50,1289.30,0.01K,"0,58%"
"Oct 13, 2017",1301.50,1293.30,1301.70,1291.70,0.07K,"0,63%"
"Oct 16, 2017",1299.90,1302.00,1303.80,1291.90,0.17K,"-0,12%"
"Oct 17, 2017",1283.00,1295.10,1295.10,1283.10,0.57K,"-1,30%"
"Oct 18, 2017",1279.90,1279.90,1279.90,1279.90,0.16K,"-0,24%"
"Oct 19, 2017",1286.90,1286.40,1286.40,1285.10,0.13K,"0,55%"
"Oct 20, 2017",1277.40,1279.60,1279.60,1277.80,0.30K,"-0,74%"
"Oct 23, 2017",1277.70,1274.70,1280.80,1271.50,0.12K,"0,02%"
"Oct 24, 2017",1275.00,1275.50,1275.50,1273.70,0.11K,"-0,21%"
"Oct 25, 2017",1275.40,1269.90,1275.20,1269.90,0.11K,"0,03%"
"Oct 26, 2017",1266.30,1273.50,1273.50,1264.70,0.04K,"-0,71%"
"Oct 27, 2017",1268.50,1268.40,1268.40,1267.10,0.15K,"0,17%"
"Oct 30, 2017",1274.10,1270.00,1274.10,1267.90,0.22K,"0,44%"
"Oct 31, 2017",1267.00,1273.10,1274.60,1266.10,0.24K,"-0,56%"
"Nov 01, 2017",1274.10,1272.20,1274.80,1270.30,0.08K,"0,56%"
"Nov 02, 2017",1274.90,1274.90,1274.90,1274.90,0.07K,"0,06%"
"Nov 03, 2017",1266.50,1265.30,1267.90,1265.30,0.08K,"-0,66%"
"Nov 06, 2017",1279.40,1269.00,1280.50,1269.00,0.13K,"1,02%"
"Nov 07, 2017",1273.70,1276.80,1276.80,1270.40,0.01K,"-0,45%"
"Nov 08, 2017",1281.60,1275.90,1284.90,1274.70,0.02K,"0,62%"
"Nov 09, 2017",1285.60,1279.70,1286.90,1279.70,0.02K,"0,31%"
"Nov 10, 2017",1272.40,1283.50,1283.50,1273.80,0.01K,"-1,03%"
"Nov 13, 2017",1277.30,1277.00,1277.00,1277.00,0.00K,"0,39%"
"Nov 14, 2017",1281.50,1276.90,1279.10,1276.90,0.00K,"0,33%"
"Nov 15, 2017",1276.50,1281.40,1284.70,1275.90,0.01K,"-0,39%"
"Nov 16, 2017",1277.40,1277.50,1277.50,1277.50,0.04K,"0,07%"
"Nov 17, 2017",1295.80,1288.30,1288.30,1288.30,0.00K,"1,44%"
"Nov 20, 2017",1274.60,1275.90,1275.90,1275.90,0.00K,"-1,64%"
"Nov 21, 2017",1281.10,1281.10,1281.10,1281.10,0.02K,"0,51%"
"Nov 22, 2017",1291.60,1284.70,1284.70,1282.90,0.00K,"0,82%"
"Nov 23, 2017",1291.66,1291.19,1293.87,1287.65,-,"0,00%"
"Nov 24, 2017",1286.70,1286.70,1286.70,1286.70,0.01K,"-0,38%"
"Nov 27, 2017",1293.80,1293.80,1293.80,1293.80,0.00K,"0,55%"
"Nov 28, 2017",1294.70,1294.70,1294.70,1294.70,4.06K,"0,07%"
"Nov 29, 2017",1282.10,1293.40,1296.20,1281.10,47.24K,"-0,97%"
"Nov 30, 2017",1273.20,1283.10,1284.50,1269.70,3.05K,"-0,69%"
"Dec 01, 2017",1278.80,1274.10,1288.60,1271.00,0.82K,"0,44%"
"Dec 04, 2017",1274.30,1272.50,1276.10,1270.30,0.85K,"-0,35%"
"Dec 05, 2017",1261.60,1275.40,1275.80,1260.00,1.50K,"-1,00%"
"Dec 06, 2017",1262.80,1264.90,1267.80,1261.60,0.37K,"0,10%"
"Dec 07, 2017",1249.80,1262.30,1262.40,1243.90,0.36K,"-1,03%"
"Dec 08, 2017",1245.20,1246.30,1249.30,1241.50,0.16K,"-0,37%"
"Dec 11, 2017",1243.70,1248.40,1249.20,1239.90,0.15K,"-0,12%"
"Dec 12, 2017",1238.50,1241.30,1244.40,1236.50,0.69K,"-0,42%"
"Dec 13, 2017",1245.40,1241.90,1254.50,1239.80,0.35K,"0,56%"
"Dec 14, 2017",1253.80,1252.90,1257.70,1250.30,0.14K,"0,67%"
"Dec 15, 2017",1254.30,1253.10,1260.30,1253.10,0.58K,"0,04%"
"Dec 18, 2017",1262.20,1256.20,1262.40,1255.70,0.05K,"0,63%"
"Dec 19, 2017",1260.70,1261.10,1264.30,1259.50,0.33K,"-0,12%"
"Dec 20, 2017",1266.10,1261.30,1266.60,1261.30,0.06K,"0,43%"
"Dec 21, 2017",1267.30,1266.40,1267.40,1264.30,0.23K,"0,09%"
"Dec 22, 2017",1275.40,1266.30,1276.30,1266.30,0.12K,"0,64%"
"Dec 25, 2017",1277.90,1278.90,1279.50,1277.90,-,"0,20%"
"Dec 26, 2017",1284.10,1282.40,1284.10,1281.80,0.08K,"0,49%"
"Dec 27, 2017",1287.00,1284.00,1285.70,1284.00,0.07K,"0,23%"
"Dec 28, 2017",1294.10,1288.20,1293.70,1288.20,0.25K,"0,55%"
"Dec 29, 2017",1306.30,1294.20,1305.00,1294.00,0.07K,"0,94%"
"Jan 01, 2018",1308.70,1305.80,1309.70,1304.60,-,"0,18%"
"Jan 02, 2018",1313.70,1302.30,1317.60,1302.30,0.07K,"0,38%"
"Jan 03, 2018",1316.20,1320.00,1320.10,1312.10,0.04K,"0,19%"
"Jan 04, 2018",1319.40,1322.00,1322.00,1321.90,0.00K,"0,24%"
"Jan 05, 2018",1320.30,1320.30,1320.30,1320.30,0.00K,"0,07%"
"Jan 08, 2018",1318.60,1319.90,1319.90,1314.60,0.04K,"-0,13%"
"Jan 09, 2018",1311.70,1309.60,1309.60,1309.60,0.02K,"-0,52%"
"Jan 10, 2018",1317.40,1320.30,1320.70,1315.30,0.07K,"0,43%"
"Jan 11, 2018",1320.60,1317.10,1317.10,1316.30,0.01K,"0,24%"
"Jan 12, 2018",1333.40,1327.80,1338.20,1327.80,0.01K,"0,97%"
"Jan 14, 2018",1337.40,1337.70,1338.60,1336.40,-,"0,30%"
"Jan 15, 2018",1341.80,1337.30,1344.90,1337.00,-,"0,33%"
"Jan 16, 2018",1335.40,1331.10,1332.50,1331.00,0.01K,"-0,48%"
"Jan 17, 2018",1338.00,1334.40,1334.40,1326.80,0.03K,"0,19%"
"Jan 18, 2018",1326.00,1328.90,1328.90,1326.60,0.21K,"-0,90%"
"Jan 19, 2018",1331.90,1330.10,1333.00,1330.10,0.05K,"0,44%"
"Jan 22, 2018",1330.90,1328.40,1328.40,1328.40,0.16K,"-0,08%"
"Jan 23, 2018",1335.70,1335.80,1335.90,1335.80,0.05K,"0,36%"
"Jan 24, 2018",1355.90,1357.20,1357.20,1357.20,0.02K,"1,51%"
"Jan 25, 2018",1362.40,1356.30,1356.40,1346.70,0.00K,"0,48%"
"Jan 26, 2018",1351.60,1351.60,1352.00,1350.90,0.00K,"-0,79%"
"Jan 29, 2018",1339.80,1339.80,1339.80,1339.80,0.01K,"-0,87%"
"Jan 30, 2018",1335.40,1338.70,1347.80,1332.80,52.10K,"-0,33%"
"Jan 31, 2018",1339.00,1337.50,1346.90,1331.80,4.88K,"0,27%"
"Feb 01, 2018",1344.30,1343.80,1350.60,1336.80,1.68K,"0,40%"
"Feb 02, 2018",1333.70,1348.50,1352.10,1327.70,2.84K,"-0,79%"
"Feb 05, 2018",1333.00,1331.10,1340.20,1329.00,0.64K,"-0,05%"
"Feb 06, 2018",1326.10,1338.20,1343.70,1319.50,0.53K,"-0,52%"
"Feb 07, 2018",1311.60,1325.40,1331.10,1310.50,0.49K,"-1,09%"
"Feb 08, 2018",1316.90,1317.10,1321.10,1307.00,0.46K,"0,40%"
"Feb 09, 2018",1313.10,1320.90,1322.00,1311.90,0.45K,"-0,29%"
"Feb 12, 2018",1324.20,1323.80,1325.50,1318.00,0.14K,"0,85%"
"Feb 13, 2018",1328.10,1324.50,1329.60,1323.40,0.07K,"0,29%"
"Feb 14, 2018",1355.50,1332.80,1355.50,1324.00,0.40K,"2,06%"
"Feb 15, 2018",1352.10,1352.00,1355.90,1349.70,0.11K,"-0,25%"
"Feb 16, 2018",1353.20,1354.00,1361.40,1344.90,0.11K,"0,08%"
"Feb 18, 2018",1350.50,1349.70,1352.40,1349.70,-,"-0,20%"
"Feb 19, 2018",1347.80,1350.40,1353.90,1347.40,-,"-0,20%"
"Feb 20, 2018",1328.80,1348.40,1350.20,1328.50,0.28K,"-1,41%"
"Feb 21, 2018",1330.00,1326.80,1331.50,1324.40,0.12K,"0,09%"
"Feb 22, 2018",1330.60,1322.00,1331.40,1322.00,0.07K,"0,05%"
"Feb 23, 2018",1328.20,1328.00,1332.10,1327.70,0.43K,"-0,18%"
"Feb 26, 2018",1330.70,1335.00,1340.50,1334.70,0.04K,"0,19%"
"Feb 27, 2018",1315.50,1331.70,1332.60,1312.70,0.71K,"-1,14%"
"Feb 28, 2018",1315.50,1315.40,1321.00,1315.40,0.06K,"0,00%"
"Mar 01, 2018",1302.90,1310.40,1318.10,1301.80,0.04K,"-0,96%"
"Mar 02, 2018",1321.10,1314.30,1323.20,1314.30,0.16K,"1,40%"
"Mar 05, 2018",1318.10,1323.50,1325.90,1318.10,0.02K,"-0,23%"
"Mar 06, 2018",1333.60,1321.60,1333.40,1321.40,0.02K,"1,18%"
"Mar 07, 2018",1326.00,1338.10,1338.10,1330.00,0.03K,"-0,57%"
"Mar 08, 2018",1319.90,1324.80,1326.80,1319.30,0.06K,"-0,46%"
"Mar 09, 2018",1322.40,1316.80,1322.20,1313.00,0.09K,"0,19%"
"Mar 12, 2018",1319.40,1319.40,1319.40,1319.40,0.00K,"-0,23%"
"Mar 13, 2018",1325.90,1325.30,1325.30,1325.30,0.01K,"0,49%"
"Mar 14, 2018",1324.40,1322.20,1324.10,1322.20,0.02K,"-0,11%"
"Mar 15, 2018",1316.80,1316.80,1316.80,1316.80,0.10K,"-0,57%"
"Mar 16, 2018",1311.30,1310.10,1310.10,1310.10,0.03K,"-0,42%"
"Mar 19, 2018",1316.80,1309.40,1316.90,1307.30,0.01K,"0,42%"
"Mar 20, 2018",1311.10,1311.10,1311.10,1311.10,0.00K,"-0,43%"
"Mar 21, 2018",1320.70,1312.40,1328.80,1312.40,0.03K,"0,73%"
"Mar 22, 2018",1326.60,1326.60,1326.60,1326.60,0.00K,"0,45%"
"Mar 23, 2018",1349.30,1343.20,1348.70,1343.20,0.01K,"1,71%"
"Mar 26, 2018",1354.40,1348.50,1352.20,1345.10,0.01K,"0,38%"
"Mar 27, 2018",1341.30,1341.00,1341.00,1341.00,0.01K,"-0,97%"
"Mar 28, 2018",1324.20,1345.00,1346.40,1322.40,59.28K,"-1,27%"
"Mar 29, 2018",1322.80,1324.00,1327.10,1321.70,5.59K,"-0,11%"
"Apr 02, 2018",1342.10,1327.00,1344.20,1324.70,0.65K,"1,46%"
"Apr 03, 2018",1332.80,1340.40,1341.50,1328.50,0.70K,"-0,69%"
"Apr 04, 2018",1335.80,1331.80,1347.30,1331.60,0.72K,"0,23%"
"Apr 05, 2018",1324.30,1333.50,1333.70,1322.60,0.26K,"-0,86%"
"Apr 06, 2018",1331.90,1326.50,1333.00,1319.00,0.35K,"0,57%"
"Apr 09, 2018",1336.30,1333.00,1337.50,1327.00,0.29K,"0,33%"
"Apr 10, 2018",1342.00,1335.20,1341.00,1333.00,0.11K,"0,43%"
"Apr 11, 2018",1356.50,1340.10,1365.40,1340.10,0.12K,"1,08%"
"Apr 12, 2018",1338.40,1351.20,1351.50,1334.60,0.03K,"-1,33%"
"Apr 13, 2018",1344.80,1335.90,1346.00,1335.90,0.07K,"0,48%"
"Apr 16, 2018",1347.50,1341.00,1348.80,1341.00,0.06K,"0,20%"
"Apr 17, 2018",1347.20,1348.00,1348.10,1339.00,0.41K,"-0,02%"
"Apr 18, 2018",1351.20,1343.50,1354.20,1343.50,0.05K,"0,30%"
"Apr 19, 2018",1346.80,1348.60,1355.20,1341.60,0.39K,"-0,33%"
"Apr 20, 2018",1336.70,1342.50,1343.40,1335.30,0.31K,"-0,75%"
"Apr 23, 2018",1322.50,1334.00,1334.40,1323.50,0.07K,"-1,06%"
"Apr 24, 2018",1331.40,1326.40,1331.70,1326.20,0.03K,"0,67%"
"Apr 25, 2018",1321.20,1324.00,1325.00,1320.00,0.28K,"-0,77%"
"Apr 26, 2018",1316.30,1315.70,1315.80,1315.70,0.01K,"-0,37%"
"Apr 27, 2018",1320.30,1315.30,1321.70,1312.80,0.62K,"0,30%"
"Apr 30, 2018",1316.20,1309.60,1313.30,1309.60,0.05K,"-0,31%"
"May 01, 2018",1303.80,1313.20,1313.80,1303.40,0.03K,"-0,94%"
"May 02, 2018",1302.60,1309.00,1309.30,1303.70,0.02K,"-0,09%"
"May 03, 2018",1310.70,1310.70,1310.70,1310.70,0.00K,"0,62%"
"May 04, 2018",1312.70,1312.70,1312.70,1312.70,0.04K,"0,15%"
"May 07, 2018",1312.20,1310.60,1312.50,1310.20,0.00K,"-0,04%"
"May 08, 2018",1312.00,1310.10,1310.20,1308.50,0.34K,"-0,02%"
"May 09, 2018",1311.30,1311.30,1311.30,1311.30,0.07K,"-0,05%"
"May 10, 2018",1320.80,1312.20,1318.00,1312.20,0.01K,"0,72%"
"May 11, 2018",1319.00,1319.00,1319.00,1319.00,0.00K,"-0,14%"
"May 14, 2018",1316.50,1319.90,1319.90,1317.90,0.00K,"-0,19%"
"May 15, 2018",1288.90,1304.60,1304.70,1290.30,0.01K,"-2,10%"
"May 16, 2018",1290.20,1290.90,1294.00,1285.40,0.03K,"0,10%"
"May 17, 2018",1288.20,1291.30,1291.30,1290.70,0.00K,"-0,16%"
"May 18, 2018",1290.20,1285.20,1289.60,1285.20,0.00K,"0,16%"
"May 21, 2018",1290.20,1287.40,1292.10,1287.40,0.05K,"0,00%"
"May 22, 2018",1291.70,1291.70,1291.70,1291.70,0.05K,"0,12%"
"May 23, 2018",1289.30,1289.30,1289.30,1289.30,0.01K,"-0,19%"
"May 24, 2018",1303.70,1303.70,1303.70,1303.70,0.02K,"1,12%"
"May 25, 2018",1303.30,1303.30,1303.30,1303.30,0.00K,"-0,03%"
"May 27, 2018",1298.30,1299.80,1299.90,1296.10,-,"-0,38%"
"May 28, 2018",1297.60,1298.40,1299.70,1294.70,-,"-0,05%"
"May 29, 2018",1298.70,1298.70,1298.70,1298.70,0.00K,"0,08%"
"May 30, 2018",1301.50,1298.00,1303.70,1295.20,50.85K,"0,22%"
"May 31, 2018",1300.10,1301.00,1306.80,1296.60,4.08K,"-0,11%"
"Jun 01, 2018",1294.80,1298.60,1299.50,1288.90,0.66K,"-0,41%"
"Jun 04, 2018",1293.10,1293.90,1297.10,1290.00,0.14K,"-0,13%"
"Jun 05, 2018",1297.50,1292.10,1299.80,1289.90,0.36K,"0,34%"
"Jun 06, 2018",1297.10,1296.10,1300.40,1294.10,0.37K,"-0,03%"
"Jun 07, 2018",1298.70,1298.40,1302.80,1296.20,0.08K,"0,12%"
"Jun 08, 2018",1298.10,1295.30,1299.40,1294.80,0.65K,"-0,05%"
"Jun 11, 2018",1298.90,1299.30,1302.00,1295.20,0.07K,"0,06%"
"Jun 12, 2018",1295.10,1297.80,1298.10,1292.70,0.15K,"-0,29%"
"Jun 13, 2018",1296.90,1294.00,1299.40,1290.90,0.14K,"0,14%"
"Jun 14, 2018",1304.00,1297.20,1307.70,1297.20,0.04K,"0,55%"
"Jun 15, 2018",1274.60,1297.40,1297.40,1274.00,0.59K,"-2,25%"
"Jun 18, 2018",1276.20,1280.70,1280.70,1277.00,0.04K,"0,13%"
"Jun 19, 2018",1275.60,1278.70,1281.80,1269.90,0.03K,"-0,05%"
"Jun 20, 2018",1271.20,1274.40,1274.40,1271.50,0.01K,"-0,34%"
"Jun 21, 2018",1267.20,1262.70,1268.90,1260.00,0.05K,"-0,31%"
"Jun 22, 2018",1267.40,1268.10,1270.20,1267.00,0.07K,"0,02%"
"Jun 25, 2018",1265.60,1270.60,1271.20,1265.90,0.04K,"-0,14%"
"Jun 26, 2018",1256.60,1267.20,1267.20,1257.50,0.09K,"-0,71%"
"Jun 27, 2018",1252.80,1255.50,1255.50,1252.30,0.01K,"-0,30%"
"Jun 28, 2018",1247.80,1251.70,1251.70,1244.80,0.38K,"-0,40%"
"Jun 29, 2018",1251.30,1250.30,1253.30,1249.10,0.05K,"0,28%"
"Jul 02, 2018",1239.80,1249.90,1249.90,1239.80,0.03K,"-0,92%"
"Jul 03, 2018",1251.60,1238.10,1254.10,1237.00,0.04K,"0,95%"
"Jul 04, 2018",1258.10,1256.20,1262.40,1255.30,-,"0,52%"
"Jul 05, 2018",1257.30,1253.70,1259.90,1253.60,0.01K,"-0,06%"
"Jul 06, 2018",1254.30,1255.50,1255.50,1254.40,0.01K,"-0,24%"
"Jul 09, 2018",1258.10,1258.20,1262.30,1257.70,0.04K,"0,30%"
"Jul 10, 2018",1253.80,1256.20,1256.90,1249.30,0.07K,"-0,34%"
"Jul 11, 2018",1242.80,1253.20,1253.20,1247.90,0.03K,"-0,88%"
"Jul 12, 2018",1245.00,1240.90,1246.70,1240.90,0.01K,"0,18%"
"Jul 13, 2018",1239.60,1244.70,1247.00,1244.70,0.00K,"-0,43%"
"Jul 16, 2018",1238.10,1242.70,1243.80,1242.70,0.00K,"-0,12%"
"Jul 17, 2018",1225.70,1225.70,1225.70,1225.70,0.34K,"-1,00%"
"Jul 18, 2018",1226.30,1226.70,1226.70,1222.20,0.07K,"0,05%"
"Jul 19, 2018",1222.40,1227.20,1228.00,1211.70,0.03K,"-0,32%"
"Jul 20, 2018",1229.50,1229.50,1229.50,1229.50,0.15K,"0,58%"
"Jul 23, 2018",1224.00,1222.00,1222.00,1222.00,0.00K,"-0,45%"
"Jul 24, 2018",1223.90,1223.90,1223.90,1223.90,0.10K,"-0,01%"
"Jul 25, 2018",1231.40,1231.40,1231.40,1231.40,0.06K,"0,61%"
"Jul 26, 2018",1225.30,1227.80,1227.80,1227.80,0.00K,"-0,50%"
"Jul 27, 2018",1222.60,1222.60,1222.60,1222.60,0.02K,"-0,22%"
"Jul 30, 2018",1221.30,1222.50,1223.90,1218.10,62.24K,"-0,11%"
"Jul 31, 2018",1223.70,1220.40,1228.10,1213.00,2.72K,"0,20%"
"Aug 01, 2018",1217.90,1222.90,1223.70,1214.40,1.03K,"-0,47%"
"Aug 02, 2018",1210.60,1214.70,1219.30,1205.80,0.41K,"-0,60%"
"Aug 03, 2018",1214.20,1206.50,1218.60,1205.10,0.78K,"0,30%"
"Aug 06, 2018",1208.60,1214.40,1214.40,1206.60,0.30K,"-0,46%"
"Aug 07, 2018",1209.60,1207.80,1214.80,1207.80,0.72K,"0,08%"
"Aug 08, 2018",1212.60,1212.00,1215.20,1205.90,0.21K,"0,25%"
"Aug 09, 2018",1211.90,1214.50,1215.30,1211.60,0.04K,"-0,06%"
"Aug 10, 2018",1211.10,1212.50,1216.40,1205.60,0.08K,"-0,07%"
"Aug 13, 2018",1191.30,1207.00,1207.40,1191.60,0.08K,"-1,63%"
"Aug 14, 2018",1193.00,1193.10,1197.50,1192.80,0.09K,"0,14%"
"Aug 15, 2018",1177.50,1187.80,1188.10,1174.60,0.07K,"-1,30%"
"Aug 16, 2018",1176.20,1173.20,1180.20,1161.40,0.12K,"-0,11%"
"Aug 17, 2018",1176.50,1174.70,1181.20,1174.70,0.07K,"0,03%"
"Aug 20, 2018",1186.80,1184.80,1190.00,1184.40,0.07K,"0,88%"
"Aug 21, 2018",1192.60,1189.80,1190.50,1189.80,0.02K,"0,49%"
"Aug 22, 2018",1196.30,1194.70,1196.20,1194.70,0.02K,"0,31%"
"Aug 23, 2018",1187.00,1189.30,1190.30,1184.90,0.10K,"-0,78%"
"Aug 24, 2018",1206.30,1185.30,1208.00,1185.30,0.01K,"1,63%"
"Aug 27, 2018",1209.00,1210.30,1211.40,1205.20,0.15K,"0,22%"
"Aug 28, 2018",1207.40,1209.70,1217.00,1202.30,0.14K,"-0,13%"
"Aug 29, 2018",1204.50,1205.20,1205.20,1202.40,0.03K,"-0,24%"
"Aug 30, 2018",1197.70,1205.40,1205.60,1196.00,0.49K,"-0,56%"
"Aug 31, 2018",1200.30,1207.10,1208.20,1199.10,0.19K,"0,22%"
"Sep 02, 2018",1204.90,1206.20,1206.60,1204.50,-,"0,38%"
"Sep 03, 2018",1206.30,1204.90,1209.60,1201.30,-,"0,12%"
"Sep 04, 2018",1192.70,1199.30,1200.50,1189.90,0.03K,"-1,13%"
"Sep 05, 2018",1194.90,1192.50,1196.00,1192.50,0.02K,"0,18%"
"Sep 06, 2018",1197.90,1202.00,1202.00,1198.30,0.01K,"0,25%"
"Sep 07, 2018",1193.60,1198.30,1198.30,1193.10,0.03K,"-0,36%"
"Sep 10, 2018",1193.00,1193.00,1193.00,1193.00,0.01K,"-0,05%"
"Sep 11, 2018",1195.40,1190.40,1196.30,1190.40,0.02K,"0,20%"
"Sep 12, 2018",1204.70,1205.00,1205.00,1205.00,0.04K,"0,78%"
"Sep 13, 2018",1202.00,1203.40,1203.40,1200.00,0.02K,"-0,22%"
"Sep 14, 2018",1195.00,1195.00,1195.00,1195.00,0.00K,"-0,58%"
"Sep 17, 2018",1199.70,1199.70,1199.70,1199.70,0.15K,"0,39%"
"Sep 18, 2018",1196.80,1198.70,1198.70,1197.60,0.00K,"-0,24%"
"Sep 19, 2018",1202.20,1202.20,1202.20,1202.20,0.08K,"0,45%"
"Sep 20, 2018",1206.20,1206.20,1206.20,1206.20,0.07K,"0,33%"
"Sep 21, 2018",1196.20,1196.20,1196.20,1196.20,0.04K,"-0,83%"
"Sep 24, 2018",1199.30,1199.30,1199.30,1199.30,0.01K,"0,26%"
"Sep 25, 2018",1200.00,1202.10,1202.80,1202.10,0.02K,"0,06%"
"Sep 26, 2018",1194.00,1194.00,1194.00,1194.00,0.00K,"-0,50%"
"Sep 27, 2018",1182.30,1194.60,1197.30,1180.50,4.95K,"-0,98%"
"Sep 28, 2018",1191.50,1181.70,1191.90,1180.00,0.40K,"0,78%"
"Oct 01, 2018",1187.10,1191.60,1191.60,1185.80,0.18K,"-0,37%"
"Oct 02, 2018",1202.40,1193.00,1206.00,1190.30,0.45K,"1,29%"
"Oct 03, 2018",1198.30,1202.60,1202.60,1196.60,0.08K,"-0,34%"
"Oct 04, 2018",1197.20,1199.30,1204.60,1197.80,0.50K,"-0,09%"
"Oct 05, 2018",1201.20,1197.10,1205.30,1196.90,0.03K,"0,33%"
"Oct 08, 2018",1184.40,1201.00,1201.00,1183.70,0.25K,"-1,40%"
"Oct 09, 2018",1187.20,1185.60,1189.10,1185.60,0.01K,"0,24%"
"Oct 10, 2018",1189.30,1191.30,1192.00,1191.30,1.08K,"0,18%"
"Oct 11, 2018",1223.50,1198.10,1224.60,1196.30,0.13K,"2,88%"
"Oct 12, 2018",1218.10,1221.60,1221.60,1216.00,0.12K,"-0,44%"
"Oct 15, 2018",1226.40,1222.40,1232.30,1222.40,0.14K,"0,68%"
"Oct 16, 2018",1227.30,1227.10,1230.50,1227.10,0.43K,"0,07%"
"Oct 17, 2018",1223.70,1225.90,1225.90,1225.90,0.00K,"-0,29%"
"Oct 18, 2018",1226.50,1226.50,1226.50,1226.50,0.17K,"0,23%"
"Oct 19, 2018",1225.30,1225.30,1225.30,1225.30,0.06K,"-0,10%"
"Oct 22, 2018",1221.20,1224.50,1224.50,1219.60,0.02K,"-0,33%"
"Oct 23, 2018",1233.40,1224.80,1237.80,1224.80,0.03K,"1,00%"
"Oct 24, 2018",1227.80,1231.60,1231.60,1228.50,0.04K,"-0,45%"
"Oct 25, 2018",1229.10,1238.60,1238.60,1229.60,0.01K,"0,11%"
"Oct 26, 2018",1232.50,1234.30,1234.80,1234.30,0.02K,"0,28%"
"Oct 29, 2018",1224.50,1224.50,1224.50,1224.50,0.26K,"-0,65%"
"Oct 30, 2018",1222.60,1227.70,1227.70,1219.80,0.07K,"-0,16%"
"Oct 31, 2018",1212.30,1216.00,1216.60,1212.00,0.12K,"-0,84%"
"Nov 01, 2018",1236.00,1215.40,1231.60,1215.40,0.01K,"1,95%"
"Nov 02, 2018",1230.90,1233.30,1233.30,1231.00,0.02K,"-0,41%"
"Nov 05, 2018",1229.80,1230.60,1231.50,1226.70,0.02K,"-0,09%"
"Nov 06, 2018",1223.80,1230.70,1233.80,1230.70,0.00K,"-0,49%"
"Nov 07, 2018",1226.20,1228.60,1228.60,1228.60,0.00K,"0,20%"
"Nov 08, 2018",1222.90,1222.90,1222.90,1222.90,0.00K,"-0,27%"
"Nov 09, 2018",1206.40,1207.90,1207.90,1207.00,0.01K,"-1,35%"
"Nov 12, 2018",1201.30,1201.60,1201.60,1201.60,0.00K,"-0,42%"
"Nov 13, 2018",1199.20,1196.30,1201.30,1196.30,0.01K,"-0,17%"
"Nov 14, 2018",1207.90,1207.90,1207.90,1207.90,0.33K,"0,73%"
"Nov 15, 2018",1212.80,1212.80,1212.80,1212.80,0.14K,"0,41%"
"Nov 16, 2018",1220.80,1216.70,1223.80,1216.70,0.01K,"0,66%"
"Nov 19, 2018",1223.10,1223.10,1223.10,1223.10,2.39K,"0,19%"
"Nov 20, 2018",1219.00,1225.30,1228.80,1222.00,0.01K,"-0,34%"
"Nov 21, 2018",1225.80,1225.80,1225.80,1225.80,0.34K,"0,56%"
"Nov 22, 2018",1228.00,1226.40,1229.70,1225.50,-,"0,18%"
"Nov 23, 2018",1272.10,1272.70,1272.70,1272.70,0.01K,"3,59%"
"Nov 26, 2018",1220.20,1222.00,1222.00,1222.00,0.00K,"-4,08%"
"Nov 27, 2018",1211.20,1221.90,1222.00,1221.90,0.01K,"-0,74%"
"Nov 28, 2018",1221.40,1211.50,1212.20,1211.50,0.00K,"0,84%"
"Nov 29, 2018",1273.00,1274.60,1274.60,1274.60,0.00K,"4,22%"
"Nov 30, 2018",1220.20,1224.10,1225.00,1216.10,2.06K,"-4,15%"
"Dec 03, 2018",1282.40,1283.20,1283.20,1283.20,0.00K,"5,10%"
"Dec 04, 2018",1241.10,1231.00,1241.40,1230.40,0.47K,"-3,22%"
"Dec 05, 2018",1237.10,1238.50,1238.80,1234.90,0.13K,"-0,32%"
"Dec 06, 2018",1286.50,1288.60,1288.60,1288.60,0.00K,"3,99%"
"Dec 07, 2018",1295.80,1291.60,1291.60,1291.60,0.00K,"0,72%"
"Dec 10, 2018",1292.00,1294.00,1294.00,1294.00,0.00K,"-0,29%"
"Dec 11, 2018",1290.10,1289.90,1289.90,1289.90,0.00K,"-0,15%"
"Dec 12, 2018",1244.40,1245.30,1245.60,1244.10,0.08K,"-3,54%"
"Dec 13, 2018",1242.70,1243.50,1243.50,1241.00,0.19K,"-0,14%"
"Dec 14, 2018",1237.00,1241.70,1241.70,1234.10,0.03K,"-0,46%"
"Dec 17, 2018",1247.40,1239.30,1245.90,1239.30,0.01K,"0,84%"
"Dec 18, 2018",1249.20,1248.20,1249.00,1245.60,0.03K,"0,14%"
"Dec 19, 2018",1252.10,1255.80,1255.80,1255.80,0.27K,"0,23%"
"Dec 20, 2018",1310.40,1308.20,1308.20,1305.90,0.00K,"4,66%"
"Dec 21, 2018",1253.80,1260.30,1261.30,1255.00,0.10K,"-4,32%"
"Dec 24, 2018",1267.50,1260.30,1268.50,1260.30,0.03K,"1,09%"
"Dec 25, 2018",1270.75,1272.50,1274.55,1270.65,-,"0,26%"
"Dec 26, 2018",1269.20,1269.30,1277.40,1269.30,0.06K,"-0,12%"
"Dec 27, 2018",1277.30,1276.70,1276.70,1276.70,0.00K,"0,64%"
"Dec 28, 2018",1279.90,1273.50,1280.10,1273.50,0.81K,"0,20%"
"Dec 31, 2018",1278.30,1278.00,1281.30,1277.60,0.02K,"-0,13%"
"Jan 01, 2019",1283.35,1284.70,1284.75,1282.85,-,"0,40%"
"Jan 02, 2019",1327.20,1332.50,1332.50,1331.30,0.00K,"3,42%"
"Jan 03, 2019",1338.00,1334.50,1334.50,1334.50,0.69K,"0,81%"
"Jan 04, 2019",1329.20,1330.00,1330.00,1330.00,0.10K,"-0,66%"
"Jan 07, 2019",1333.40,1332.20,1332.20,1332.20,0.01K,"0,32%"
"Jan 08, 2019",1283.20,1280.50,1282.50,1278.20,0.05K,"-3,76%"
"Jan 09, 2019",1289.30,1279.40,1289.30,1279.20,0.10K,"0,48%"
"Jan 10, 2019",1284.70,1284.70,1284.70,1284.70,0.55K,"-0,36%"
"Jan 11, 2019",1333.20,1336.60,1336.60,1336.60,0.05K,"3,78%"
"Jan 14, 2019",1335.30,1331.60,1331.60,1331.60,0.40K,"0,16%"
"Jan 15, 2019",1286.20,1290.10,1292.70,1290.10,0.00K,"-3,68%"
"Jan 16, 2019",1291.60,1291.60,1291.60,1291.60,0.00K,"0,42%"
"Jan 17, 2019",1291.00,1291.60,1292.70,1288.50,0.01K,"-0,05%"
"Jan 18, 2019",1281.30,1281.30,1281.30,1281.30,0.00K,"-0,75%"
"Jan 20, 2019",1282.05,1281.30,1282.70,1280.50,-,"0,06%"
"Jan 21, 2019",1279.05,1281.95,1282.95,1276.15,-,"-0,23%"
"Jan 22, 2019",1282.50,1283.30,1283.30,1283.20,0.01K,"0,27%"
"Jan 23, 2019",1283.10,1281.70,1283.90,1278.70,0.01K,"0,05%"
"Jan 24, 2019",1322.90,1324.70,1325.10,1324.70,0.00K,"3,10%"
"Jan 25, 2019",1341.30,1334.00,1341.50,1334.00,0.05K,"1,39%"
"Jan 28, 2019",1347.10,1343.30,1346.20,1343.30,0.02K,"0,43%"
"Jan 29, 2019",1352.70,1351.00,1354.40,1351.00,0.00K,"0,42%"
"Jan 30, 2019",1353.20,1352.10,1363.60,1352.10,0.08K,"0,04%"
"Jan 31, 2019",1362.40,1366.30,1366.40,1366.30,0.02K,"0,68%"
"Feb 01, 2019",1316.90,1320.30,1320.70,1315.40,0.88K,"-3,34%"
"Feb 04, 2019",1356.50,1352.00,1352.00,1352.00,0.00K,"3,01%"
"Feb 05, 2019",1356.90,1356.60,1356.60,1356.60,0.08K,"0,03%"
"Feb 06, 2019",1352.00,1354.80,1354.80,1354.80,0.00K,"-0,36%"
"Feb 07, 2019",1351.80,1347.60,1351.10,1347.30,0.10K,"-0,01%"
"Feb 08, 2019",1356.00,1355.10,1355.10,1355.10,0.00K,"0,31%"
"Feb 11, 2019",1349.40,1347.60,1347.60,1347.60,0.00K,"-0,49%"
"Feb 12, 2019",1309.20,1310.00,1312.00,1307.60,0.11K,"-2,98%"
"Feb 13, 2019",1352.60,1354.00,1354.00,1346.50,0.01K,"3,32%"
"Feb 14, 2019",1309.80,1305.00,1311.80,1301.60,0.86K,"-3,16%"
"Feb 15, 2019",1318.10,1313.60,1318.80,1313.60,0.19K,"0,63%"
"Feb 17, 2019",1324.25,1324.65,1324.95,1323.85,-,"0,47%"
"Feb 18, 2019",1329.55,1324.35,1330.75,1324.05,-,"0,40%"
"Feb 19, 2019",1381.90,1367.20,1381.60,1366.00,0.19K,"3,94%"
"Feb 20, 2019",1384.90,1383.30,1386.60,1379.90,0.16K,"0,22%"
"Feb 21, 2019",1364.70,1374.70,1375.00,1364.70,0.06K,"-1,46%"
"Feb 22, 2019",1369.90,1364.70,1369.60,1364.70,0.04K,"0,38%"
"Feb 25, 2019",1366.40,1365.80,1371.20,1365.80,0.02K,"-0,26%"
"Feb 26, 2019",1365.50,1365.40,1365.40,1363.60,0.02K,"-0,07%"
"Feb 27, 2019",1358.10,1360.20,1360.20,1358.40,0.02K,"-0,54%"
"Feb 28, 2019",1352.80,1354.60,1354.60,1351.20,0.07K,"-0,39%"
"Mar 01, 2019",1335.80,1346.50,1346.50,1330.60,0.27K,"-1,26%"
"Mar 04, 2019",1323.90,1332.70,1333.70,1322.60,0.03K,"-0,89%"
"Mar 05, 2019",1321.10,1321.50,1321.50,1321.50,0.18K,"-0,21%"
"Mar 06, 2019",1324.10,1321.90,1321.90,1321.90,0.01K,"0,23%"
"Mar 07, 2019",1322.30,1323.40,1323.80,1323.40,0.13K,"-0,14%"
"Mar 08, 2019",1335.90,1331.00,1336.40,1331.00,0.26K,"1,03%"
"Mar 11, 2019",1327.40,1328.20,1328.20,1327.80,0.11K,"-0,64%"
"Mar 12, 2019",1296.30,1294.70,1294.70,1294.70,0.00K,"-2,34%"
"Mar 13, 2019",1345.70,1342.20,1347.60,1342.20,0.12K,"3,81%"
"Mar 14, 2019",1331.20,1338.60,1338.60,1329.50,0.23K,"-1,08%"
"Mar 15, 2019",1338.90,1336.50,1339.80,1336.50,0.23K,"0,58%"
"Mar 18, 2019",1337.60,1341.10,1341.10,1341.10,0.12K,"-0,10%"
"Mar 19, 2019",1342.90,1346.60,1346.60,1346.60,0.02K,"0,40%"
"Mar 20, 2019",1337.70,1341.50,1348.30,1338.10,0.02K,"-0,39%"
"Mar 21, 2019",1343.20,1352.20,1355.30,1349.90,0.15K,"0,41%"
"Mar 22, 2019",1348.10,1348.50,1349.10,1346.40,3.14K,"0,36%"
"Mar 25, 2019",1358.20,1347.60,1359.10,1347.60,0.29K,"0,75%"
"Mar 26, 2019",1350.80,1354.80,1354.80,1348.00,0.17K,"-0,54%"
"Mar 27, 2019",1346.00,1352.50,1353.70,1348.70,0.30K,"-0,36%"
"Mar 28, 2019",1324.60,1332.50,1332.50,1323.10,0.17K,"-1,59%"
"Mar 29, 2019",1328.00,1322.90,1334.00,1322.90,0.01K,"0,26%"
"Apr 01, 2019",1323.80,1330.00,1330.00,1324.50,0.10K,"-0,32%"
"Apr 02, 2019",1325.10,1323.00,1323.00,1323.00,0.06K,"0,10%"
"Apr 03, 2019",1324.90,1323.90,1324.40,1323.90,0.54K,"-0,02%"
"Apr 04, 2019",1323.80,1325.80,1325.80,1316.10,0.07K,"-0,08%"
"Apr 05, 2019",1325.30,1325.30,1325.80,1325.20,0.10K,"0,11%"
"Apr 08, 2019",1331.60,1335.00,1336.60,1330.90,0.16K,"0,48%"
"Apr 09, 2019",1338.10,1340.00,1340.00,1338.80,0.04K,"0,49%"
"Apr 10, 2019",1343.60,1337.30,1343.10,1334.80,0.06K,"0,41%"
"Apr 11, 2019",1323.10,1339.60,1339.60,1323.90,0.06K,"-1,53%"
"Apr 12, 2019",1290.60,1293.40,1293.40,1289.20,0.61K,"-2,46%"
"Apr 15, 2019",1321.60,1324.80,1324.80,1316.30,0.19K,"2,40%"
"Apr 16, 2019",1307.30,1315.70,1316.20,1307.80,0.17K,"-1,08%"
"Apr 17, 2019",1306.70,1310.70,1310.70,1310.70,0.42K,"-0,05%"
"Apr 18, 2019",1306.00,1303.90,1308.00,1303.90,0.04K,"-0,05%"
"Apr 19, 2019",1277.90,1277.90,1277.90,1277.90,-,"-2,15%"
"Apr 22, 2019",1273.50,1273.50,1273.50,1273.50,0.15K,"-0,34%"
"Apr 23, 2019",1269.30,1266.40,1269.80,1266.00,0.21K,"-0,33%"
"Apr 24, 2019",1275.50,1268.40,1273.90,1267.80,0.52K,"0,49%"
"Apr 25, 2019",1309.50,1310.50,1310.50,1310.50,0.00K,"2,67%"
"Apr 26, 2019",1318.60,1317.50,1318.40,1317.50,0.12K,"0,69%"
"Apr 29, 2019",1278.60,1284.80,1284.90,1277.10,0.57K,"-3,03%"
"Apr 30, 2019",1315.20,1315.20,1315.20,1315.20,0.07K,"2,86%"
"May 01, 2019",1313.80,1315.20,1315.20,1313.50,0.26K,"-0,11%"
"May 02, 2019",1269.70,1269.20,1270.80,1266.60,0.06K,"-3,36%"
"May 03, 2019",1279.20,1270.10,1277.90,1270.10,0.02K,"0,75%"
"May 06, 2019",1281.70,1282.20,1282.20,1280.30,0.01K,"0,20%"
"May 07, 2019",1315.20,1315.10,1315.10,1314.80,0.17K,"2,61%"
"May 08, 2019",1310.90,1313.50,1313.50,1313.50,0.46K,"-0,33%"
"May 09, 2019",1314.60,1315.20,1318.40,1311.30,0.09K,"0,28%"
"May 10, 2019",1316.70,1315.80,1316.80,1315.80,0.10K,"0,16%"
"May 13, 2019",1330.40,1316.40,1329.00,1316.40,0.61K,"1,04%"
"May 14, 2019",1324.40,1331.60,1331.60,1323.10,0.17K,"-0,45%"
"May 15, 2019",1325.60,1323.80,1329.10,1323.40,0.34K,"0,09%"
"May 16, 2019",1314.50,1325.30,1326.40,1314.50,0.52K,"-0,84%"
"May 17, 2019",1303.80,1315.40,1316.80,1303.50,0.52K,"-0,81%"
"May 20, 2019",1305.70,1306.30,1306.30,1304.20,0.34K,"0,15%"
"May 21, 2019",1301.60,1304.00,1304.00,1304.00,0.31K,"-0,31%"
"May 22, 2019",1273.60,1273.60,1273.60,1273.60,11.47K,"-2,15%"
"May 23, 2019",1313.40,1302.40,1313.90,1302.40,1.08K,"3,13%"
"May 24, 2019",1311.70,1310.80,1311.90,1310.80,1.09K,"-0,13%"
"May 26, 2019",1284.15,1284.20,1285.15,1283.65,-,"-2,10%"
"May 27, 2019",1284.95,1284.25,1286.85,1283.25,-,"0,06%"
"May 28, 2019",1305.10,1304.30,1304.30,1304.30,0.28K,"1,57%"
"May 29, 2019",1308.60,1307.10,1310.60,1307.00,0.23K,"0,27%"
"May 30, 2019",1314.90,1303.20,1315.30,1303.20,0.06K,"0,48%"
"May 31, 2019",1333.00,1324.90,1333.30,1324.00,0.60K,"1,38%"
"Jun 03, 2019",1348.90,1335.10,1352.00,1335.10,0.80K,"1,19%"
"Jun 04, 2019",1350.00,1353.00,1353.30,1347.80,0.17K,"0,08%"
"Jun 05, 2019",1354.40,1350.50,1369.00,1350.50,1.22K,"0,33%"
"Jun 06, 2019",1363.30,1356.20,1362.80,1356.20,0.43K,"0,66%"
"Jun 07, 2019",1366.80,1356.70,1368.40,1356.70,0.97K,"0,26%"
"Jun 10, 2019",1350.70,1362.00,1362.00,1351.30,1.65K,"-1,18%"
"Jun 11, 2019",1353.00,1353.40,1353.40,1346.50,1.19K,"0,17%"
"Jun 12, 2019",1358.20,1355.40,1362.30,1355.40,0.56K,"0,38%"
"Jun 13, 2019",1364.90,1360.50,1364.80,1359.50,0.55K,"0,49%"
"Jun 14, 2019",1365.50,1368.20,1380.70,1363.90,1.01K,"0,04%"
"Jun 17, 2019",1363.60,1366.60,1366.90,1361.10,0.15K,"-0,14%"
"Jun 18, 2019",1371.40,1368.40,1376.60,1365.80,0.48K,"0,57%"
"Jun 19, 2019",1369.40,1371.40,1384.90,1367.00,0.60K,"-0,15%"
"Jun 20, 2019",1416.80,1414.40,1414.40,1401.50,1.26K,"3,46%"
"Jun 21, 2019",1419.90,1412.80,1434.70,1407.80,0.33K,"0,22%"
"Jun 24, 2019",1438.10,1430.60,1444.40,1425.50,0.35K,"1,28%"
"Jun 25, 2019",1438.50,1444.60,1458.60,1438.20,1.54K,"0,03%"
"Jun 26, 2019",1435.30,1439.50,1439.50,1428.20,1.27K,"-0,22%"
"Jun 27, 2019",1432.10,1425.40,1432.00,1423.70,1.54K,"-0,22%"
"Jun 28, 2019",1434.00,1444.90,1445.50,1430.60,0.87K,"0,13%"
"Jul 01, 2019",1410.10,1419.00,1419.00,1409.20,1.30K,"-1,67%"
"Jul 02, 2019",1429.30,1413.50,1438.70,1413.50,0.33K,"1,36%"
"Jul 03, 2019",1442.20,1452.50,1458.90,1438.50,1.89K,"0,90%"
"Jul 04, 2019",1423.55,1421.25,1426.65,1412.85,-,"-1,29%"
"Jul 05, 2019",1422.20,1441.20,1441.20,1413.60,1.34K,"-0,09%"
"Jul 08, 2019",1422.70,1422.20,1430.30,1420.50,0.79K,"0,04%"
"Jul 09, 2019",1423.30,1416.60,1424.10,1410.90,2.02K,"0,04%"
"Jul 10, 2019",1435.60,1418.20,1443.30,1416.90,2.11K,"0,86%"
"Jul 11, 2019",1430.40,1447.40,1449.50,1429.90,1.24K,"-0,36%"
"Jul 12, 2019",1435.90,1434.90,1441.10,1431.40,0.67K,"0,38%"
"Jul 15, 2019",1437.10,1439.30,1440.40,1433.30,1.18K,"0,08%"
"Jul 16, 2019",1434.70,1438.50,1441.00,1433.70,0.32K,"-0,17%"
"Jul 17, 2019",1447.10,1430.90,1451.30,1430.70,0.23K,"0,86%"
"Jul 18, 2019",1451.90,1447.50,1472.10,1442.00,1.91K,"0,33%"
"Jul 19, 2019",1450.30,1473.70,1477.10,1445.80,1.64K,"-0,11%"
"Jul 22, 2019",1450.70,1448.50,1452.50,1448.50,0.34K,"0,03%"
"Jul 23, 2019",1445.50,1448.70,1450.50,1439.00,1.06K,"-0,36%"
"Jul 24, 2019",1447.60,1441.20,1452.40,1441.20,0.80K,"0,15%"
"Jul 25, 2019",1438.60,1449.90,1456.40,1438.50,1.89K,"-0,62%"
"Jul 26, 2019",1443.50,1439.30,1447.50,1438.20,0.68K,"0,34%"
"Jul 29, 2019",1444.50,1446.40,1451.10,1440.50,1.49K,"0,07%"
"Jul 30, 2019",1453.00,1448.40,1455.10,1446.70,1.55K,"0,59%"
"Jul 31, 2019",1449.00,1452.00,1457.50,1435.70,2.66K,"-0,28%"
"Aug 01, 2019",1443.70,1433.00,1468.40,1424.00,2.45K,"-0,37%"
"Aug 02, 2019",1468.40,1468.30,1470.90,1454.90,1.08K,"1,71%"
"Aug 05, 2019",1486.90,1461.00,1492.10,1461.00,2.08K,"1,26%"
"Aug 06, 2019",1494.70,1494.90,1496.40,1481.40,2.04K,"0,52%"
"Aug 07, 2019",1530.10,1497.70,1531.80,1497.70,5.83K,"2,37%"
"Aug 08, 2019",1520.20,1521.90,1529.40,1513.30,3.25K,"-0,65%"
"Aug 09, 2019",1519.40,1528.80,1528.80,1517.80,3.29K,"-0,05%"
"Aug 12, 2019",1528.10,1517.50,1534.90,1511.00,2.24K,"0,57%"
"Aug 13, 2019",1525.20,1533.70,1556.00,1500.40,4.50K,"-0,19%"
"Aug 14, 2019",1538.80,1522.50,1545.30,1518.00,1.44K,"0,89%"
"Aug 15, 2019",1542.10,1540.40,1543.70,1530.10,1.69K,"0,21%"
"Aug 16, 2019",1534.30,1543.40,1543.40,1525.50,0.94K,"-0,51%"
"Aug 19, 2019",1522.30,1531.10,1531.70,1514.30,1.62K,"-0,78%"
"Aug 20, 2019",1526.40,1515.90,1528.50,1515.70,0.66K,"0,27%"
"Aug 21, 2019",1526.40,1526.20,1527.10,1519.00,3.27K,"0,00%"
"Aug 22, 2019",1519.30,1523.60,1524.30,1513.30,0.73K,"-0,47%"
"Aug 23, 2019",1548.40,1517.80,1550.00,1514.00,2.46K,"1,92%"
"Aug 26, 2019",1548.10,1567.10,1575.10,1546.00,0.68K,"-0,02%"
"Aug 27, 2019",1563.10,1549.10,1565.40,1547.00,1.77K,"0,97%"
"Aug 28, 2019",1560.40,1563.40,1566.80,1554.50,0.90K,"-0,17%"
"Aug 29, 2019",1548.20,1559.80,1569.20,1540.00,2.52K,"-0,78%"
"Aug 30, 2019",1541.00,1548.10,1552.10,1539.90,1.69K,"-0,47%"
"Sep 01, 2019",1538.05,1535.25,1542.90,1535.25,-,"-0,19%"
"Sep 02, 2019",1535.15,1537.95,1540.05,1528.15,-,"-0,19%"
"Sep 03, 2019",1567.50,1549.00,1570.00,1542.70,1.16K,"2,11%"
"Sep 04, 2019",1571.80,1562.80,1576.00,1555.70,1.86K,"0,27%"
"Sep 05, 2019",1536.80,1572.50,1572.50,1532.10,2.18K,"-2,23%"
"Sep 06, 2019",1527.00,1538.00,1547.50,1522.60,1.59K,"-0,64%"
"Sep 09, 2019",1522.90,1525.00,1533.60,1517.50,3.70K,"-0,27%"
"Sep 10, 2019",1511.10,1517.70,1520.50,1505.60,1.79K,"-0,77%"
"Sep 11, 2019",1515.10,1507.20,1515.90,1507.20,2.29K,"0,26%"
"Sep 12, 2019",1519.40,1512.20,1542.00,1511.10,1.29K,"0,28%"
"Sep 13, 2019",1511.70,1516.40,1528.40,1507.20,2.49K,"-0,51%"
"Sep 16, 2019",1523.60,1519.60,1530.80,1515.60,0.54K,"0,79%"
"Sep 17, 2019",1525.40,1517.20,1527.00,1514.00,1.09K,"0,12%"
"Sep 18, 2019",1527.80,1521.10,1530.90,1507.70,1.81K,"0,16%"
"Sep 19, 2019",1518.10,1510.40,1522.00,1510.40,1.95K,"-0,63%"
"Sep 20, 2019",1527.00,1518.50,1536.00,1518.20,0.74K,"0,59%"
"Sep 23, 2019",1543.60,1532.80,1545.60,1532.00,1.32K,"1,09%"
"Sep 24, 2019",1552.10,1540.00,1555.00,1535.50,1.70K,"0,55%"
"Sep 25, 2019",1524.10,1550.40,1553.10,1520.00,3.32K,"-1,80%"
"Sep 26, 2019",1527.20,1523.00,1530.20,1521.50,6.18K,"0,20%"
"Sep 27, 2019",1518.60,1525.70,1525.90,1506.80,2.17K,"-0,56%"
"Sep 30, 2019",1485.10,1515.40,1515.40,1483.80,2.22K,"-2,21%"
"Oct 01, 2019",1500.90,1487.60,1503.60,1478.10,4.23K,"1,06%"
"Oct 02, 2019",1519.90,1496.10,1522.50,1494.40,5.26K,"1,27%"
"Oct 03, 2019",1525.80,1519.50,1537.20,1514.30,2.47K,"0,39%"
"Oct 04, 2019",1525.00,1523.80,1532.70,1514.50,4.58K,"-0,05%"
"Oct 07, 2019",1516.50,1529.70,1530.40,1507.80,2.77K,"-0,56%"
"Oct 08, 2019",1516.00,1511.00,1526.00,1506.20,4.75K,"-0,03%"
"Oct 09, 2019",1524.90,1523.40,1529.80,1517.90,4.54K,"0,59%"
"Oct 10, 2019",1513.00,1531.90,1533.90,1508.70,3.58K,"-0,78%"
"Oct 11, 2019",1500.60,1511.50,1519.20,1490.00,7.63K,"-0,82%"
"Oct 14, 2019",1509.60,1503.10,1512.80,1499.70,2.06K,"0,60%"
"Oct 15, 2019",1495.40,1508.70,1513.70,1495.00,0.49K,"-0,94%"
"Oct 16, 2019",1505.90,1498.50,1507.00,1492.80,2.71K,"0,70%"
"Oct 17, 2019",1510.40,1503.50,1512.40,1499.80,3.12K,"0,30%"
"Oct 18, 2019",1505.90,1509.30,1509.30,1500.80,5.29K,"-0,30%"
"Oct 21, 2019",1500.00,1507.30,1510.30,1497.00,6.12K,"-0,39%"
"Oct 22, 2019",1499.50,1498.70,1503.50,1496.60,2.64K,"-0,03%"
"Oct 23, 2019",1507.70,1503.40,1511.00,1503.20,1.53K,"0,55%"
"Oct 24, 2019",1516.80,1507.40,1518.80,1502.70,2.55K,"0,60%"
"Oct 25, 2019",1517.50,1517.20,1532.80,1517.20,1.60K,"0,05%"
"Oct 28, 2019",1508.00,1518.00,1522.40,1504.80,0.87K,"-0,63%"
"Oct 29, 2019",1502.70,1505.80,1508.90,1498.50,2.38K,"-0,35%"
"Oct 30, 2019",1508.90,1502.90,1511.00,1495.90,2.16K,"0,41%"
"Oct 31, 2019",1526.90,1512.40,1528.50,1511.40,4.21K,"1,19%"
"Nov 01, 2019",1523.70,1526.20,1529.90,1518.10,2.52K,"-0,21%"
"Nov 04, 2019",1523.60,1527.00,1529.10,1519.70,5.90K,"-0,01%"
"Nov 05, 2019",1496.00,1523.60,1524.00,1493.00,5.67K,"-1,81%"
"Nov 06, 2019",1505.60,1498.20,1508.10,1497.00,3.49K,"0,64%"
"Nov 07, 2019",1478.60,1503.80,1505.00,1474.00,5.31K,"-1,79%"
"Nov 08, 2019",1475.10,1479.00,1485.40,1468.80,2.82K,"-0,24%"
"Nov 11, 2019",1469.40,1473.40,1479.00,1461.10,2.37K,"-0,39%"
"Nov 12, 2019",1465.90,1468.20,1473.40,1458.50,2.20K,"-0,24%"
"Nov 13, 2019",1475.50,1470.00,1479.80,1470.00,2.99K,"0,65%"
"Nov 14, 2019",1485.60,1477.00,1487.20,1474.40,4.91K,"0,68%"
"Nov 15, 2019",1480.80,1483.90,1484.10,1475.50,6.31K,"-0,32%"
"Nov 18, 2019",1484.30,1482.00,1485.70,1469.00,5.41K,"0,24%"
"Nov 19, 2019",1486.70,1483.60,1487.80,1477.50,2.61K,"0,16%"
"Nov 20, 2019",1486.50,1486.90,1491.50,1479.00,7.69K,"-0,01%"
"Nov 21, 2019",1476.10,1487.20,1488.00,1475.70,4.56K,"-0,70%"
"Nov 22, 2019",1476.20,1477.10,1485.30,1474.10,7.75K,"0,01%"
"Nov 25, 2019",1469.50,1472.70,1474.00,1466.80,3.29K,"-0,45%"
"Nov 26, 2019",1472.70,1466.90,1475.00,1462.50,39.91K,"0,22%"
"Nov 27, 2019",1466.00,1473.70,1473.90,1464.50,15.69K,"-0,45%"
"Nov 28, 2019",1462.25,1463.25,1464.55,1460.75,-,"-0,26%"
"Nov 29, 2019",1478.10,1467.80,1478.30,1464.50,4.58K,"1,08%"
"Dec 02, 2019",1474.60,1474.10,1477.10,1465.80,10.81K,"-0,24%"
"Dec 03, 2019",1489.90,1473.40,1493.10,1471.20,13.27K,"1,04%"
"Dec 04, 2019",1485.60,1488.80,1495.20,1482.30,15.90K,"-0,29%"
"Dec 05, 2019",1488.60,1486.50,1491.00,1483.40,4.69K,"0,20%"
"Dec 06, 2019",1470.70,1486.70,1490.00,1469.00,15.15K,"-1,20%"
"Dec 09, 2019",1470.50,1469.00,1475.20,1469.00,4.90K,"-0,01%"
"Dec 10, 2019",1473.70,1471.60,1478.80,1469.70,8.28K,"0,22%"
"Dec 11, 2019",1480.60,1474.30,1487.80,1472.70,13.02K,"0,47%"
"Dec 12, 2019",1477.90,1484.20,1496.70,1474.20,5.12K,"-0,18%"
"Dec 13, 2019",1486.90,1477.90,1488.10,1472.20,7.23K,"0,61%"
"Dec 16, 2019",1486.10,1485.80,1490.00,1483.40,2.83K,"-0,05%"
"Dec 17, 2019",1486.40,1486.00,1490.50,1484.30,10.20K,"0,02%"
"Dec 18, 2019",1484.40,1486.20,1489.40,1480.40,5.32K,"-0,13%"
"Dec 19, 2019",1490.00,1485.20,1491.30,1483.10,6.56K,"0,38%"
"Dec 20, 2019",1486.60,1488.60,1490.40,1485.20,1.45K,"-0,23%"
"Dec 23, 2019",1494.40,1487.20,1495.70,1487.20,2.46K,"0,52%"
"Dec 24, 2019",1510.60,1495.50,1510.80,1494.10,5.11K,"1,08%"
"Dec 25, 2019",1504.05,1504.40,1504.40,1502.15,-,"-0,43%"
"Dec 26, 2019",1520.30,1509.80,1523.00,1508.00,7.83K,"1,08%"
"Dec 27, 2019",1524.10,1521.90,1525.60,1518.00,10.68K,"0,25%"
"Dec 30, 2019",1524.60,1521.90,1525.00,1519.60,6.88K,"0,03%"
"Dec 31, 2019",1529.30,1523.80,1534.50,1523.80,18.81K,"0,31%"
"Jan 01, 2020",1520.95,1520.85,1523.95,1520.85,-,"-0,55%"
"Jan 02, 2020",1540.10,1535.50,1545.60,1532.00,2.07K,"1,26%"
"Jan 03, 2020",1564.50,1543.90,1567.60,1543.90,4.48K,"1,58%"
"Jan 06, 2020",1580.90,1577.90,1600.00,1575.00,6.61K,"1,05%"
"Jan 07, 2020",1586.30,1578.60,1590.40,1570.00,10.57K,"0,34%"
"Jan 08, 2020",1572.30,1590.30,1624.50,1565.90,7.21K,"-0,88%"
"Jan 09, 2020",1566.40,1569.50,1574.00,1553.40,4.49K,"-0,38%"
"Jan 10, 2020",1572.10,1566.50,1575.30,1559.00,6.63K,"0,36%"
"Jan 13, 2020",1562.70,1575.10,1575.10,1559.00,5.33K,"-0,60%"
"Jan 14, 2020",1556.50,1560.10,1561.40,1548.40,5.44K,"-0,40%"
"Jan 15, 2020",1565.60,1559.30,1570.40,1559.20,3.84K,"0,58%"
"Jan 16, 2020",1562.20,1567.70,1569.70,1560.00,4.73K,"-0,22%"
"Jan 17, 2020",1572.30,1564.80,1572.90,1561.40,8.24K,"0,65%"
"Jan 19, 2020",1557.05,1557.40,1559.05,1556.45,-,"-0,97%"
"Jan 20, 2020",1561.25,1557.20,1562.70,1556.65,-,"0,27%"
"Jan 21, 2020",1569.90,1570.40,1580.70,1557.80,7.60K,"0,55%"
"Jan 22, 2020",1568.70,1568.00,1570.80,1562.30,4.61K,"-0,08%"
"Jan 23, 2020",1577.30,1572.00,1579.30,1563.70,6.14K,"0,55%"
"Jan 24, 2020",1583.90,1574.00,1587.20,1568.40,9.74K,"0,42%"
"Jan 27, 2020",1589.50,1592.50,1599.70,1587.50,9.61K,"0,35%"
"Jan 28, 2020",1581.70,1592.40,1592.90,1576.50,15.01K,"-0,49%"
"Jan 29, 2020",1582.00,1579.30,1588.60,1574.00,19.45K,"0,02%"
"Jan 30, 2020",1595.10,1587.30,1596.50,1583.10,13.36K,"0,83%"
"Jan 31, 2020",1593.80,1584.90,1601.20,1581.20,6.87K,"-0,08%"
"Feb 03, 2020",1588.30,1603.60,1603.90,1579.10,3.91K,"-0,35%"
"Feb 04, 2020",1561.40,1588.40,1589.60,1558.70,6.79K,"-1,69%"
"Feb 05, 2020",1568.70,1563.40,1571.70,1556.90,10.77K,"0,47%"
"Feb 06, 2020",1575.80,1564.50,1577.60,1562.00,3.20K,"0,45%"
"Feb 07, 2020",1579.20,1575.70,1583.30,1570.00,5.77K,"0,22%"
"Feb 10, 2020",1585.40,1581.60,1586.30,1577.80,4.94K,"0,39%"
"Feb 11, 2020",1575.90,1581.60,1583.10,1570.90,12.95K,"-0,60%"
"Feb 12, 2020",1577.30,1576.70,1579.20,1570.50,17.80K,"0,09%"
"Feb 13, 2020",1584.50,1574.60,1587.00,1574.50,4.72K,"0,46%"
"Feb 14, 2020",1591.90,1585.30,1593.60,1581.90,16.79K,"0,47%"
"Feb 16, 2020",1586.25,1585.50,1586.25,1583.45,-,"-0,35%"
"Feb 17, 2020",1587.05,1586.15,1588.45,1581.85,-,"0,05%"
"Feb 18, 2020",1609.30,1590.40,1613.80,1587.50,17.65K,"1,40%"
"Feb 19, 2020",1617.50,1610.20,1621.50,1608.10,6.16K,"0,51%"
"Feb 20, 2020",1626.20,1620.00,1632.00,1612.60,15.70K,"0,54%"
"Feb 21, 2020",1654.60,1628.30,1657.40,1627.60,19.99K,"1,75%"
"Feb 24, 2020",1682.40,1660.30,1697.00,1658.80,40.17K,"1,68%"
"Feb 25, 2020",1655.80,1670.00,1670.00,1632.60,23.32K,"-1,58%"
"Feb 26, 2020",1648.90,1643.00,1662.70,1632.40,20.86K,"-0,42%"
"Feb 27, 2020",1648.20,1649.90,1668.20,1642.40,22.88K,"-0,04%"
"Feb 28, 2020",1571.80,1651.70,1656.10,1569.10,65.34K,"-4,64%"
"Mar 02, 2020",1599.50,1598.40,1616.50,1581.20,23.69K,"1,76%"
"Mar 03, 2020",1648.90,1594.30,1654.70,1594.30,34.66K,"3,09%"
"Mar 04, 2020",1647.20,1643.00,1658.60,1637.40,28.13K,"-0,10%"
"Mar 05, 2020",1672.00,1642.70,1679.20,1641.50,27.67K,"1,51%"
"Mar 06, 2020",1676.10,1676.90,1696.50,1646.20,71.20K,"0,25%"
"Mar 09, 2020",1678.60,1694.50,1707.80,1660.80,54.57K,"0,15%"
"Mar 10, 2020",1663.30,1683.40,1683.50,1644.50,52.24K,"-0,91%"
"Mar 11, 2020",1645.40,1652.40,1674.70,1635.70,85.84K,"-1,08%"
"Mar 12, 2020",1593.20,1638.70,1654.00,1563.40,94.80K,"-3,17%"
"Mar 13, 2020",1519.50,1581.00,1600.40,1507.00,75.40K,"-4,63%"
"Mar 16, 2020",1488.60,1564.80,1576.00,1453.00,73.79K,"-2,03%"
"Mar 17, 2020",1528.10,1505.80,1556.40,1468.60,73.57K,"2,65%"
"Mar 18, 2020",1480.60,1533.70,1548.90,1476.00,73.22K,"-3,11%"
"Mar 19, 2020",1482.30,1489.70,1505.20,1462.80,64.61K,"0,11%"
"Mar 20, 2020",1488.10,1474.70,1522.50,1460.90,46.27K,"0,39%"
"Mar 23, 2020",1572.70,1508.40,1574.80,1489.40,98.80K,"5,69%"
"Mar 24, 2020",1663.30,1566.30,1693.50,1566.30,175.51K,"5,76%"
"Mar 25, 2020",1634.30,1665.50,1698.00,1609.00,107.99K,"-1,74%"
"Mar 26, 2020",1660.30,1642.20,1677.20,1612.00,145.43K,"1,59%"
"Mar 27, 2020",1654.10,1653.40,1661.00,1630.70,159.26K,"-0,37%"
"Mar 30, 2020",1643.20,1663.40,1673.60,1632.00,157.37K,"-0,66%"
"Mar 31, 2020",1596.60,1643.40,1645.60,1588.20,176.55K,"-2,84%"
"Apr 01, 2020",1591.40,1589.40,1612.40,1576.00,164.48K,"-0,33%"
"Apr 02, 2020",1637.70,1602.40,1645.60,1595.20,167.71K,"2,91%"
"Apr 03, 2020",1645.70,1635.30,1652.80,1624.40,-,"0,49%"
"Apr 06, 2020",1693.90,1647.70,1715.80,1638.20,-,"2,93%"
"Apr 07, 2020",1683.70,1707.10,1742.60,1672.00,-,"-0,60%"
"Apr 08, 2020",1684.30,1678.70,1695.80,1670.70,-,"0,04%"
"Apr 09, 2020",1752.80,1680.50,1754.50,1676.50,218.80K,"4,07%"
"Apr 10, 2020",1740.60,1740.60,1740.60,1740.60,-,"-0,70%"
"Apr 13, 2020",1761.40,1742.30,1772.80,1724.20,-,"1,19%"
"Apr 14, 2020",1768.90,1761.50,1788.80,1747.10,-,"0,43%"
"Apr 15, 2020",1740.20,1758.10,1759.80,1731.60,-,"-1,62%"
"Apr 16, 2020",1731.70,1743.50,1768.00,1722.60,204.23K,"-0,49%"
"Apr 17, 2020",1698.80,1738.50,1738.80,1691.20,-,"-1,90%"
