﻿"Date","Price","Open","High","Low","Vol.","Change %"
"Apr 20, 2015","22.25","22.52","22.80","22.04","856.25K","-0.71%"
"Apr 22, 2015","22.37","22.36","22.87","22.35","777.25K","0.54%"
"Apr 23, 2015","22.85","22.41","22.85","22.41","660.50K","2.15%"
"Apr 24, 2015","22.91","22.96","23.07","22.64","607.50K","0.26%"
"Apr 27, 2015","22.34","23.13","23.17","22.28","836.25K","-2.49%"
"Apr 28, 2015","22.71","22.48","22.79","22.25","767.63K","1.66%"
"Apr 29, 2015","22.34","22.39","22.65","21.98","715.88K","-1.63%"
"Apr 30, 2015","22.53","22.23","22.53","21.79","934.38K","0.85%"
"May 04, 2015","23.35","22.65","23.35","22.33","1.43M","3.64%"
"May 05, 2015","23.76","23.13","23.79","23.12","1.20M","1.76%"
"May 06, 2015","23.66","23.76","23.92","23.19","838.63K","-0.42%"
"May 07, 2015","23.45","23.35","23.96","23.20","671.88K","-0.89%"
"May 08, 2015","23.23","23.57","23.57","23.01","743.13K","-0.94%"
"May 11, 2015","23.39","23.39","23.50","23.08","860.63K","0.69%"
"May 12, 2015","23.17","23.39","23.47","23.04","1.33M","-0.94%"
"May 13, 2015","22.69","23.08","23.28","22.34","857.63K","-2.07%"
"May 14, 2015","23.27","22.96","23.55","22.30","1.26M","2.56%"
"May 15, 2015","23.13","23.18","23.48","22.94","1.05M","-0.60%"
"May 18, 2015","23.26","23.25","23.38","22.90","1.50M","0.56%"
"May 19, 2015","23.25","23.26","23.28","22.83","520.00K","-0.04%"
"May 20, 2015","22.87","23.10","23.36","22.70","940.38K","-1.63%"
"May 21, 2015","22.52","22.74","22.80","22.39","993.38K","-1.53%"
"May 22, 2015","22.36","22.62","22.76","22.00","867.13K","-0.71%"
"May 25, 2015","22.50","22.47","22.76","22.02","455.00K","0.63%"
"May 26, 2015","22.28","22.36","22.50","22.06","939.50K","-0.98%"
"May 27, 2015","22.54","22.17","22.61","21.96","728.88K","1.17%"
"May 28, 2015","22.34","22.26","22.49","22.18","586.13K","-0.89%"
"May 29, 2015","21.52","22.15","22.50","21.50","2.77M","-3.67%"
"Jun 01, 2015","22.15","21.56","22.61","21.55","950.00K","2.93%"
"Jun 02, 2015","22.29","22.28","22.56","22.00","912.13K","0.63%"
"Jun 03, 2015","21.94","22.54","22.54","21.59","672.63K","-1.57%"
"Jun 05, 2015","21.93","21.59","22.17","21.58","925.63K","-0.05%"
"Jun 08, 2015","22.06","21.91","22.24","21.73","1.19M","0.59%"
"Jun 09, 2015","22.00","22.06","22.14","21.77","1.02M","-0.27%"
"Jun 10, 2015","22.17","22.24","22.31","21.90","447.25K","0.77%"
"Jun 11, 2015","22.15","22.29","22.29","21.79","577.88K","-0.09%"
"Jun 12, 2015","21.61","21.89","22.05","21.56","1.09M","-2.44%"
"Jun 15, 2015","21.52","21.46","21.57","21.24","787.38K","-0.42%"
"Jun 16, 2015","21.42","21.61","21.86","21.40","925.50K","-0.46%"
"Jun 17, 2015","21.13","21.36","21.51","21.13","1.20M","-1.35%"
"Jun 18, 2015","21.80","21.24","21.84","21.05","1.49M","3.17%"
"Jun 19, 2015","21.76","21.65","21.76","21.55","872.25K","-0.18%"
"Jun 22, 2015","21.71","21.77","22.15","21.67","790.13K","-0.23%"
"Jun 23, 2015","21.74","21.86","22.03","21.74","542.88K","0.14%"
"Jun 24, 2015","21.61","21.85","21.89","21.52","931.38K","-0.60%"
"Jun 25, 2015","21.37","21.51","21.66","21.22","833.25K","-1.11%"
"Jun 26, 2015","21.77","21.26","21.79","21.26","790.13K","1.87%"
"Jun 29, 2015","21.61","21.51","21.74","21.40","412.63K","-0.73%"
"Jun 30, 2015","21.73","21.71","21.93","21.45","1.10M","0.56%"
"Jul 01, 2015","21.77","21.80","21.94","21.44","767.50K","0.18%"
"Jul 02, 2015","21.90","21.81","22.13","21.74","610.88K","0.60%"
"Jul 03, 2015","22.00","21.79","22.09","21.74","283.50K","0.46%"
"Jul 06, 2015","22.13","21.73","22.15","21.63","717.25K","0.59%"
"Jul 07, 2015","22.31","22.19","22.31","21.87","874.00K","0.81%"
"Jul 08, 2015","22.63","22.15","22.63","22.03","1.14M","1.43%"
"Jul 10, 2015","22.96","23.04","23.07","22.32","947.13K","1.46%"
"Jul 13, 2015","23.30","22.90","23.35","22.89","767.00K","1.48%"
"Jul 14, 2015","23.58","23.14","23.68","23.10","759.88K","1.20%"
"Jul 15, 2015","23.49","23.71","23.71","23.21","867.25K","-0.38%"
"Jul 16, 2015","23.62","23.58","23.78","23.46","1.33M","0.55%"
"Jul 17, 2015","23.20","23.69","23.74","23.04","1.24M","-1.78%"
"Jul 20, 2015","22.77","23.20","23.31","22.60","2.06M","-1.85%"
"Jul 21, 2015","23.52","22.66","23.58","22.66","2.21M","3.29%"
"Jul 22, 2015","23.48","23.37","23.60","23.19","808.00K","-0.17%"
"Jul 23, 2015","22.77","23.31","23.31","22.26","1.67M","-3.02%"
"Jul 24, 2015","22.24","22.61","22.61","21.85","1.15M","-2.33%"
"Jul 27, 2015","22.23","22.36","22.38","21.89","803.75K","-0.04%"
"Jul 28, 2015","21.95","22.12","22.38","21.86","1.32M","-1.26%"
"Jul 29, 2015","22.35","21.80","22.35","21.77","1.09M","1.82%"
"Jul 30, 2015","22.63","22.47","22.92","22.16","1.11M","1.25%"
"Jul 31, 2015","23.04","22.71","23.13","22.47","1.37M","1.81%"
"Aug 03, 2015","22.87","22.92","23.40","22.79","892.00K","-0.74%"
"Aug 04, 2015","22.89","22.87","23.30","22.80","484.63K","0.09%"
"Aug 05, 2015","22.50","23.14","23.19","22.49","511.63K","-1.70%"
"Aug 06, 2015","22.31","22.40","22.57","22.06","981.25K","-0.84%"
"Aug 07, 2015","22.12","22.21","22.31","22.06","963.38K","-0.85%"
"Aug 10, 2015","22.23","22.12","22.30","22.03","477.00K","0.50%"
"Aug 11, 2015","22.19","22.12","22.20","21.68","1.78M","-0.18%"
"Aug 12, 2015","22.06","22.03","22.33","21.72","906.13K","-0.59%"
"Aug 13, 2015","22.11","21.96","22.22","21.70","631.00K","0.23%"
"Aug 14, 2015","22.12","22.11","22.26","21.84","719.38K","0.05%"
"Aug 17, 2015","22.09","21.98","22.21","21.93","419.88K","-0.14%"
"Aug 18, 2015","22.19","21.99","22.57","21.83","1.69M","0.45%"
"Aug 19, 2015","22.24","22.18","22.30","21.89","1.12M","0.23%"
"Aug 20, 2015","21.93","22.10","22.12","21.77","833.63K","-1.39%"
"Aug 21, 2015","21.58","21.83","21.84","21.51","1.34M","-1.60%"
"Aug 24, 2015","20.98","21.33","21.34","20.00","1.58M","-2.78%"
"Aug 25, 2015","20.95","21.32","21.39","20.90","1.13M","-0.14%"
"Aug 26, 2015","21.75","21.07","22.01","20.85","1.33M","3.82%"
"Aug 27, 2015","21.92","21.90","22.05","21.67","965.63K","0.78%"
"Aug 28, 2015","21.68","21.63","21.88","21.35","1.24M","-1.09%"
"Aug 31, 2015","21.62","21.27","21.78","21.01","2.04M","-0.28%"
"Sep 01, 2015","20.98","21.05","21.55","20.90","1.27M","-2.96%"
"Sep 02, 2015","20.68","21.13","21.18","20.54","2.18M","-1.43%"
"Sep 03, 2015","21.21","20.87","21.41","20.56","1.21M","2.56%"
"Sep 04, 2015","20.63","20.63","21.34","20.57","1.70M","-2.73%"
"Sep 08, 2015","20.92","21.25","21.25","20.48","1.01M","1.41%"
"Sep 09, 2015","21.05","20.93","21.14","20.81","992.50K","0.62%"
"Sep 10, 2015","21.11","20.47","21.41","20.47","1.06M","0.29%"
"Sep 11, 2015","21.31","20.96","21.55","20.87","1.32M","0.95%"
"Sep 14, 2015","22.46","21.50","22.78","21.21","1.45M","5.40%"
"Sep 15, 2015","21.94","22.46","22.46","21.59","1.09M","-2.32%"
"Sep 16, 2015","22.25","22.10","22.59","22.08","1.10M","1.41%"
"Sep 17, 2015","22.37","21.95","22.79","21.79","1.07M","0.54%"
"Sep 18, 2015","21.72","22.06","22.41","21.55","1.14M","-2.91%"
"Sep 21, 2015","21.64","21.55","21.97","21.33","1.09M","-0.37%"
"Sep 22, 2015","21.39","21.39","21.51","21.03","767.13K","-1.16%"
"Sep 23, 2015","21.04","21.35","21.43","20.96","850.00K","-1.64%"
"Sep 24, 2015","20.98","20.41","21.34","20.14","1.14M","-0.29%"
"Sep 25, 2015","21.06","21.27","21.40","20.90","2.20M","0.38%"
"Sep 28, 2015","20.76","21.19","21.19","20.62","854.25K","-1.42%"
"Sep 29, 2015","21.14","20.76","21.43","20.76","770.00K","1.83%"
"Sep 30, 2015","21.76","21.88","21.99","21.18","1.39M","2.93%"
"Oct 01, 2015","21.27","21.91","21.91","21.21","1.05M","-2.25%"
"Oct 02, 2015","21.56","21.12","21.67","20.94","1.20M","1.36%"
"Oct 05, 2015","21.40","21.57","21.83","21.07","862.13K","-0.74%"
"Oct 06, 2015","21.24","21.40","21.60","21.14","644.38K","-0.75%"
"Oct 07, 2015","21.19","21.52","21.60","21.05","876.13K","-0.24%"
"Oct 08, 2015","21.40","21.24","21.53","21.20","1.27M","0.99%"
"Oct 09, 2015","21.21","21.72","21.83","21.10","975.38K","-0.89%"
"Oct 13, 2015","21.18","21.30","21.81","21.02","698.00K","-0.14%"
"Oct 14, 2015","20.98","21.03","21.43","20.81","2.24M","-0.94%"
"Oct 15, 2015","21.41","20.99","21.52","20.90","856.88K","2.05%"
"Oct 16, 2015","21.71","21.41","21.71","21.02","1.97M","1.40%"
"Oct 19, 2015","21.84","21.60","21.99","21.34","1.65M","0.60%"
"Oct 20, 2015","22.05","21.82","22.12","21.73","716.38K","0.96%"
"Oct 21, 2015","21.80","22.03","22.24","21.55","843.38K","-1.13%"
"Oct 22, 2015","21.88","21.91","22.42","21.76","678.63K","0.37%"
"Oct 23, 2015","21.66","22.21","22.63","21.52","991.00K","-1.01%"
"Oct 26, 2015","21.76","21.59","22.10","21.59","768.00K","0.46%"
"Oct 27, 2015","21.86","21.76","22.07","21.65","955.38K","0.46%"
"Oct 28, 2015","21.83","21.76","22.16","21.76","1.26M","-0.14%"
"Oct 29, 2015","21.72","21.59","21.92","21.59","938.88K","-0.50%"
"Oct 30, 2015","21.83","21.59","21.85","21.59","1.74M","0.51%"
"Nov 03, 2015","23.27","21.68","23.42","21.68","2.74M","6.60%"
"Nov 04, 2015","23.34","23.50","24.16","23.10","1.34M","0.30%"
"Nov 05, 2015","23.37","23.21","23.53","22.94","1.36M","0.13%"
"Nov 06, 2015","22.72","23.37","23.46","22.37","1.58M","-2.78%"
"Nov 09, 2015","22.54","22.88","22.95","22.28","565.88K","-0.79%"
"Nov 10, 2015","22.43","22.54","22.56","21.94","912.50K","-0.49%"
"Nov 11, 2015","22.69","22.63","23.03","22.54","933.25K","1.16%"
"Nov 12, 2015","22.89","22.96","23.06","22.43","1.67M","0.88%"
"Nov 13, 2015","22.70","22.73","23.04","22.52","918.38K","-0.83%"
"Nov 16, 2015","22.87","22.54","22.89","22.43","989.38K","0.75%"
"Nov 17, 2015","22.79","23.03","23.14","22.58","776.38K","-0.35%"
"Nov 18, 2015","23.40","22.74","23.80","22.72","1.06M","2.68%"
"Nov 19, 2015","23.59","23.48","23.92","23.34","1.28M","0.81%"
"Nov 23, 2015","23.46","23.99","23.99","23.30","897.38K","-0.55%"
"Nov 24, 2015","23.18","23.50","23.61","23.00","2.51M","-1.19%"
"Nov 25, 2015","22.80","23.01","23.37","22.70","1.07M","-1.64%"
"Nov 26, 2015","22.91","22.90","23.35","22.75","562.63K","0.48%"
"Nov 27, 2015","22.24","22.80","23.11","22.24","746.88K","-2.92%"
"Nov 30, 2015","21.86","22.32","22.39","21.66","2.84M","-1.71%"
"Dec 01, 2015","21.95","21.71","22.11","21.64","1.13M","0.41%"
"Dec 02, 2015","22.05","21.82","22.25","21.82","1.10M","0.46%"
"Dec 03, 2015","22.37","22.29","22.74","22.21","884.63K","1.45%"
"Dec 04, 2015","22.21","22.22","22.56","21.84","1.45M","-0.72%"
"Dec 07, 2015","22.18","22.31","22.88","22.05","1.08M","-0.14%"
"Dec 08, 2015","21.92","22.20","22.34","21.64","1.10M","-1.17%"
"Dec 09, 2015","22.78","22.10","23.09","21.85","1.67M","3.92%"
"Dec 10, 2015","22.38","22.89","23.11","21.94","1.36M","-1.76%"
"Dec 11, 2015","22.86","22.22","22.95","22.15","1.61M","2.14%"
"Dec 14, 2015","22.39","22.70","22.90","22.28","916.63K","-2.06%"
"Dec 15, 2015","22.11","22.60","22.79","22.11","999.00K","-1.25%"
"Dec 16, 2015","21.95","22.03","22.29","21.67","1.22M","-0.72%"
"Dec 17, 2015","22.15","22.33","22.82","22.15","1.78M","0.91%"
"Dec 18, 2015","21.86","21.99","22.17","21.37","2.00M","-1.31%"
"Dec 21, 2015","21.30","21.86","21.95","21.13","1.15M","-2.56%"
"Dec 22, 2015","21.79","21.41","21.97","21.30","901.25K","2.30%"
"Dec 23, 2015","21.92","21.97","22.34","21.81","329.13K","0.60%"
"Dec 28, 2015","22.21","22.07","22.52","21.92","560.13K","1.32%"
"Dec 29, 2015","22.08","22.05","22.35","21.98","318.13K","-0.59%"
"Dec 30, 2015","21.88","22.34","22.34","21.88","886.00K","-0.91%"
"Jan 04, 2016","21.34","21.73","21.99","21.34","876.50K","-2.47%"
"Jan 05, 2016","21.59","21.34","21.87","21.34","795.13K","1.17%"
"Jan 06, 2016","21.27","21.33","21.58","21.17","2.03M","-1.48%"
"Jan 07, 2016","20.77","21.12","21.12","20.73","1.42M","-2.35%"
"Jan 08, 2016","20.48","21.02","21.02","20.41","1.16M","-1.40%"
"Jan 11, 2016","20.51","20.28","21.09","20.28","1.61M","0.15%"
"Jan 12, 2016","20.58","20.57","21.07","20.49","1.09M","0.34%"
"Jan 13, 2016","20.48","20.70","20.90","20.47","878.00K","-0.49%"
"Jan 14, 2016","20.09","20.62","20.62","20.04","1.74M","-1.90%"
"Jan 15, 2016","19.43","19.94","20.12","19.23","1.25M","-3.29%"
"Jan 18, 2016","19.60","19.47","19.83","19.47","850.63K","0.87%"
"Jan 19, 2016","19.86","19.92","20.21","19.65","953.25K","1.33%"
"Jan 20, 2016","19.74","19.64","19.95","19.49","1.54M","-0.60%"
"Jan 21, 2016","19.73","19.61","19.85","19.58","868.75K","-0.05%"
"Jan 22, 2016","20.12","19.90","20.25","19.85","927.38K","1.98%"
"Jan 26, 2016","20.19","19.88","20.38","19.88","889.63K","0.35%"
"Jan 27, 2016","20.48","20.25","20.85","20.02","1.04M","1.44%"
"Jan 28, 2016","20.90","20.62","21.05","20.30","1.14M","2.05%"
"Jan 29, 2016","22.11","21.05","22.11","21.01","1.74M","5.79%"
"Feb 01, 2016","22.12","21.56","22.54","21.56","1.20M","0.05%"
"Feb 02, 2016","21.56","21.96","22.24","21.37","1.43M","-2.53%"
"Feb 03, 2016","21.58","21.71","21.96","21.54","729.88K","0.09%"
"Feb 04, 2016","22.17","21.77","22.47","21.73","1.28M","2.73%"
"Feb 05, 2016","22.09","22.20","22.75","22.09","1.11M","-0.36%"
"Feb 10, 2016","22.21","22.15","22.58","22.11","545.13K","0.54%"
"Feb 11, 2016","22.21","22.05","22.21","21.66","2.16M","0.00%"
"Feb 12, 2016","22.00","22.07","22.50","21.81","1.04M","-0.95%"
"Feb 15, 2016","22.08","22.11","22.54","21.92","567.50K","0.36%"
"Feb 16, 2016","22.48","21.86","22.88","21.86","1.26M","1.81%"
"Feb 17, 2016","22.80","22.64","23.37","22.55","1.62M","1.42%"
"Feb 18, 2016","22.63","22.79","23.20","22.55","1.04M","-0.75%"
"Feb 19, 2016","22.54","22.47","22.96","22.33","841.25K","-0.40%"
"Feb 22, 2016","23.03","22.82","23.33","22.76","1.72M","2.17%"
"Feb 23, 2016","22.85","23.11","23.32","22.71","1.43M","-0.78%"
"Feb 24, 2016","22.71","22.69","23.01","22.46","916.25K","-0.61%"
"Feb 25, 2016","22.86","22.71","23.05","22.62","1.27M","0.66%"
"Feb 26, 2016","22.72","22.99","23.35","22.45","1.26M","-0.61%"
"Feb 29, 2016","23.06","22.89","23.26","22.75","2.32M","1.50%"
"Mar 01, 2016","23.51","23.18","23.88","23.14","1.23M","1.95%"
"Mar 02, 2016","23.20","23.40","23.75","23.13","2.10M","-1.32%"
"Mar 03, 2016","23.64","23.20","23.89","22.82","1.87M","1.90%"
"Mar 04, 2016","23.94","24.17","24.59","23.80","2.76M","1.27%"
"Mar 07, 2016","24.01","24.14","24.61","23.94","1.25M","0.29%"
"Mar 08, 2016","24.59","24.05","24.98","23.95","1.85M","2.42%"
"Mar 09, 2016","24.43","24.76","25.14","24.10","2.30M","-0.65%"
"Mar 10, 2016","24.33","24.66","24.91","24.10","2.20M","-0.41%"
"Mar 11, 2016","24.23","24.44","24.58","24.14","1.82M","-0.41%"
"Mar 14, 2016","23.88","24.11","24.46","23.69","1.81M","-1.44%"
"Mar 15, 2016","23.60","23.78","24.01","23.24","1.34M","-1.17%"
"Mar 16, 2016","23.70","23.44","24.18","23.39","1.13M","0.42%"
"Mar 17, 2016","24.46","24.04","24.67","23.88","2.38M","3.21%"
"Mar 18, 2016","24.39","24.66","24.95","24.39","2.18M","-0.29%"
"Mar 21, 2016","24.95","24.44","25.14","24.42","1.72M","2.30%"
"Mar 22, 2016","24.56","24.78","24.95","24.18","1.85M","-1.56%"
"Mar 23, 2016","24.33","24.43","24.53","24.12","844.50K","-0.94%"
"Mar 24, 2016","24.24","24.08","24.42","23.75","1.01M","-0.37%"
"Mar 28, 2016","24.21","24.53","24.67","24.04","782.88K","-0.12%"
"Mar 29, 2016","24.37","24.29","24.75","24.29","1.19M","0.66%"
"Mar 30, 2016","24.63","24.62","24.88","24.37","1.05M","1.07%"
"Mar 31, 2016","23.96","24.46","24.58","23.73","2.05M","-2.72%"
"Apr 01, 2016","24.31","23.66","24.35","23.63","1.14M","1.46%"
"Apr 04, 2016","23.68","24.17","24.17","23.40","1.13M","-2.59%"
"Apr 05, 2016","23.50","23.49","23.78","23.29","879.63K","-0.76%"
"Apr 06, 2016","23.10","23.26","23.51","22.95","1.42M","-1.70%"
"Apr 07, 2016","23.25","23.31","23.38","23.02","1.40M","0.65%"
"Apr 08, 2016","23.61","23.77","23.86","23.34","1.32M","1.55%"
"Apr 11, 2016","23.65","23.84","23.95","23.63","1.48M","0.17%"
"Apr 12, 2016","23.85","23.85","24.17","23.46","1.62M","0.85%"
"Apr 13, 2016","24.17","23.82","24.48","23.82","1.55M","1.34%"
"Apr 14, 2016","24.30","24.29","24.63","24.09","1.54M","0.54%"
"Apr 15, 2016","24.57","24.50","24.80","24.27","1.55M","1.11%"
"Apr 18, 2016","24.69","24.52","25.13","24.51","1.29M","0.49%"
"Apr 19, 2016","25.10","24.69","25.33","24.69","1.47M","1.66%"
"Apr 20, 2016","24.86","25.11","25.14","24.73","1.00M","-0.96%"
"Apr 22, 2016","24.66","24.61","24.73","24.41","963.00K","-0.80%"
"Apr 25, 2016","24.82","24.66","25.05","24.63","928.50K","0.65%"
"Apr 26, 2016","24.80","25.04","25.17","24.80","695.75K","-0.08%"
"Apr 27, 2016","25.35","24.96","25.52","24.95","1.21M","2.22%"
"Apr 28, 2016","25.31","25.44","25.53","25.11","564.88K","-0.16%"
"Apr 29, 2016","24.92","25.24","25.40","24.71","1.89M","-1.54%"
"May 02, 2016","24.69","24.92","25.01","24.59","594.38K","-0.92%"
"May 03, 2016","24.47","24.59","24.69","24.19","752.75K","-0.89%"
"May 04, 2016","24.79","24.52","24.88","23.91","1.03M","1.31%"
"May 05, 2016","24.71","24.82","24.88","24.59","479.25K","-0.32%"
"May 06, 2016","24.46","24.58","24.67","24.33","815.50K","-1.01%"
"May 09, 2016","24.17","24.36","24.57","23.85","1.53M","-1.19%"
"May 10, 2016","24.40","24.42","24.67","24.23","926.38K","0.95%"
"May 11, 2016","24.10","24.65","25.02","24.10","1.19M","-1.23%"
"May 12, 2016","24.25","24.11","24.87","24.11","1.67M","0.62%"
"May 13, 2016","23.85","24.11","24.64","23.65","1.57M","-1.65%"
"May 16, 2016","23.87","23.63","24.06","23.63","612.00K","0.08%"
"May 17, 2016","23.60","23.87","24.09","23.27","1.87M","-1.13%"
"May 18, 2016","23.85","23.37","23.93","23.23","1.27M","1.06%"
"May 19, 2016","23.58","23.60","23.93","23.32","704.50K","-1.13%"
"May 20, 2016","23.99","23.59","24.37","23.59","1.27M","1.74%"
"May 23, 2016","23.69","23.46","23.82","23.44","798.50K","-1.25%"
"May 24, 2016","23.92","23.72","24.20","23.60","948.38K","0.97%"
"May 25, 2016","23.51","23.90","24.43","23.51","989.50K","-1.71%"
"May 27, 2016","23.52","23.58","23.98","23.51","695.13K","0.04%"
"May 30, 2016","23.46","23.52","23.78","23.41","229.00K","-0.26%"
"May 31, 2016","23.38","23.40","23.89","23.26","1.88M","-0.34%"
"Jun 01, 2016","23.65","23.26","23.71","23.24","756.13K","1.15%"
"Jun 02, 2016","23.62","23.71","23.71","23.38","605.88K","-0.13%"
"Jun 03, 2016","24.00","23.68","24.07","23.59","524.13K","1.61%"
"Jun 06, 2016","23.79","24.25","24.25","23.53","769.13K","-0.87%"
"Jun 07, 2016","23.75","23.69","23.96","23.61","692.00K","-0.17%"
"Jun 08, 2016","24.30","23.93","24.58","23.78","1.01M","2.32%"
"Jun 09, 2016","24.12","24.25","24.40","23.96","587.88K","-0.74%"
"Jun 10, 2016","23.75","24.04","24.25","23.75","708.38K","-1.53%"
"Jun 13, 2016","24.04","23.56","24.21","23.52","687.75K","1.22%"
"Jun 14, 2016","23.79","23.99","24.19","23.35","608.00K","-1.04%"
"Jun 15, 2016","23.78","23.72","24.08","23.05","1.08M","-0.04%"
"Jun 16, 2016","23.75","23.54","23.96","23.42","746.00K","-0.13%"
"Jun 17, 2016","23.91","23.73","24.14","23.69","983.63K","0.67%"
"Jun 20, 2016","24.08","24.15","24.45","23.93","1.12M","0.71%"
"Jun 21, 2016","24.06","24.21","24.25","23.77","946.50K","-0.08%"
"Jun 22, 2016","23.90","24.01","24.37","23.81","1.14M","-0.67%"
"Jun 23, 2016","24.45","24.02","24.54","23.87","1.08M","2.30%"
"Jun 24, 2016","23.98","24.01","24.23","23.56","1.03M","-1.92%"
"Jun 27, 2016","24.20","23.87","24.37","23.72","898.63K","0.92%"
"Jun 28, 2016","24.94","24.48","25.10","24.18","1.96M","3.06%"
"Jun 29, 2016","25.34","25.10","25.53","24.98","1.70M","1.60%"
"Jun 30, 2016","25.24","25.22","25.45","24.94","2.30M","-0.39%"
"Jul 01, 2016","25.15","25.35","25.47","24.94","790.13K","-0.36%"
"Jul 04, 2016","25.39","25.35","25.63","25.22","537.13K","0.95%"
"Jul 05, 2016","25.53","25.14","25.62","25.14","906.25K","0.55%"
"Jul 06, 2016","25.69","25.51","25.69","25.27","924.50K","0.63%"
"Jul 07, 2016","25.84","25.86","26.20","25.42","1.16M","0.58%"
"Jul 08, 2016","25.91","25.97","26.11","25.81","1.04M","0.27%"
"Jul 11, 2016","26.49","25.99","26.68","25.98","2.28M","2.24%"
"Jul 12, 2016","26.38","26.46","26.76","26.29","1.98M","-0.42%"
"Jul 13, 2016","26.53","26.38","26.81","26.32","982.25K","0.57%"
"Jul 14, 2016","26.84","26.86","27.07","26.45","1.48M","1.17%"
"Jul 15, 2016","26.55","26.84","26.98","26.17","2.22M","-1.08%"
"Jul 18, 2016","26.65","26.47","26.84","26.42","1.83M","0.38%"
"Jul 19, 2016","27.11","26.75","27.24","26.53","815.13K","1.73%"
"Jul 20, 2016","27.27","27.32","27.46","26.96","943.63K","0.59%"
"Jul 21, 2016","27.44","27.27","28.01","26.91","936.38K","0.62%"
"Jul 22, 2016","27.61","27.63","27.84","27.20","812.38K","0.62%"
"Jul 25, 2016","27.74","27.75","28.14","27.54","1.39M","0.47%"
"Jul 26, 2016","27.47","27.72","27.99","27.47","1.15M","-0.97%"
"Jul 27, 2016","27.58","27.47","27.91","27.47","737.75K","0.40%"
"Jul 28, 2016","27.21","27.49","27.90","27.21","1.08M","-1.34%"
"Jul 29, 2016","27.81","27.48","28.24","27.48","1.26M","2.21%"
"Aug 01, 2016","27.71","27.81","28.13","27.59","630.63K","-0.36%"
"Aug 02, 2016","27.67","27.65","28.14","27.43","1.21M","-0.14%"
"Aug 03, 2016","28.17","27.40","28.25","27.36","1.50M","1.81%"
"Aug 04, 2016","28.51","28.00","28.93","27.94","985.25K","1.21%"
"Aug 05, 2016","28.34","28.52","28.73","28.00","1.15M","-0.60%"
"Aug 08, 2016","28.20","28.10","28.43","28.04","469.75K","-0.49%"
"Aug 09, 2016","28.06","28.25","28.31","27.84","519.13K","-0.50%"
"Aug 10, 2016","27.66","28.07","28.17","27.66","389.88K","-1.43%"
"Aug 11, 2016","27.99","27.66","28.11","27.27","1.07M","1.19%"
"Aug 12, 2016","27.94","28.15","28.36","27.73","594.13K","-0.18%"
"Aug 15, 2016","28.00","27.78","28.30","27.76","475.88K","0.21%"
"Aug 16, 2016","27.35","27.73","28.24","27.35","1.07M","-2.32%"
"Aug 17, 2016","28.23","27.26","28.50","27.18","819.88K","3.22%"
"Aug 18, 2016","27.11","28.80","28.80","27.11","949.25K","-3.97%"
"Aug 19, 2016","27.23","27.26","27.45","26.94","912.13K","0.44%"
"Aug 22, 2016","26.88","26.83","27.28","26.59","902.88K","-1.29%"
"Aug 23, 2016","26.41","26.88","26.99","26.41","946.88K","-1.75%"
"Aug 24, 2016","26.78","26.33","27.11","26.31","825.50K","1.40%"
"Aug 25, 2016","26.64","26.51","26.92","26.41","750.25K","-0.52%"
"Aug 26, 2016","26.26","26.92","26.92","25.81","1.23M","-1.43%"
"Aug 29, 2016","26.86","26.49","27.41","26.11","696.75K","2.28%"
"Aug 30, 2016","26.78","26.84","27.22","26.37","756.75K","-0.30%"
"Aug 31, 2016","26.30","26.71","27.01","26.14","1.29M","-1.79%"
"Sep 01, 2016","26.84","26.37","27.05","26.23","964.75K","2.05%"
"Sep 02, 2016","27.35","26.91","27.35","26.71","1.04M","1.90%"
"Sep 05, 2016","27.26","27.37","27.61","27.11","479.38K","-0.33%"
"Sep 06, 2016","27.28","27.42","27.60","26.99","682.50K","0.07%"
"Sep 08, 2016","26.90","26.99","27.34","26.73","1.53M","-1.39%"
"Sep 09, 2016","26.23","26.38","26.68","26.16","1.04M","-2.49%"
"Sep 12, 2016","26.37","25.97","26.54","25.97","632.13K","0.53%"
"Sep 13, 2016","26.14","26.26","26.47","25.97","1.02M","-0.87%"
"Sep 14, 2016","26.24","26.39","26.53","26.05","595.88K","0.38%"
"Sep 15, 2016","26.40","26.17","26.48","26.04","408.25K","0.61%"
"Sep 16, 2016","26.18","26.15","26.39","25.99","716.63K","-0.83%"
"Sep 19, 2016","26.30","26.43","26.58","26.01","660.00K","0.46%"
"Sep 20, 2016","26.45","26.24","26.70","26.24","1.10M","0.57%"
"Sep 21, 2016","26.68","26.27","26.82","26.27","972.63K","0.87%"
"Sep 22, 2016","26.83","26.95","27.23","26.36","1.37M","0.56%"
"Sep 23, 2016","26.74","26.89","27.20","26.49","500.88K","-0.34%"
"Sep 26, 2016","26.71","26.82","26.82","26.35","607.13K","-0.11%"
"Sep 27, 2016","26.61","26.84","26.95","26.49","615.88K","-0.37%"
"Sep 28, 2016","26.86","26.82","27.08","26.51","741.13K","0.94%"
"Sep 29, 2016","26.49","26.68","27.21","26.49","768.63K","-1.38%"
"Sep 30, 2016","25.97","26.66","26.91","25.97","1.76M","-1.96%"
"Oct 03, 2016","26.39","25.97","26.78","25.72","1.29M","1.62%"
"Oct 04, 2016","26.05","26.39","26.56","25.95","1.11M","-1.29%"
"Oct 05, 2016","26.35","26.31","26.54","26.15","746.88K","1.15%"
"Oct 06, 2016","26.24","26.45","26.45","26.09","623.38K","-0.42%"
"Oct 07, 2016","26.37","26.37","26.51","26.12","784.25K","0.50%"
"Oct 10, 2016","26.34","26.51","26.83","26.26","710.00K","-0.11%"
"Oct 11, 2016","26.17","26.45","26.59","26.17","826.13K","-0.65%"
"Oct 13, 2016","26.57","26.20","27.13","26.20","2.28M","1.53%"
"Oct 14, 2016","26.61","26.62","27.32","26.61","750.25K","0.15%"
"Oct 17, 2016","27.01","26.62","27.17","26.30","1.03M","1.50%"
"Oct 18, 2016","27.39","27.06","27.57","26.84","1.39M","1.41%"
"Oct 19, 2016","27.11","27.31","27.44","26.97","963.75K","-1.02%"
"Oct 20, 2016","27.31","27.11","27.44","26.96","1.20M","0.74%"
"Oct 21, 2016","27.42","27.44","27.79","27.30","1.10M","0.40%"
"Oct 24, 2016","27.34","27.45","27.71","27.18","1.18M","-0.29%"
"Oct 25, 2016","27.32","27.32","27.47","27.16","661.38K","-0.07%"
"Oct 26, 2016","27.28","27.30","27.59","26.80","1.21M","-0.15%"
"Oct 27, 2016","27.38","27.36","27.78","27.07","911.75K","0.37%"
"Oct 28, 2016","27.32","27.53","27.58","26.91","3.41M","-0.22%"
"Oct 31, 2016","27.35","27.41","27.80","27.01","1.32M","0.11%"
"Nov 01, 2016","26.51","27.37","27.76","26.44","1.42M","-3.07%"
"Nov 03, 2016","26.01","26.51","26.85","25.97","1.50M","-1.89%"
"Nov 04, 2016","25.80","26.02","26.49","25.71","1.23M","-0.81%"
"Nov 07, 2016","26.37","25.90","26.66","25.90","851.88K","2.21%"
"Nov 08, 2016","26.51","26.45","26.77","26.30","866.38K","0.53%"
"Nov 09, 2016","26.07","25.97","26.53","25.56","1.13M","-1.66%"
"Nov 10, 2016","24.97","26.14","26.34","24.46","1.87M","-4.22%"
"Nov 11, 2016","24.14","24.57","25.11","23.98","1.64M","-3.32%"
"Nov 14, 2016","24.31","23.97","24.72","23.88","1.34M","0.70%"
"Nov 16, 2016","24.79","24.39","24.93","24.14","1.36M","1.97%"
"Nov 17, 2016","24.66","24.74","25.34","24.64","1.42M","-0.52%"
"Nov 18, 2016","24.70","24.47","24.72","24.03","1.13M","0.16%"
"Nov 21, 2016","24.52","24.60","24.90","24.41","880.75K","-0.73%"
"Nov 22, 2016","24.50","24.72","25.07","24.44","1.34M","-0.08%"
"Nov 23, 2016","24.46","24.50","24.54","24.20","834.38K","-0.16%"
"Nov 24, 2016","24.38","24.46","24.55","24.26","177.00K","-0.33%"
"Nov 25, 2016","24.33","24.13","24.52","24.00","452.25K","-0.21%"
"Nov 28, 2016","24.67","24.17","24.79","24.17","526.38K","1.40%"
"Nov 29, 2016","24.38","24.52","24.75","24.27","1.04M","-1.18%"
"Nov 30, 2016","24.62","24.72","24.76","24.39","1.27M","0.98%"
"Dec 01, 2016","23.49","24.49","24.67","23.17","2.35M","-4.59%"
"Dec 02, 2016","23.57","23.17","23.80","22.85","1.13M","0.34%"
"Dec 05, 2016","23.36","23.58","23.87","23.12","629.25K","-0.89%"
"Dec 06, 2016","23.63","23.14","23.76","22.84","1.24M","1.16%"
"Dec 07, 2016","23.47","23.76","24.04","23.25","1.02M","-0.68%"
"Dec 08, 2016","23.36","23.59","23.86","23.32","1.12M","-0.47%"
"Dec 09, 2016","23.42","23.47","23.63","23.31","851.50K","0.26%"
"Dec 12, 2016","23.12","23.30","23.34","22.87","874.50K","-1.28%"
"Dec 13, 2016","23.35","22.89","23.36","22.86","1.35M","0.99%"
"Dec 14, 2016","23.25","23.36","23.40","23.02","1.41M","-0.43%"
"Dec 15, 2016","23.34","23.07","23.34","22.92","772.13K","0.39%"
"Dec 16, 2016","23.39","23.35","23.67","23.21","1.10M","0.21%"
"Dec 19, 2016","23.35","23.47","23.56","23.17","504.25K","-0.17%"
"Dec 20, 2016","23.02","23.56","23.56","22.85","942.88K","-1.41%"
"Dec 21, 2016","23.10","22.95","23.24","22.92","959.50K","0.35%"
"Dec 22, 2016","23.37","22.95","23.49","22.95","768.75K","1.17%"
"Dec 23, 2016","23.45","23.30","23.60","23.30","638.75K","0.34%"
"Dec 26, 2016","23.51","23.58","23.71","23.35","236.38K","0.26%"
"Dec 27, 2016","23.49","23.72","23.78","23.37","404.88K","-0.09%"
"Dec 28, 2016","23.90","23.43","23.98","23.42","533.25K","1.75%"
"Dec 29, 2016","24.04","23.93","24.30","23.69","954.63K","0.59%"
"Jan 02, 2017","23.93","24.05","24.06","23.63","490.25K","-0.46%"
"Jan 03, 2017","24.86","24.07","24.95","23.95","1.57M","3.89%"
"Jan 04, 2017","24.55","24.59","24.98","24.33","1.01M","-1.25%"
"Jan 05, 2017","24.37","24.71","24.73","24.24","826.75K","-0.73%"
"Jan 06, 2017","24.06","24.50","24.51","23.89","1.13M","-1.27%"
"Jan 09, 2017","24.09","23.95","24.34","23.95","1.04M","0.12%"
"Jan 10, 2017","24.07","24.17","24.24","23.70","924.13K","-0.08%"
"Jan 11, 2017","23.90","24.20","24.39","23.76","826.88K","-0.71%"
"Jan 12, 2017","24.24","24.72","25.08","24.20","2.00M","1.42%"
"Jan 13, 2017","24.30","24.27","24.65","24.20","843.50K","0.25%"
"Jan 16, 2017","24.02","24.38","24.52","23.91","423.00K","-1.15%"
"Jan 17, 2017","24.41","24.02","24.57","23.93","847.25K","1.62%"
"Jan 18, 2017","24.48","24.46","24.70","24.34","638.63K","0.29%"
"Jan 19, 2017","24.59","24.61","24.66","24.33","824.00K","0.45%"
"Jan 20, 2017","24.62","24.67","24.85","24.31","675.25K","0.12%"
"Jan 23, 2017","24.89","24.74","25.03","24.57","678.00K","1.10%"
"Jan 24, 2017","24.40","24.89","24.89","24.40","916.63K","-1.97%"
"Jan 26, 2017","24.83","24.48","25.18","24.46","978.88K","1.76%"
"Jan 27, 2017","24.79","24.85","25.01","24.57","488.38K","-0.16%"
"Jan 30, 2017","24.46","24.59","24.85","24.39","725.13K","-1.33%"
"Jan 31, 2017","24.59","24.50","24.89","24.06","816.00K","0.53%"
"Feb 01, 2017","24.48","24.79","24.90","24.13","1.00M","-0.45%"
"Feb 02, 2017","24.81","24.36","24.98","24.18","624.75K","1.35%"
"Feb 03, 2017","25.03","24.84","25.27","24.64","1.07M","0.89%"
"Feb 06, 2017","24.93","25.16","25.21","24.74","664.00K","-0.40%"
"Feb 07, 2017","24.90","25.05","25.12","24.72","1.00M","-0.12%"
"Feb 08, 2017","25.00","24.98","25.06","24.74","592.50K","0.40%"
"Feb 09, 2017","25.48","24.91","25.98","24.88","2.86M","1.92%"
"Feb 10, 2017","25.51","25.49","25.68","25.14","874.13K","0.12%"
"Feb 13, 2017","25.63","25.51","25.86","25.28","1.26M","0.47%"
"Feb 14, 2017","25.27","25.68","25.68","25.22","1.69M","-1.40%"
"Feb 15, 2017","25.66","25.49","25.82","25.37","2.11M","1.54%"
"Feb 16, 2017","25.51","25.47","25.77","25.34","742.88K","-0.58%"
"Feb 17, 2017","25.65","25.37","25.81","25.36","954.25K","0.55%"
"Feb 20, 2017","25.69","25.65","25.98","25.49","390.88K","0.16%"
"Feb 21, 2017","25.80","25.88","26.06","25.49","747.88K","0.43%"
"Feb 22, 2017","25.89","25.64","26.19","25.64","1.23M","0.35%"
"Feb 23, 2017","25.89","26.09","26.13","25.61","1.04M","0.00%"
"Feb 24, 2017","25.40","25.63","25.96","25.22","1.63M","-1.89%"
"Mar 01, 2017","25.55","25.61","25.83","25.40","705.13K","0.59%"
"Mar 02, 2017","25.40","25.47","25.61","25.18","774.50K","-0.59%"
"Mar 03, 2017","25.23","25.40","25.52","24.84","921.00K","-0.67%"
"Mar 06, 2017","25.41","25.17","25.77","25.11","1.10M","0.71%"
"Mar 07, 2017","25.53","25.53","25.65","25.38","696.25K","0.47%"
"Mar 08, 2017","25.16","25.54","25.61","24.98","843.50K","-1.45%"
"Mar 09, 2017","24.51","25.14","25.16","24.49","1.07M","-2.58%"
"Mar 10, 2017","24.61","24.61","24.91","24.28","2.19M","0.41%"
"Mar 13, 2017","25.17","24.73","25.51","24.35","1.68M","2.28%"
"Mar 14, 2017","24.86","24.93","25.40","24.86","1.13M","-1.23%"
"Mar 15, 2017","24.86","25.00","25.26","24.65","1.32M","0.00%"
"Mar 16, 2017","25.10","24.86","25.47","24.86","689.13K","0.97%"
"Mar 17, 2017","25.38","25.40","25.60","24.92","2.12M","1.12%"
"Mar 20, 2017","25.11","25.39","25.56","24.98","712.38K","-1.06%"
"Mar 21, 2017","24.70","25.11","25.20","24.53","1.22M","-1.63%"
"Mar 22, 2017","24.74","24.66","24.92","24.42","1.06M","0.16%"
"Mar 23, 2017","24.66","24.57","25.16","24.44","692.50K","-0.32%"
"Mar 24, 2017","24.86","24.66","24.88","24.55","1.01M","0.81%"
"Mar 27, 2017","24.68","24.74","24.95","24.48","646.50K","-0.72%"
"Mar 28, 2017","24.40","24.59","24.70","24.21","1.07M","-1.13%"
"Mar 29, 2017","24.58","24.35","24.59","24.13","771.38K","0.74%"
"Mar 30, 2017","24.31","24.56","24.57","24.11","769.25K","-1.10%"
"Mar 31, 2017","24.29","24.20","24.61","24.15","682.63K","-0.08%"
"Apr 03, 2017","24.37","24.28","24.55","24.19","639.00K","0.33%"
"Apr 04, 2017","24.65","24.37","24.70","24.25","478.63K","1.15%"
"Apr 05, 2017","24.35","24.65","24.65","24.07","940.63K","-1.22%"
"Apr 06, 2017","24.08","24.28","24.32","23.82","795.13K","-1.11%"
"Apr 07, 2017","24.04","24.03","24.48","23.94","685.00K","-0.17%"
"Apr 10, 2017","24.04","24.12","24.22","23.85","512.13K","0.00%"
"Apr 11, 2017","24.00","24.04","24.20","23.61","954.75K","-0.17%"
"Apr 12, 2017","23.80","24.10","24.37","23.76","1.00M","-0.83%"
"Apr 13, 2017","23.35","23.78","24.00","23.35","774.13K","-1.89%"
"Apr 17, 2017","23.87","23.47","23.98","23.39","1.02M","2.23%"
"Apr 18, 2017","23.90","23.78","23.95","23.73","625.75K","0.13%"
"Apr 19, 2017","23.56","23.92","23.98","23.48","789.75K","-1.42%"
"Apr 20, 2017","23.65","23.66","24.20","23.56","1.02M","0.38%"
"Apr 24, 2017","23.69","23.69","24.04","23.35","655.63K","0.17%"
"Apr 25, 2017","23.87","23.72","23.98","23.36","1.02M","0.76%"
"Apr 26, 2017","23.75","24.04","24.29","23.57","868.75K","-0.50%"
"Apr 27, 2017","23.58","23.87","23.89","23.43","1.04M","-0.72%"
"Apr 28, 2017","23.35","23.58","23.72","23.35","1.70M","-0.98%"
"May 02, 2017","23.82","23.47","24.10","23.42","2.94M","2.01%"
"May 03, 2017","23.89","23.90","24.04","23.73","1.16M","0.29%"
"May 04, 2017","23.65","23.72","24.00","23.49","1.06M","-1.00%"
"May 05, 2017","23.64","23.69","23.78","23.49","798.38K","-0.04%"
"May 08, 2017","23.49","23.69","23.73","23.42","539.63K","-0.63%"
"May 09, 2017","23.38","23.61","23.72","23.38","1.00M","-0.47%"
"May 10, 2017","23.58","23.49","23.69","23.43","1.27M","0.86%"
"May 11, 2017","23.41","23.65","23.89","23.38","932.75K","-0.72%"
"May 12, 2017","23.65","23.52","23.87","23.52","1.15M","1.03%"
"May 15, 2017","23.82","23.69","23.86","23.59","776.88K","0.72%"
"May 16, 2017","23.95","23.85","23.98","23.63","1.11M","0.55%"
"May 17, 2017","23.70","23.77","23.88","23.39","1.87M","-1.04%"
"May 18, 2017","22.46","22.59","23.32","20.81","3.41M","-5.23%"
"May 19, 2017","22.94","22.55","23.11","22.55","2.23M","2.14%"
"May 22, 2017","22.77","22.94","23.04","22.61","1.67M","-0.74%"
"May 23, 2017","22.80","22.88","23.34","22.68","1.17M","0.13%"
"May 24, 2017","23.03","23.14","23.32","22.97","1.09M","1.01%"
"May 25, 2017","22.94","23.16","23.18","22.78","674.63K","-0.39%"
"May 26, 2017","23.16","23.11","23.32","22.97","1.19M","0.96%"
"May 29, 2017","23.01","23.01","23.12","22.82","544.13K","-0.65%"
"May 30, 2017","23.20","23.10","23.31","23.00","1.05M","0.83%"
"May 31, 2017","23.22","23.28","23.28","22.80","1.54M","0.09%"
"Jun 01, 2017","23.36","23.22","23.56","23.01","1.42M","0.60%"
"Jun 02, 2017","23.37","23.54","23.62","23.27","1.37M","0.04%"
"Jun 05, 2017","23.19","23.30","23.60","23.10","1.19M","-0.77%"
"Jun 06, 2017","23.19","23.19","23.40","23.07","1.10M","0.00%"
"Jun 07, 2017","23.42","23.38","23.42","23.15","1.30M","0.99%"
"Jun 08, 2017","23.24","23.34","23.37","23.05","834.63K","-0.77%"
"Jun 09, 2017","23.31","23.32","23.42","23.05","1.20M","0.30%"
"Jun 12, 2017","23.24","23.36","23.36","23.06","1.02M","-0.30%"
"Jun 13, 2017","23.31","23.22","23.45","23.10","1.28M","0.30%"
"Jun 14, 2017","23.24","23.33","23.57","23.15","2.15M","-0.30%"
"Jun 16, 2017","24.08","23.18","24.08","23.18","4.09M","3.61%"
"Jun 19, 2017","24.36","24.06","24.50","23.95","896.13K","1.16%"
"Jun 20, 2017","24.22","24.35","24.48","24.10","1.53M","-0.57%"
"Jun 21, 2017","24.39","24.14","24.75","24.14","1.42M","0.70%"
"Jun 22, 2017","24.31","24.34","24.66","24.20","927.13K","-0.33%"
"Jun 23, 2017","24.19","24.31","24.50","24.19","1.04M","-0.49%"
"Jun 26, 2017","24.43","24.31","24.58","24.15","914.00K","0.99%"
"Jun 27, 2017","24.17","24.36","24.44","23.96","1.37M","-1.06%"
"Jun 28, 2017","24.39","24.14","24.48","24.14","832.00K","0.91%"
"Jun 29, 2017","23.80","24.45","24.45","23.80","1.09M","-2.42%"
"Jun 30, 2017","23.74","23.92","24.03","23.74","1.07M","-0.25%"
"Jul 03, 2017","24.02","23.91","24.07","23.76","554.00K","1.18%"
"Jul 04, 2017","23.97","24.04","24.08","23.90","251.25K","-0.21%"
"Jul 05, 2017","23.78","24.03","24.17","23.63","949.25K","-0.79%"
"Jul 06, 2017","23.85","23.78","24.08","23.77","1.17M","0.29%"
"Jul 07, 2017","24.07","23.97","24.42","23.95","1.42M","0.92%"
"Jul 10, 2017","24.36","24.38","24.40","24.06","1.25M","1.20%"
"Jul 11, 2017","24.40","24.36","24.60","24.06","1.25M","0.16%"
"Jul 12, 2017","24.55","24.58","24.91","24.34","1.80M","0.61%"
"Jul 13, 2017","24.49","24.65","24.65","24.25","1.70M","-0.24%"
"Jul 14, 2017","24.32","24.54","24.58","24.18","812.13K","-0.69%"
"Jul 17, 2017","24.32","24.34","24.39","24.10","485.13K","0.00%"
"Jul 18, 2017","24.39","24.29","24.45","24.13","558.25K","0.29%"
"Jul 19, 2017","24.28","24.31","24.42","24.17","617.25K","-0.45%"
"Jul 20, 2017","24.37","24.34","24.41","24.09","626.88K","0.37%"
"Jul 21, 2017","24.37","24.38","24.63","24.28","781.63K","0.00%"
"Jul 24, 2017","24.57","24.48","24.60","24.41","390.25K","0.82%"
"Jul 25, 2017","24.71","24.58","24.90","24.34","889.13K","0.57%"
"Jul 26, 2017","24.54","24.67","24.77","24.46","823.00K","-0.69%"
"Jul 27, 2017","24.55","24.73","24.78","24.50","530.38K","0.04%"
"Jul 28, 2017","24.45","24.85","24.90","24.36","749.88K","-0.41%"
"Jul 31, 2017","24.50","24.62","24.66","24.43","860.13K","0.20%"
"Aug 01, 2017","24.81","24.61","24.96","24.57","1.08M","1.27%"
"Aug 02, 2017","25.09","24.82","25.45","24.71","1.12M","1.13%"
"Aug 03, 2017","25.34","25.13","25.45","25.09","975.00K","1.00%"
"Aug 04, 2017","25.34","25.37","25.41","25.13","528.88K","0.00%"
"Aug 07, 2017","25.40","25.45","25.66","25.06","946.50K","0.24%"
"Aug 08, 2017","25.13","25.45","25.46","25.09","1.26M","-1.06%"
"Aug 09, 2017","25.05","25.15","25.27","24.96","1.35M","-0.32%"
"Aug 10, 2017","23.90","23.97","24.04","23.52","1.05M","-4.59%"
"Aug 11, 2017","24.05","23.94","24.20","23.77","803.00K","0.63%"
"Aug 14, 2017","24.23","24.07","24.55","23.90","848.38K","0.75%"
"Aug 15, 2017","24.42","24.34","24.64","24.24","858.75K","0.78%"
"Aug 16, 2017","24.13","24.59","24.67","24.05","1.36M","-1.19%"
"Aug 17, 2017","24.16","24.14","24.33","23.96","665.50K","0.12%"
"Aug 18, 2017","24.42","24.27","24.45","24.09","499.00K","1.08%"
"Aug 21, 2017","24.22","24.40","24.43","24.22","399.75K","-0.82%"
"Aug 22, 2017","24.43","24.36","24.50","24.36","955.50K","0.87%"
"Aug 23, 2017","24.42","24.43","24.59","24.36","699.13K","-0.04%"
"Aug 24, 2017","24.50","24.53","24.56","24.38","3.09M","0.33%"
"Aug 25, 2017","24.59","24.54","24.77","24.46","649.75K","0.37%"
"Aug 28, 2017","24.74","24.59","24.88","24.59","523.13K","0.61%"
"Aug 29, 2017","25.01","24.68","25.06","24.64","766.50K","1.09%"
"Aug 30, 2017","24.88","24.95","24.97","24.70","780.13K","-0.52%"
"Aug 31, 2017","25.27","24.92","25.45","24.92","2.25M","1.57%"
"Sep 01, 2017","25.32","25.20","25.41","25.07","1.07M","0.20%"
"Sep 04, 2017","25.10","25.33","25.33","25.03","351.25K","-0.87%"
"Sep 05, 2017","25.34","25.29","25.45","25.16","1.34M","0.96%"
"Sep 06, 2017","25.20","25.43","25.52","25.20","1.30M","-0.55%"
"Sep 08, 2017","25.76","25.22","25.85","25.22","3.85M","2.22%"
"Sep 11, 2017","26.48","25.83","26.56","25.81","1.09M","2.80%"
"Sep 12, 2017","26.31","26.44","26.58","26.22","1.62M","-0.64%"
"Sep 13, 2017","26.34","26.34","26.54","26.25","2.01M","0.11%"
"Sep 14, 2017","26.14","26.34","26.61","26.14","1.21M","-0.76%"
"Sep 15, 2017","25.59","26.20","26.24","25.55","2.60M","-2.10%"
"Sep 18, 2017","25.99","25.73","26.15","25.73","720.00K","1.56%"
"Sep 19, 2017","25.76","25.97","26.08","25.65","1.09M","-0.88%"
"Sep 20, 2017","25.55","25.78","25.90","25.44","1.74M","-0.82%"
"Sep 21, 2017","25.33","25.62","25.97","25.20","952.88K","-0.86%"
"Sep 22, 2017","25.23","25.38","25.53","25.23","723.38K","-0.39%"
"Sep 25, 2017","25.08","25.22","25.35","24.94","702.38K","-0.59%"
"Sep 26, 2017","25.52","25.21","25.52","25.02","1.78M","1.75%"
"Sep 27, 2017","25.12","25.62","25.68","25.10","1.39M","-1.57%"
"Sep 28, 2017","25.43","25.20","25.97","24.97","1.67M","1.23%"
"Sep 29, 2017","25.37","25.54","25.77","25.34","1.23M","-0.24%"
"Oct 02, 2017","25.14","25.44","25.56","25.04","622.38K","-0.91%"
"Oct 03, 2017","25.70","25.31","25.99","25.19","1.49M","2.23%"
"Oct 04, 2017","25.63","25.78","26.17","25.60","580.50K","-0.27%"
"Oct 05, 2017","26.02","25.80","26.84","25.80","2.10M","1.52%"
"Oct 06, 2017","25.86","25.85","26.01","25.59","529.63K","-0.61%"
"Oct 09, 2017","25.66","25.80","25.99","25.62","632.13K","-0.77%"
"Oct 10, 2017","25.94","25.90","26.48","25.78","1.08M","1.09%"
"Oct 11, 2017","25.90","25.83","26.26","25.76","1.85M","-0.15%"
"Oct 13, 2017","26.31","26.00","26.45","26.00","1.26M","1.58%"
"Oct 16, 2017","26.02","26.46","26.59","26.02","1.01M","-1.10%"
"Oct 17, 2017","25.83","26.11","26.44","25.73","1.85M","-0.73%"
"Oct 18, 2017","25.69","25.81","25.92","25.67","1.70M","-0.54%"
"Oct 19, 2017","25.63","25.66","25.84","25.44","1.08M","-0.23%"
"Oct 20, 2017","25.52","25.82","25.84","25.51","1.24M","-0.43%"
"Oct 23, 2017","25.20","25.59","25.66","25.18","1.04M","-1.25%"
"Oct 24, 2017","25.36","25.21","25.50","25.21","1.33M","0.63%"
"Oct 25, 2017","25.34","25.50","25.61","25.22","732.25K","-0.08%"
"Oct 26, 2017","25.19","25.43","25.60","25.19","855.25K","-0.59%"
"Oct 27, 2017","25.64","25.20","25.92","25.12","1.39M","1.79%"
"Oct 30, 2017","25.20","25.59","25.69","24.85","1.36M","-1.72%"
"Oct 31, 2017","25.06","25.20","25.38","24.99","1.06M","-0.56%"
"Nov 01, 2017","24.93","25.26","25.45","24.89","763.63K","-0.52%"
"Nov 03, 2017","24.68","24.93","25.04","24.54","1.44M","-1.00%"
"Nov 06, 2017","25.27","24.81","25.52","24.72","993.25K","2.39%"
"Nov 07, 2017","24.99","25.17","25.69","24.75","1.76M","-1.11%"
"Nov 08, 2017","26.26","25.17","26.46","25.16","1.68M","5.08%"
"Nov 09, 2017","26.39","25.92","26.58","25.92","987.00K","0.50%"
"Nov 10, 2017","25.85","26.46","26.50","25.67","1.02M","-2.05%"
"Nov 13, 2017","25.86","25.69","26.54","25.47","1.51M","0.04%"
"Nov 14, 2017","25.58","25.99","26.10","25.42","975.25K","-1.08%"
"Nov 16, 2017","26.28","25.82","26.31","25.70","1.01M","2.74%"
"Nov 17, 2017","26.06","26.02","26.49","25.97","935.38K","-0.84%"
"Nov 21, 2017","26.42","26.39","27.06","26.11","968.00K","1.38%"
"Nov 22, 2017","26.50","26.63","26.95","26.41","831.75K","0.30%"
"Nov 23, 2017","26.71","26.59","27.04","26.26","251.88K","0.79%"
"Nov 24, 2017","26.44","26.97","27.02","26.44","358.88K","-1.01%"
"Nov 27, 2017","26.34","26.48","26.57","26.05","610.63K","-0.38%"
"Nov 28, 2017","26.12","26.50","26.65","26.12","791.88K","-0.84%"
"Nov 29, 2017","25.72","26.14","26.25","25.52","1.24M","-1.53%"
"Nov 30, 2017","25.23","25.65","25.76","24.95","1.87M","-1.91%"
"Dec 01, 2017","25.16","25.23","25.52","25.00","835.50K","-0.28%"
"Dec 04, 2017","25.52","25.22","25.70","25.18","739.88K","1.43%"
"Dec 05, 2017","25.23","25.35","25.74","25.12","511.63K","-1.14%"
"Dec 06, 2017","25.15","25.15","25.31","24.99","1.07M","-0.32%"
"Dec 07, 2017","24.93","24.97","25.28","24.70","1.14M","-0.87%"
"Dec 08, 2017","24.82","25.10","25.32","24.82","953.25K","-0.44%"
"Dec 11, 2017","24.85","24.85","25.05","24.73","599.75K","0.12%"
"Dec 12, 2017","24.96","24.72","24.96","24.47","779.88K","0.44%"
"Dec 13, 2017","24.78","25.14","25.48","24.48","1.66M","-0.72%"
"Dec 14, 2017","24.79","24.55","25.10","24.46","1.12M","0.04%"
"Dec 15, 2017","25.29","24.79","25.40","24.79","1.87M","2.02%"
"Dec 18, 2017","25.37","25.35","25.47","25.05","587.38K","0.32%"
"Dec 19, 2017","24.98","25.40","25.60","24.72","1.45M","-1.54%"
"Dec 20, 2017","25.26","24.97","25.53","24.97","1.03M","1.12%"
"Dec 21, 2017","25.27","25.29","25.50","25.20","1.06M","0.04%"
"Dec 22, 2017","25.15","25.22","25.37","25.13","288.75K","-0.47%"
"Dec 26, 2017","25.28","25.34","25.57","25.23","457.00K","0.52%"
"Dec 27, 2017","25.44","25.46","25.68","25.23","350.13K","0.63%"
"Dec 28, 2017","25.29","25.62","25.74","25.29","1.11M","-0.59%"
"Jan 02, 2018","25.44","25.49","25.62","25.25","663.63K","0.59%"
"Jan 03, 2018","25.27","25.28","25.48","25.11","673.25K","-0.67%"
"Jan 04, 2018","24.94","25.46","25.46","24.94","1.42M","-1.31%"
"Jan 05, 2018","25.07","24.98","25.20","24.98","444.75K","0.52%"
"Jan 08, 2018","25.21","25.11","25.32","24.96","806.00K","0.56%"
"Jan 09, 2018","25.21","25.22","25.30","24.95","933.63K","0.00%"
"Jan 10, 2018","25.12","25.22","25.22","25.03","1.04M","-0.36%"
"Jan 11, 2018","24.87","25.19","25.19","24.85","1.29M","-1.00%"
"Jan 12, 2018","25.00","24.88","25.03","24.75","624.88K","0.52%"
"Jan 15, 2018","25.13","25.04","25.21","24.89","405.25K","0.52%"
"Jan 16, 2018","25.25","25.13","25.25","25.09","623.50K","0.48%"
"Jan 17, 2018","25.62","25.17","25.80","25.14","896.25K","1.47%"
"Jan 18, 2018","25.71","25.55","25.97","25.47","2.96M","0.35%"
"Jan 19, 2018","26.17","25.83","26.50","25.72","1.10M","1.79%"
"Jan 22, 2018","26.14","26.21","26.46","26.07","908.50K","-0.11%"
"Jan 23, 2018","25.64","26.14","26.19","25.45","749.88K","-1.91%"
"Jan 24, 2018","26.14","25.85","26.39","25.73","1.97M","1.95%"
"Jan 26, 2018","26.21","26.40","26.53","26.02","1.09M","0.27%"
"Jan 29, 2018","26.09","26.31","26.36","25.89","1.04M","-0.46%"
"Jan 30, 2018","25.96","25.89","26.12","25.60","557.13K","-0.50%"
"Jan 31, 2018","25.60","26.13","26.24","25.46","1.10M","-1.39%"
"Feb 01, 2018","25.70","26.14","26.33","25.67","1.35M","0.39%"
"Feb 02, 2018","25.64","25.64","25.92","25.32","1.29M","-0.23%"
"Feb 05, 2018","25.28","25.61","25.61","25.22","872.50K","-1.40%"
"Feb 06, 2018","25.60","25.03","25.67","24.87","1.42M","1.27%"
"Feb 07, 2018","25.47","25.62","25.87","25.37","829.25K","-0.51%"
"Feb 08, 2018","25.05","25.47","25.56","24.98","764.75K","-1.65%"
"Feb 09, 2018","24.89","25.00","25.16","24.71","850.75K","-0.64%"
"Feb 14, 2018","25.23","25.07","25.70","25.03","1.46M","1.37%"
"Feb 15, 2018","25.60","25.45","25.97","25.26","1.13M","1.47%"
"Feb 16, 2018","25.31","24.87","25.55","24.81","1.31M","-1.13%"
"Feb 19, 2018","25.37","25.42","25.48","25.13","319.25K","0.22%"
"Feb 20, 2018","26.02","25.21","26.37","25.16","3.19M","2.58%"
"Feb 21, 2018","26.21","26.03","26.45","25.60","2.28M","0.74%"
"Feb 22, 2018","26.32","26.21","26.65","25.97","2.29M","0.39%"
"Feb 23, 2018","26.87","26.90","27.07","26.41","2.07M","2.09%"
"Feb 26, 2018","27.28","27.10","27.65","26.98","2.21M","1.54%"
"Feb 27, 2018","27.21","27.27","27.52","27.18","1.30M","-0.25%"
"Feb 28, 2018","26.97","27.20","27.38","26.54","2.16M","-0.89%"
"Mar 01, 2018","27.08","26.96","27.69","26.79","1.43M","0.41%"
"Mar 02, 2018","26.97","27.10","27.41","26.59","1.87M","-0.41%"
"Mar 05, 2018","27.04","27.03","27.21","26.94","850.00K","0.26%"
"Mar 06, 2018","26.63","27.19","27.19","26.63","1.44M","-1.50%"
"Mar 07, 2018","26.91","26.66","27.04","26.66","1.44M","1.03%"
"Mar 08, 2018","26.94","26.87","27.10","26.85","760.88K","0.13%"
"Mar 09, 2018","26.97","27.07","27.27","26.93","765.00K","0.10%"
"Mar 12, 2018","27.12","26.97","27.33","26.97","689.38K","0.56%"
"Mar 13, 2018","26.52","27.24","27.24","26.50","1.30M","-2.21%"
"Mar 14, 2018","26.39","26.63","26.71","26.29","907.63K","-0.52%"
"Mar 15, 2018","26.17","26.52","26.53","26.10","1.31M","-0.81%"
"Mar 16, 2018","26.45","26.10","27.07","26.10","2.55M","1.05%"
"Mar 19, 2018","26.59","26.21","26.76","26.21","554.75K","0.55%"
"Mar 20, 2018","26.73","26.74","26.83","26.50","451.25K","0.52%"
"Mar 21, 2018","26.94","26.81","27.07","26.57","1.12M","0.80%"
"Mar 22, 2018","26.64","27.04","27.19","26.45","966.00K","-1.13%"
"Mar 23, 2018","26.48","26.52","26.72","26.28","802.13K","-0.59%"
"Mar 26, 2018","26.52","26.75","26.75","26.16","937.50K","0.16%"
"Mar 27, 2018","26.58","26.49","26.75","26.35","1.21M","0.21%"
"Mar 28, 2018","26.63","26.43","27.04","26.43","1.83M","0.18%"
"Mar 29, 2018","26.98","26.85","27.15","26.65","931.13K","1.32%"
"Apr 02, 2018","26.52","27.01","27.07","26.30","759.25K","-1.71%"
"Apr 03, 2018","26.15","26.53","26.68","26.15","1.66M","-1.38%"
"Apr 04, 2018","26.30","25.99","26.59","25.84","1.65M","0.55%"
"Apr 05, 2018","26.61","26.66","27.04","26.37","1.48M","1.21%"
"Apr 06, 2018","26.32","26.45","26.94","25.88","1.39M","-1.09%"
"Apr 09, 2018","26.04","26.58","26.58","25.99","1.24M","-1.07%"
"Apr 10, 2018","26.52","26.03","26.82","26.03","2.75M","1.85%"
"Apr 11, 2018","26.18","26.62","26.65","25.94","827.25K","-1.30%"
"Apr 12, 2018","26.35","26.37","26.45","26.18","1.23M","0.66%"
"Apr 13, 2018","26.42","26.28","26.59","25.98","813.75K","0.26%"
"Apr 16, 2018","25.83","26.53","26.53","25.83","825.63K","-2.24%"
"Apr 17, 2018","26.14","25.94","26.14","25.68","1.14M","1.23%"
"Apr 18, 2018","26.29","26.14","26.37","25.98","1.68M","0.55%"
"Apr 19, 2018","25.96","26.23","26.23","25.77","1.10M","-1.26%"
"Apr 20, 2018","25.89","26.14","26.14","25.56","1.41M","-0.27%"
"Apr 23, 2018","25.70","25.97","26.17","25.70","794.25K","-0.75%"
"Apr 24, 2018","25.82","25.83","26.20","25.65","1.18M","0.48%"
"Apr 25, 2018","25.89","25.67","26.04","25.67","854.63K","0.27%"
"Apr 26, 2018","26.67","25.95","26.72","25.91","940.50K","3.01%"
"Apr 27, 2018","26.63","26.73","26.73","26.33","1.51M","-0.16%"
"Apr 30, 2018","26.17","26.70","26.70","26.17","801.88K","-1.73%"
"May 02, 2018","26.07","26.06","26.25","25.86","961.38K","-0.38%"
"May 03, 2018","25.95","25.96","26.34","25.79","1.26M","-0.46%"
"May 04, 2018","25.70","25.87","26.00","25.59","749.13K","-0.95%"
"May 07, 2018","25.55","25.67","25.87","25.55","782.00K","-0.58%"
"May 08, 2018","25.43","25.57","25.76","25.26","950.25K","-0.50%"
"May 09, 2018","25.45","25.43","25.71","25.23","970.13K","0.11%"
"May 10, 2018","26.30","25.60","26.49","25.43","1.67M","3.34%"
"May 11, 2018","26.13","26.19","26.44","25.80","1.23M","-0.67%"
"May 14, 2018","26.17","26.27","26.64","26.02","1.74M","0.19%"
"May 15, 2018","26.15","26.17","26.42","25.69","1.63M","-0.08%"
"May 16, 2018","27.38","25.94","27.58","25.94","2.11M","4.68%"
"May 17, 2018","26.80","27.09","27.26","26.70","1.78M","-2.12%"
"May 18, 2018","27.36","26.69","27.39","26.46","2.15M","2.11%"
"May 21, 2018","27.31","27.41","27.52","26.81","1.30M","-0.21%"
"May 22, 2018","27.04","27.59","27.64","26.95","2.14M","-0.98%"
"May 23, 2018","27.05","26.96","27.33","26.75","1.12M","0.05%"
"May 24, 2018","26.66","26.85","27.20","26.65","1.54M","-1.44%"
"May 25, 2018","26.61","26.67","27.10","26.54","1.12M","-0.21%"
"May 28, 2018","26.16","26.54","26.66","25.76","460.88K","-1.68%"
"May 29, 2018","25.68","26.29","26.29","25.28","2.27M","-1.84%"
"May 30, 2018","26.17","25.59","26.26","25.54","1.62M","1.90%"
"Jun 01, 2018","26.60","26.24","26.81","26.03","1.37M","1.65%"
"Jun 04, 2018","26.37","26.86","26.86","26.19","964.25K","-0.85%"
"Jun 05, 2018","25.61","26.18","26.38","25.61","1.16M","-2.90%"
"Jun 06, 2018","25.15","25.49","25.86","25.01","1.07M","-1.80%"
"Jun 07, 2018","24.80","24.91","25.12","24.03","1.35M","-1.41%"
"Jun 08, 2018","24.58","25.00","25.00","24.34","1.55M","-0.88%"
"Jun 11, 2018","24.38","24.53","25.10","24.30","1.11M","-0.81%"
"Jun 12, 2018","24.19","24.32","24.45","24.05","1.61M","-0.75%"
"Jun 13, 2018","24.07","24.28","24.71","23.92","1.55M","-0.53%"
"Jun 14, 2018","23.73","24.10","24.24","23.66","1.10M","-1.38%"
"Jun 15, 2018","24.20","23.66","24.25","23.66","2.38M","1.97%"
"Jun 18, 2018","23.78","23.98","24.22","23.73","753.00K","-1.72%"
"Jun 19, 2018","23.73","23.74","24.20","23.62","1.33M","-0.21%"
"Jun 20, 2018","23.70","23.76","24.01","23.55","1.17M","-0.15%"
"Jun 21, 2018","23.64","23.56","23.90","23.45","1.46M","-0.24%"
"Jun 22, 2018","23.90","23.63","24.04","23.52","1.42M","1.08%"
"Jun 25, 2018","24.05","24.00","24.28","23.83","1.09M","0.65%"
"Jun 26, 2018","24.28","24.20","24.28","23.84","837.75K","0.94%"
"Jun 27, 2018","24.28","24.03","24.34","24.03","921.50K","0.00%"
"Jun 28, 2018","24.36","24.07","24.47","24.07","1.06M","0.32%"
"Jun 29, 2018","24.22","24.45","24.68","24.06","1.17M","-0.58%"
"Jul 02, 2018","24.24","24.19","24.36","24.00","444.88K","0.09%"
"Jul 03, 2018","24.41","24.34","24.80","24.20","663.63K","0.70%"
"Jul 04, 2018","24.65","24.83","25.00","24.43","685.63K","1.01%"
"Jul 05, 2018","24.45","24.99","24.99","24.42","470.38K","-0.83%"
"Jul 06, 2018","24.24","24.66","24.66","24.14","685.13K","-0.84%"
"Jul 10, 2018","24.34","24.37","24.65","24.18","797.63K","0.38%"
"Jul 11, 2018","24.64","24.29","24.88","24.20","916.50K","1.25%"
"Jul 12, 2018","25.01","25.01","25.17","24.72","1.35M","1.52%"
"Jul 13, 2018","25.67","25.01","25.78","24.91","1.37M","2.60%"
"Jul 16, 2018","25.62","25.76","25.76","25.47","364.25K","-0.19%"
"Jul 17, 2018","25.11","25.50","25.93","25.00","1.73M","-1.96%"
"Jul 18, 2018","25.06","25.08","25.38","24.99","497.50K","-0.23%"
"Jul 19, 2018","25.15","25.01","25.21","24.84","629.00K","0.37%"
"Jul 20, 2018","25.42","25.40","25.79","25.16","896.88K","1.07%"
"Jul 23, 2018","25.24","25.33","25.54","25.06","498.25K","-0.70%"
"Jul 24, 2018","25.55","25.50","25.97","25.28","1.16M","1.21%"
"Jul 25, 2018","25.97","25.55","26.35","25.52","812.25K","1.66%"
"Jul 26, 2018","25.86","25.83","26.44","25.74","1.16M","-0.44%"
"Jul 27, 2018","26.04","25.86","26.34","25.82","454.88K","0.71%"
"Jul 30, 2018","26.26","26.30","26.73","25.91","775.88K","0.84%"
"Jul 31, 2018","26.45","26.22","26.83","26.21","1.29M","0.73%"
"Aug 01, 2018","26.40","26.52","26.67","26.22","593.00K","-0.19%"
"Aug 02, 2018","26.40","26.44","26.55","26.21","576.13K","0.00%"
"Aug 03, 2018","26.63","26.37","26.80","26.15","819.50K","0.88%"
"Aug 06, 2018","26.68","26.67","26.87","26.50","319.00K","0.16%"
"Aug 07, 2018","25.96","26.70","26.74","25.79","1.58M","-2.68%"
"Aug 08, 2018","25.90","26.13","26.60","25.90","1.41M","-0.25%"
"Aug 09, 2018","27.07","26.88","27.95","26.59","3.00M","4.51%"
"Aug 10, 2018","26.38","27.17","27.34","26.36","1.42M","-2.54%"
"Aug 13, 2018","26.39","26.63","26.95","26.11","1.10M","0.03%"
"Aug 14, 2018","26.51","26.52","26.75","26.22","1.13M","0.48%"
"Aug 15, 2018","26.28","26.39","26.59","26.05","1.74M","-0.88%"
"Aug 16, 2018","26.28","26.40","26.68","26.07","1.19M","0.00%"
"Aug 17, 2018","26.21","26.32","26.42","25.98","839.25K","-0.27%"
"Aug 20, 2018","26.42","26.27","26.54","26.07","1.01M","0.81%"
"Aug 21, 2018","26.25","27.31","27.31","26.14","1.44M","-0.66%"
"Aug 22, 2018","26.75","26.20","26.85","26.00","1.19M","1.89%"
"Aug 23, 2018","26.39","26.80","26.91","26.29","892.75K","-1.33%"
"Aug 24, 2018","26.72","26.54","26.86","26.39","952.63K","1.27%"
"Aug 27, 2018","27.16","26.84","27.32","26.66","1.15M","1.64%"
"Aug 28, 2018","27.24","27.04","27.52","26.97","1.27M","0.30%"
"Aug 29, 2018","27.23","27.34","27.34","26.85","1.53M","-0.05%"
"Aug 30, 2018","26.98","27.09","27.22","26.85","1.21M","-0.90%"
"Aug 31, 2018","27.39","26.91","27.39","26.76","1.85M","1.51%"
"Sep 03, 2018","27.50","27.13","27.90","27.13","1.49M","0.38%"
"Sep 04, 2018","27.02","27.52","27.64","26.93","1.32M","-1.73%"
"Sep 05, 2018","26.98","27.01","27.25","26.92","676.75K","-0.16%"
"Sep 06, 2018","27.44","27.21","27.67","27.04","1.04M","1.71%"
"Sep 10, 2018","27.41","27.67","27.75","27.24","739.25K","-0.08%"
"Sep 11, 2018","27.11","27.18","27.32","26.98","745.50K","-1.11%"
"Sep 12, 2018","26.95","27.30","27.43","26.94","781.38K","-0.60%"
"Sep 13, 2018","27.05","27.00","27.18","26.81","1.08M","0.39%"
"Sep 14, 2018","26.84","27.07","27.18","26.66","647.88K","-0.77%"
"Sep 17, 2018","27.01","26.90","27.50","26.78","1.04M","0.61%"
"Sep 18, 2018","26.98","27.06","27.37","26.95","888.88K","-0.08%"
"Sep 19, 2018","26.68","26.95","27.20","26.46","1.15M","-1.13%"
"Sep 20, 2018","26.58","26.73","27.09","26.58","640.88K","-0.36%"
"Sep 21, 2018","26.72","26.86","27.00","26.49","1.49M","0.53%"
"Sep 24, 2018","26.50","26.76","27.05","26.46","809.50K","-0.83%"
"Sep 25, 2018","26.41","26.43","26.75","26.28","711.25K","-0.34%"
"Sep 26, 2018","26.52","26.43","26.86","26.42","915.25K","0.39%"
"Sep 27, 2018","26.27","26.53","26.83","26.17","2.01M","-0.92%"
"Sep 28, 2018","26.34","26.19","26.60","26.19","918.25K","0.25%"
"Oct 01, 2018","26.22","26.40","26.53","26.18","446.25K","-0.45%"
"Oct 02, 2018","26.74","26.50","27.18","26.49","1.24M","1.98%"
"Oct 03, 2018","27.04","27.23","27.68","26.92","1.42M","1.14%"
"Oct 04, 2018","27.13","27.09","27.44","26.77","1.20M","0.33%"
"Oct 05, 2018","26.79","27.39","27.41","26.54","886.25K","-1.26%"
"Oct 08, 2018","27.13","27.41","27.74","27.01","1.99M","1.27%"
"Oct 09, 2018","27.27","27.21","27.56","27.05","1.25M","0.49%"
"Oct 10, 2018","26.81","27.17","27.30","26.81","1.12M","-1.66%"
"Oct 11, 2018","26.31","27.02","27.16","26.31","1.53M","-1.88%"
"Oct 15, 2018","26.67","26.58","27.29","26.37","1.27M","1.38%"
"Oct 16, 2018","27.30","26.93","27.30","26.75","1.08M","2.34%"
"Oct 17, 2018","27.66","27.27","27.77","27.04","1.64M","1.33%"
"Oct 18, 2018","27.95","27.72","28.18","27.51","2.16M","1.05%"
"Oct 19, 2018","28.21","28.13","28.33","27.94","1.53M","0.93%"
"Oct 22, 2018","28.28","28.23","28.56","28.16","1.27M","0.26%"
"Oct 23, 2018","28.36","28.20","28.77","28.07","1.06M","0.29%"
"Oct 24, 2018","27.99","28.51","28.55","27.84","1.86M","-1.33%"
"Oct 25, 2018","28.02","27.91","28.39","27.91","1.63M","0.13%"
"Oct 26, 2018","28.62","28.36","28.80","28.01","3.01M","2.12%"
"Oct 29, 2018","28.58","29.14","29.55","28.48","2.52M","-0.13%"
"Oct 30, 2018","29.34","28.88","29.50","28.69","2.23M","2.68%"
"Oct 31, 2018","29.54","29.48","29.70","29.14","1.39M","0.68%"
"Nov 01, 2018","29.81","29.85","30.15","29.31","2.67M","0.90%"
"Nov 05, 2018","30.46","29.96","30.55","29.49","2.89M","2.19%"
"Nov 06, 2018","30.44","30.44","31.08","30.12","2.04M","-0.10%"
"Nov 07, 2018","30.58","30.57","31.18","30.55","1.38M","0.46%"
"Nov 08, 2018","29.79","30.80","30.95","29.69","1.91M","-2.57%"
"Nov 09, 2018","30.41","29.80","30.51","29.80","953.38K","2.07%"
"Nov 12, 2018","30.73","30.44","31.16","30.23","1.46M","1.07%"
"Nov 13, 2018","30.51","30.88","30.99","30.33","1.36M","-0.72%"
"Nov 14, 2018","31.14","30.79","31.14","30.47","1.28M","2.04%"
"Nov 16, 2018","31.77","31.26","31.95","31.23","1.78M","2.03%"
"Nov 19, 2018","31.87","31.76","31.95","31.51","1.13M","0.34%"
"Nov 21, 2018","31.14","31.60","31.70","31.06","1.56M","-2.32%"
"Nov 22, 2018","31.30","31.16","31.50","31.15","346.75K","0.54%"
"Nov 23, 2018","31.25","31.31","31.52","31.17","613.00K","-0.17%"
"Nov 26, 2018","31.65","31.45","32.33","31.37","1.23M","1.27%"
"Nov 27, 2018","33.13","31.89","33.52","31.72","2.10M","4.69%"
"Nov 28, 2018","33.47","33.09","33.55","32.57","1.23M","1.03%"
"Nov 29, 2018","33.36","33.30","33.52","32.84","987.13K","-0.34%"
"Nov 30, 2018","32.72","33.36","33.53","32.72","2.61M","-1.92%"
"Dec 03, 2018","32.94","33.17","33.29","32.75","1.65M","0.67%"
"Dec 04, 2018","33.09","32.94","33.47","32.73","1.64M","0.46%"
"Dec 05, 2018","33.52","33.35","33.53","32.99","628.75K","1.31%"
"Dec 06, 2018","33.68","33.28","33.88","33.06","1.54M","0.45%"
"Dec 07, 2018","33.87","33.61","35.20","33.36","2.83M","0.59%"
"Dec 10, 2018","33.51","34.00","34.38","33.23","1.62M","-1.08%"
"Dec 11, 2018","33.26","33.57","33.85","32.83","1.97M","-0.75%"
"Dec 12, 2018","32.63","33.57","33.70","32.63","2.21M","-1.88%"
"Dec 13, 2018","32.57","32.81","32.90","32.25","1.87M","-0.20%"
"Dec 14, 2018","32.68","32.58","32.90","32.27","1.10M","0.35%"
"Dec 17, 2018","32.23","32.68","32.97","32.22","972.40K","-1.37%"
"Dec 18, 2018","32.06","32.33","32.78","32.03","1.45M","-0.53%"
"Dec 19, 2018","31.35","32.29","32.53","31.35","1.88M","-2.22%"
"Dec 20, 2018","31.85","31.34","32.26","31.34","1.41M","1.61%"
"Dec 21, 2018","31.33","32.12","32.15","31.33","2.06M","-1.64%"
"Dec 26, 2018","31.40","31.33","31.44","31.06","710.80K","0.21%"
"Dec 27, 2018","31.74","31.56","31.86","31.38","829.60K","1.08%"
"Dec 28, 2018","31.87","31.95","32.40","31.83","1.31M","0.43%"
"Jan 02, 2019","32.95","32.19","33.25","32.12","1.30M","3.39%"
"Jan 03, 2019","34.03","33.72","34.04","32.92","1.61M","3.28%"
"Jan 04, 2019","34.29","34.03","34.67","33.68","1.71M","0.74%"
"Jan 07, 2019","34.07","34.61","34.61","33.86","1.19M","-0.62%"
"Jan 08, 2019","34.46","34.32","34.80","34.14","1.23M","1.13%"
"Jan 09, 2019","35.38","34.56","35.55","34.56","1.54M","2.66%"
"Jan 10, 2019","34.96","35.50","35.50","34.80","1.54M","-1.17%"
"Jan 11, 2019","35.54","34.96","35.62","34.96","1.26M","1.66%"
"Jan 14, 2019","36.01","35.65","36.12","35.64","2.06M","1.33%"
"Jan 15, 2019","35.87","36.17","36.17","35.74","1.05M","-0.40%"
"Jan 16, 2019","35.71","35.97","36.02","35.45","1.10M","-0.43%"
"Jan 17, 2019","36.25","35.78","36.68","35.29","1.22M","1.51%"
"Jan 18, 2019","37.15","36.15","37.53","36.10","1.13M","2.48%"
"Jan 21, 2019","37.33","37.30","37.82","36.91","498.90K","0.47%"
"Jan 22, 2019","37.59","37.33","38.07","37.19","2.12M","0.70%"
"Jan 23, 2019","39.62","37.59","39.71","37.59","2.30M","5.42%"
"Jan 24, 2019","40.54","39.62","40.56","39.52","1.66M","2.31%"
"Jan 28, 2019","42.08","40.59","42.29","40.15","2.75M","3.81%"
"Jan 29, 2019","41.12","42.34","42.55","40.75","1.68M","-2.29%"
"Jan 30, 2019","40.98","41.14","41.37","39.98","2.01M","-0.33%"
"Jan 31, 2019","40.40","41.27","41.44","40.40","1.57M","-1.44%"
"Feb 01, 2019","41.18","40.43","41.41","40.43","1.61M","1.94%"
"Feb 04, 2019","42.31","41.44","42.31","41.26","1.13M","2.74%"
"Feb 05, 2019","42.28","42.30","42.51","41.70","1.22M","-0.07%"
"Feb 06, 2019","40.35","42.07","42.07","40.35","1.75M","-4.57%"
"Feb 07, 2019","40.93","40.40","41.75","40.35","1.55M","1.44%"
"Feb 08, 2019","41.90","40.93","42.23","40.72","1.34M","2.38%"
"Feb 11, 2019","41.86","41.99","42.73","41.14","1.66M","-0.09%"
"Feb 12, 2019","42.20","42.08","43.06","42.03","1.51M","0.81%"
"Feb 13, 2019","41.52","42.47","42.71","41.26","1.85M","-1.60%"
"Feb 14, 2019","42.07","41.41","42.31","40.82","1.35M","1.32%"
"Feb 15, 2019","41.68","42.04","42.47","41.53","990.90K","-0.94%"
"Feb 18, 2019","41.16","41.51","41.82","41.16","594.90K","-1.25%"
"Feb 19, 2019","42.95","41.22","42.95","41.22","1.10M","4.36%"
"Feb 20, 2019","40.54","43.05","43.11","40.54","2.40M","-5.62%"
"Feb 21, 2019","40.50","40.69","40.95","39.50","2.13M","-0.10%"
"Feb 22, 2019","40.40","40.68","41.18","40.29","1.78M","-0.26%"
"Feb 25, 2019","40.65","40.54","40.91","40.44","791.20K","0.62%"
"Feb 26, 2019","40.04","40.65","40.65","39.84","1.19M","-1.50%"
"Feb 27, 2019","40.64","40.06","40.92","39.85","1.71M","1.49%"
"Feb 28, 2019","39.73","40.55","41.03","39.59","1.81M","-2.23%"
"Mar 01, 2019","38.96","39.73","40.18","38.73","1.88M","-1.94%"
"Mar 06, 2019","38.42","38.68","38.85","38.18","1.50M","-1.39%"
"Mar 07, 2019","38.12","38.42","38.96","38.04","1.52M","-0.78%"
"Mar 08, 2019","38.77","38.15","38.94","38.15","1.40M","1.72%"
"Mar 11, 2019","38.82","38.80","39.20","38.63","1.69M","0.12%"
"Mar 12, 2019","39.71","39.17","40.16","39.04","1.16M","2.29%"
"Mar 13, 2019","40.94","40.06","41.41","39.79","1.72M","3.09%"
"Mar 14, 2019","41.43","41.18","41.96","40.92","1.63M","1.20%"
"Mar 15, 2019","41.70","41.31","42.04","41.27","2.57M","0.65%"
"Mar 18, 2019","41.79","41.89","42.08","41.54","735.90K","0.21%"
"Mar 19, 2019","41.70","41.60","41.91","41.46","651.50K","-0.21%"
"Mar 20, 2019","41.03","41.51","41.70","40.94","1.16M","-1.60%"
"Mar 21, 2019","40.30","41.06","41.22","40.06","1.44M","-1.79%"
"Mar 22, 2019","39.46","39.57","40.02","39.00","2.00M","-2.08%"
"Mar 25, 2019","40.00","39.47","40.40","39.20","1.17M","1.37%"
"Mar 26, 2019","40.63","40.46","41.23","39.84","960.60K","1.57%"
"Mar 27, 2019","39.76","40.08","40.48","39.43","1.38M","-2.14%"
"Mar 28, 2019","41.18","39.51","41.31","39.11","1.60M","3.57%"
"Mar 29, 2019","41.23","41.14","41.99","40.95","1.48M","0.12%"
"Apr 01, 2019","41.82","41.81","42.00","40.93","881.50K","1.45%"
"Apr 02, 2019","41.02","41.99","42.26","40.90","1.32M","-1.92%"
"Apr 03, 2019","41.83","41.07","42.47","41.07","1.31M","1.98%"
"Apr 04, 2019","42.32","42.00","43.18","41.77","1.30M","1.15%"
"Apr 05, 2019","42.48","42.52","43.46","42.47","1.42M","0.39%"
"Apr 08, 2019","42.76","42.66","43.97","42.09","1.29M","0.66%"
"Apr 09, 2019","41.39","42.76","42.76","41.39","1.12M","-3.21%"
"Apr 10, 2019","41.27","41.87","42.36","41.03","1.73M","-0.28%"
"Apr 11, 2019","40.54","41.43","41.60","40.54","633.30K","-1.78%"
"Apr 12, 2019","40.55","40.43","40.94","39.92","1.18M","0.02%"
"Apr 15, 2019","40.85","40.83","41.27","40.45","929.20K","0.74%"
"Apr 16, 2019","41.34","40.75","41.69","40.75","860.50K","1.21%"
"Apr 17, 2019","40.84","41.52","41.56","40.11","1.89M","-1.21%"
"Apr 18, 2019","40.90","41.07","41.23","40.40","800.80K","0.14%"
"Apr 22, 2019","41.36","40.96","41.89","40.63","789.90K","1.13%"
"Apr 23, 2019","41.89","41.69","42.24","41.37","796.70K","1.28%"
"Apr 24, 2019","41.69","41.94","42.03","41.61","920.60K","-0.48%"
"Apr 25, 2019","42.33","42.05","42.85","41.74","1.04M","1.53%"
"Apr 26, 2019","42.74","42.37","43.10","42.28","1.29M","0.98%"
"Apr 29, 2019","43.07","42.97","43.43","42.85","1.25M","0.77%"
"Apr 30, 2019","42.94","43.32","43.33","42.34","980.80K","-0.29%"
"May 02, 2019","41.89","42.94","42.94","41.75","1.36M","-2.45%"
"May 03, 2019","41.09","42.00","42.33","41.09","2.16M","-1.91%"
"May 06, 2019","41.18","41.00","41.29","40.36","1.14M","0.21%"
"May 07, 2019","40.82","41.22","41.23","40.45","1.36M","-0.86%"
"May 08, 2019","40.77","41.14","41.64","40.77","1.00M","-0.12%"
"May 09, 2019","40.97","40.87","41.16","39.91","1.42M","0.47%"
"May 10, 2019","41.18","40.92","41.69","40.74","1.19M","0.52%"
"May 13, 2019","40.96","40.53","41.24","40.39","1.41M","-0.54%"
"May 14, 2019","40.44","41.03","41.10","40.13","1.78M","-1.28%"
"May 15, 2019","40.63","40.15","41.39","39.42","2.07M","0.48%"
"May 16, 2019","40.20","40.24","40.63","39.62","1.63M","-1.05%"
"May 17, 2019","38.94","40.20","40.25","38.82","2.21M","-3.15%"
"May 20, 2019","40.53","39.15","40.67","38.99","1.57M","4.10%"
"May 21, 2019","40.90","40.87","41.46","40.54","821.00K","0.91%"
"May 22, 2019","40.77","40.90","41.21","40.58","816.00K","-0.31%"
"May 23, 2019","40.26","40.88","40.94","40.16","950.90K","-1.26%"
"May 24, 2019","40.40","40.66","40.66","40.17","1.10M","0.34%"
"May 27, 2019","40.55","40.58","41.18","40.51","591.50K","0.38%"
"May 28, 2019","41.18","40.59","41.69","40.54","2.47M","1.55%"
"May 29, 2019","41.60","41.18","41.88","40.78","1.09M","1.01%"
"May 30, 2019","42.77","41.35","42.84","41.27","1.42M","2.81%"
"May 31, 2019","44.81","42.70","44.81","42.35","2.64M","4.77%"
"Jun 03, 2019","45.57","44.80","45.57","44.40","1.71M","1.71%"
"Jun 04, 2019","44.99","45.27","45.57","44.44","1.96M","-1.27%"
"Jun 05, 2019","45.12","44.66","45.38","44.64","1.42M","0.28%"
"Jun 06, 2019","44.58","45.15","45.22","44.19","2.02M","-1.20%"
"Jun 07, 2019","44.69","44.98","45.99","44.69","2.00M","0.26%"
"Jun 10, 2019","43.62","44.50","44.88","43.48","2.21M","-2.40%"
"Jun 11, 2019","43.48","43.92","44.16","43.35","2.26M","-0.31%"
"Jun 12, 2019","42.56","43.48","43.74","42.56","1.80M","-2.11%"
"Jun 13, 2019","42.94","42.85","43.61","42.59","2.46M","0.89%"
"Jun 14, 2019","42.19","43.08","43.65","42.19","1.77M","-1.76%"
"Jun 17, 2019","41.65","42.19","42.68","41.60","1.26M","-1.26%"
"Jun 18, 2019","42.25","42.08","42.80","41.90","1.39M","1.44%"
"Jun 19, 2019","41.95","42.24","42.46","41.59","1.75M","-0.73%"
"Jun 21, 2019","41.78","42.47","42.51","41.68","3.14M","-0.39%"
"Jun 24, 2019","41.54","41.94","42.29","41.19","2.28M","-0.58%"
"Jun 25, 2019","41.05","41.73","41.76","40.92","1.58M","-1.19%"
"Jun 26, 2019","41.10","41.50","41.62","40.24","3.23M","0.14%"
"Jun 27, 2019","41.30","40.69","41.42","40.41","2.10M","0.47%"
"Jun 28, 2019","42.05","41.45","42.35","41.35","2.51M","1.83%"
"Jul 01, 2019","42.08","42.52","42.56","42.08","594.00K","0.07%"
"Jul 02, 2019","42.28","42.37","42.54","41.66","1.18M","0.48%"
"Jul 03, 2019","42.62","41.90","43.34","41.71","1.84M","0.80%"
"Jul 04, 2019","42.89","43.22","43.58","42.86","989.10K","0.64%"
"Jul 05, 2019","43.10","42.91","43.36","42.63","744.10K","0.47%"
"Jul 08, 2019","43.70","43.29","43.72","42.92","599.30K","1.39%"
"Jul 10, 2019","44.65","43.82","44.89","43.82","1.58M","2.19%"
"Jul 11, 2019","44.53","44.87","45.03","44.20","995.30K","-0.28%"
"Jul 12, 2019","44.98","44.58","45.64","44.58","1.83M","1.02%"
"Jul 15, 2019","44.49","45.09","45.38","44.34","919.60K","-1.10%"
"Jul 16, 2019","44.89","44.50","44.97","44.50","899.90K","0.89%"
"Jul 17, 2019","45.18","44.98","45.47","44.73","1.11M","0.65%"
"Jul 18, 2019","45.21","45.29","45.47","45.02","775.50K","0.09%"
"Jul 19, 2019","45.37","45.32","45.49","44.73","1.12M","0.34%"
"Jul 22, 2019","45.51","45.30","45.85","44.92","1.04M","0.32%"
"Jul 23, 2019","45.08","45.80","45.80","44.93","1.05M","-0.96%"
"Jul 24, 2019","45.42","45.36","45.87","45.21","1.32M","0.75%"
"Jul 25, 2019","45.21","45.53","45.82","45.04","984.90K","-0.47%"
"Jul 26, 2019","46.25","45.42","46.83","45.42","1.56M","2.31%"
"Jul 29, 2019","46.95","46.27","47.30","45.68","1.57M","1.51%"
"Jul 30, 2019","47.26","46.99","47.88","46.89","1.07M","0.66%"
"Jul 31, 2019","46.69","47.11","47.41","46.45","1.22M","-1.19%"
"Aug 01, 2019","46.53","47.28","47.83","46.53","1.01M","-0.35%"
"Aug 02, 2019","46.75","46.53","47.03","46.10","1.29M","0.48%"
"Aug 05, 2019","45.85","46.19","46.36","45.53","1.37M","-1.92%"
"Aug 06, 2019","46.92","46.43","47.05","45.98","1.01M","2.32%"
"Aug 07, 2019","45.85","46.11","46.17","44.73","1.94M","-2.27%"
"Aug 08, 2019","45.95","46.27","46.81","45.63","1.51M","0.21%"
"Aug 09, 2019","46.30","45.95","46.69","45.76","1.60M","0.76%"
"Aug 12, 2019","45.66","45.63","45.98","45.07","1.05M","-1.38%"
"Aug 13, 2019","46.34","45.21","46.52","45.12","1.43M","1.48%"
"Aug 14, 2019","44.66","45.94","46.06","44.46","1.82M","-3.61%"
"Aug 15, 2019","43.87","44.68","45.15","43.30","1.64M","-1.78%"
"Aug 16, 2019","43.68","43.98","44.52","43.65","1.24M","-0.44%"
"Aug 19, 2019","43.68","44.07","44.53","43.34","806.40K","0.00%"
"Aug 20, 2019","42.86","43.68","43.81","42.84","1.26M","-1.86%"
"Aug 21, 2019","43.12","43.28","43.28","42.47","1.16M","0.59%"
"Aug 22, 2019","42.57","43.49","43.49","42.57","563.20K","-1.26%"
"Aug 23, 2019","42.30","42.56","42.95","41.79","1.18M","-0.64%"
"Aug 26, 2019","41.63","42.65","42.66","41.18","1.25M","-1.60%"
"Aug 27, 2019","41.57","41.80","41.80","40.99","2.31M","-0.14%"
"Aug 28, 2019","42.03","41.47","42.20","41.01","1.69M","1.12%"
"Aug 29, 2019","42.58","42.44","42.68","41.92","1.59M","1.31%"
"Aug 30, 2019","43.51","42.70","44.22","42.49","1.85M","2.18%"
"Sep 02, 2019","42.81","43.82","43.90","42.81","675.60K","-1.62%"
"Sep 03, 2019","42.51","43.00","43.19","41.89","1.03M","-0.70%"
"Sep 04, 2019","42.78","42.67","42.86","41.98","1.04M","0.64%"
"Sep 05, 2019","43.23","42.87","43.49","42.87","1.39M","1.06%"
"Sep 06, 2019","42.56","43.56","43.86","42.49","1.25M","-1.54%"
"Sep 09, 2019","42.32","42.60","43.30","42.24","1.45M","-0.57%"
"Sep 10, 2019","42.19","42.30","42.71","42.11","821.00K","-0.32%"
"Sep 11, 2019","42.92","42.56","43.05","42.24","757.70K","1.74%"
"Sep 12, 2019","43.21","43.38","43.53","43.08","921.90K","0.68%"
"Sep 13, 2019","42.58","43.22","43.47","42.58","726.60K","-1.46%"
"Sep 16, 2019","42.97","42.73","43.24","42.43","837.60K","0.91%"
"Sep 17, 2019","42.47","42.97","43.22","42.42","1.78M","-1.17%"
"Sep 18, 2019","42.54","42.49","42.75","42.29","786.20K","0.16%"
"Sep 19, 2019","43.70","42.66","44.00","42.57","1.41M","2.73%"
"Sep 20, 2019","43.43","44.01","44.35","43.00","1.59M","-0.62%"
"Sep 23, 2019","43.20","43.43","43.55","42.88","673.60K","-0.51%"
"Sep 24, 2019","43.25","43.20","43.46","42.95","729.40K","0.11%"
"Sep 25, 2019","42.57","43.05","43.10","42.28","1.31M","-1.57%"
"Sep 26, 2019","42.47","42.47","42.74","42.29","631.00K","-0.25%"
"Sep 27, 2019","42.52","42.56","42.61","42.25","554.60K","0.11%"
"Sep 30, 2019","42.94","42.56","43.13","42.48","1.05M","1.00%"
"Oct 01, 2019","42.99","43.06","43.06","42.10","1.60M","0.11%"
"Oct 02, 2019","42.19","42.71","42.81","42.19","1.39M","-1.87%"
"Oct 03, 2019","42.54","42.32","42.54","41.84","872.20K","0.83%"
"Oct 04, 2019","42.57","42.53","42.78","42.13","714.60K","0.09%"
"Oct 07, 2019","41.53","42.47","42.66","41.41","1.22M","-2.45%"
"Oct 08, 2019","41.28","41.65","41.90","41.04","1.04M","-0.61%"
"Oct 09, 2019","41.09","41.49","41.63","40.87","1.14M","-0.45%"
"Oct 10, 2019","40.82","41.21","41.35","40.79","1.38M","-0.66%"
"Oct 11, 2019","41.70","41.28","41.82","40.93","858.40K","2.16%"
"Oct 14, 2019","42.39","41.85","42.39","41.24","1.14M","1.65%"
"Oct 15, 2019","41.81","42.44","42.68","41.54","1.55M","-1.37%"
"Oct 16, 2019","41.90","42.26","42.26","41.06","1.29M","0.21%"
"Oct 17, 2019","42.15","41.95","42.16","41.62","730.70K","0.60%"
"Oct 18, 2019","42.33","42.25","42.45","41.81","1.69M","0.44%"
"Oct 21, 2019","42.70","42.06","42.73","41.82","836.80K","0.87%"
"Oct 22, 2019","42.52","42.53","43.03","42.31","1.39M","-0.43%"
"Oct 23, 2019","42.31","42.51","42.69","42.08","1.49M","-0.48%"
"Oct 24, 2019","42.38","42.37","42.58","42.05","1.16M","0.16%"
"Oct 25, 2019","42.11","42.45","42.68","42.09","895.50K","-0.64%"
"Oct 28, 2019","42.78","42.27","42.93","42.09","865.30K","1.59%"
"Oct 29, 2019","43.23","42.89","43.28","42.63","904.70K","1.06%"
"Oct 30, 2019","43.83","43.32","43.85","42.76","861.60K","1.39%"
"Oct 31, 2019","43.78","43.81","43.99","43.25","1.33M","-0.11%"
"Nov 01, 2019","44.48","44.03","44.75","43.94","1.88M","1.59%"
"Nov 04, 2019","44.51","44.55","44.94","44.51","963.80K","0.07%"
"Nov 05, 2019","44.47","44.60","44.71","43.99","1.12M","-0.09%"
"Nov 06, 2019","44.52","45.44","45.70","44.37","1.55M","0.11%"
"Nov 07, 2019","44.74","44.58","44.91","44.36","1.53M","0.50%"
"Nov 08, 2019","43.73","44.45","44.47","43.55","1.47M","-2.27%"
"Nov 11, 2019","43.60","43.60","43.71","43.16","1.49M","-0.29%"
"Nov 12, 2019","43.12","43.72","43.79","42.77","1.41M","-1.11%"
"Nov 13, 2019","42.98","42.95","43.29","42.58","1.47M","-0.31%"
"Nov 14, 2019","42.87","43.06","43.14","42.67","812.90K","-0.25%"
"Nov 18, 2019","43.29","43.27","43.61","43.17","1.00M","0.97%"
"Nov 19, 2019","43.24","43.54","43.76","42.77","1.17M","-0.11%"
"Nov 21, 2019","43.26","43.34","43.57","42.74","1.32M","0.04%"
"Nov 22, 2019","43.88","43.38","43.96","43.24","944.70K","1.43%"
"Nov 25, 2019","43.87","43.89","43.92","43.45","1.18M","-0.02%"
"Nov 26, 2019","43.38","43.73","43.81","43.23","1.82M","-1.12%"
"Nov 27, 2019","43.98","43.60","44.23","43.53","2.62M","1.38%"
"Nov 28, 2019","44.85","44.02","45.07","44.01","951.50K","1.98%"
"Nov 29, 2019","45.24","45.08","45.95","45.06","2.07M","0.88%"
"Dec 02, 2019","45.32","45.51","45.91","44.94","1.76M","0.17%"
"Dec 03, 2019","45.98","45.21","45.98","45.18","1.52M","1.45%"
"Dec 04, 2019","46.93","46.65","47.03","46.50","2.10M","2.07%"
"Dec 05, 2019","47.64","46.81","47.70","46.52","1.04M","1.51%"
"Dec 06, 2019","47.65","47.34","47.83","47.34","594.90K","0.02%"
"Dec 09, 2019","47.50","47.80","47.80","47.07","760.60K","-0.31%"
"Dec 10, 2019","47.27","47.32","47.47","46.89","655.00K","-0.48%"
"Dec 11, 2019","47.75","47.27","47.75","47.07","946.50K","1.02%"
"Dec 12, 2019","47.83","47.75","47.90","47.38","993.90K","0.17%"
"Dec 13, 2019","47.99","47.83","47.99","47.41","1.08M","0.33%"
"Dec 16, 2019","47.51","47.99","47.99","47.48","1.26M","-1.00%"
"Dec 17, 2019","47.30","47.77","47.95","47.07","1.18M","-0.44%"
"Dec 18, 2019","49.68","47.16","50.47","46.93","3.53M","5.03%"
"Dec 19, 2019","48.75","49.80","50.02","48.40","2.29M","-1.87%"
"Dec 20, 2019","48.52","48.99","49.12","48.52","1.76M","-0.47%"
"Dec 23, 2019","49.85","48.51","49.85","48.51","868.60K","2.74%"
"Dec 26, 2019","51.12","50.00","51.47","49.74","1.47M","2.55%"
"Dec 27, 2019","50.81","51.49","51.72","50.61","1.00M","-0.61%"
"Dec 30, 2019","50.80","50.82","51.30","50.62","783.00K","-0.02%"
"Jan 02, 2020","52.00","51.00","52.33","50.82","1.14M","2.36%"
"Jan 03, 2020","52.30","51.37","52.92","51.11","1.36M","0.58%"
"Jan 06, 2020","51.86","52.39","52.63","51.50","1.27M","-0.84%"
"Jan 07, 2020","51.97","51.50","52.22","50.61","1.46M","0.21%"
"Jan 08, 2020","51.45","52.10","52.24","51.18","891.40K","-1.00%"
"Jan 09, 2020","51.60","51.45","51.96","51.15","635.10K","0.29%"
"Jan 10, 2020","52.37","52.00","52.73","51.64","822.10K","1.49%"
"Jan 13, 2020","53.36","52.39","53.69","52.39","1.19M","1.89%"
"Jan 14, 2020","54.10","53.57","54.10","53.04","1.23M","1.39%"
"Jan 15, 2020","53.45","54.10","54.10","53.32","1.67M","-1.20%"
"Jan 16, 2020","53.09","53.50","53.65","52.71","1.27M","-0.67%"
"Jan 17, 2020","53.43","53.12","53.43","52.73","1.57M","0.64%"
"Jan 20, 2020","53.40","53.43","53.93","53.25","783.80K","-0.06%"
"Jan 21, 2020","53.60","53.10","54.23","52.96","1.47M","0.37%"
"Jan 22, 2020","53.61","53.81","54.33","52.85","1.27M","0.02%"
"Jan 23, 2020","53.60","53.61","53.63","52.79","966.40K","-0.02%"
"Jan 24, 2020","53.87","53.81","54.04","53.25","675.70K","0.50%"
"Jan 27, 2020","52.82","53.50","53.62","52.43","829.00K","-1.95%"
"Jan 28, 2020","53.49","53.03","53.60","52.54","737.90K","1.27%"
"Jan 29, 2020","53.02","53.70","53.82","52.90","845.80K","-0.88%"
"Jan 30, 2020","52.50","52.82","53.00","51.36","1.00M","-0.98%"
"Jan 31, 2020","52.05","52.48","52.48","51.31","1.74M","-0.86%"
"Feb 03, 2020","52.60","52.13","52.99","51.76","1.15M","1.06%"
"Feb 04, 2020","52.85","53.36","53.51","52.50","814.70K","0.48%"
"Feb 05, 2020","52.80","53.50","53.65","52.61","1.23M","-0.09%"
"Feb 06, 2020","51.81","53.01","53.65","51.35","1.11M","-1.87%"
"Feb 07, 2020","50.32","51.81","51.82","49.65","4.29M","-2.88%"
"Feb 10, 2020","49.93","50.13","50.68","49.70","1.57M","-0.78%"
"Feb 11, 2020","50.87","50.13","50.87","50.00","2.61M","1.88%"
"Feb 12, 2020","50.80","51.07","52.14","50.50","3.73M","-0.14%"
"Feb 13, 2020","50.35","50.60","50.87","50.10","797.90K","-0.89%"
"Feb 14, 2020","50.20","50.35","50.54","49.81","944.70K","-0.30%"
"Feb 17, 2020","50.60","50.40","50.87","50.00","841.60K","0.80%"
"Feb 18, 2020","50.85","50.61","50.91","49.99","1.55M","0.49%"
"Feb 19, 2020","50.89","50.74","51.49","50.39","1.41M","0.08%"
"Feb 20, 2020","49.37","50.54","50.63","49.24","2.14M","-2.99%"
"Feb 21, 2020","50.14","49.09","50.14","48.60","1.68M","1.56%"
"Feb 26, 2020","47.99","48.16","48.89","47.39","1.82M","-4.29%"
"Feb 27, 2020","46.40","47.58","47.76","46.27","2.17M","-3.31%"
"Feb 28, 2020","47.53","46.28","47.65","44.98","3.91M","2.44%"
"Mar 02, 2020","48.50","47.93","48.72","47.04","3.11M","2.04%"
"Mar 03, 2020","48.53","48.50","50.00","47.77","1.85M","0.06%"
"Mar 04, 2020","50.80","49.70","50.88","48.90","2.07M","4.68%"
"Mar 05, 2020","48.80","50.40","50.44","47.56","1.93M","-3.94%"
"Mar 06, 2020","48.00","47.00","48.51","46.23","2.68M","-1.64%"
"Mar 09, 2020","44.77","46.50","46.50","44.37","3.53M","-6.73%"
"Mar 10, 2020","47.00","45.50","48.14","45.00","3.19M","4.98%"
"Mar 11, 2020","45.27","46.00","47.17","42.99","3.06M","-3.68%"
"Mar 12, 2020","43.84","40.50","44.48","40.50","2.52M","-3.16%"
"Mar 13, 2020","48.19","46.00","48.19","43.02","3.13M","9.92%"
"Mar 16, 2020","43.55","43.00","47.10","42.79","2.89M","-9.63%"
"Mar 17, 2020","46.82","44.10","48.50","43.58","3.47M","7.51%"
"Mar 18, 2020","43.89","44.35","46.55","42.21","4.84M","-6.26%"
"Mar 19, 2020","41.68","42.98","44.97","41.23","2.60M","-5.04%"
"Mar 20, 2020","40.15","43.57","43.85","39.00","4.27M","-3.67%"
"Mar 23, 2020","37.98","40.25","40.65","36.83","2.41M","-5.40%"
"Mar 24, 2020","37.77","40.80","40.80","37.77","1.93M","-0.55%"
"Mar 25, 2020","38.23","38.00","38.69","37.27","3.54M","1.22%"
"Mar 26, 2020","41.25","38.19","41.53","38.09","2.68M","7.90%"
"Mar 27, 2020","39.09","39.50","41.17","39.03","1.74M","-5.24%"
"Mar 30, 2020","39.80","39.00","39.93","38.27","1.50M","1.82%"
"Mar 31, 2020","38.92","39.46","40.43","38.60","1.91M","-2.21%"
"Apr 01, 2020","38.20","37.90","38.42","36.95","3.20M","-1.85%"
"Apr 02, 2020","38.11","38.21","38.77","37.56","1.30M","-0.24%"
"Apr 03, 2020","37.56","38.26","38.70","37.34","1.74M","-1.44%"
"Apr 06, 2020","38.85","38.80","39.30","38.20","1.46M","3.43%"
"Apr 07, 2020","38.44","40.28","41.00","38.44","2.44M","-1.06%"
"Apr 08, 2020","38.96","38.44","39.15","38.00","1.58M","1.35%"
"Apr 09, 2020","39.27","39.32","40.22","38.72","1.73M","0.80%"
"Apr 13, 2020","39.99","39.27","39.99","38.16","1.40M","1.83%"
"Apr 14, 2020","41.00","40.50","41.44","40.20","1.59M","2.53%"
"Apr 15, 2020","40.34","40.55","41.68","40.08","1.59M","-1.61%"
"Apr 16, 2020","40.50","40.58","41.07","39.50","1.48M","0.40%"
"Apr 17, 2020","40.05","41.25","41.32","39.55","1.03M","-1.11%"