﻿"Date","Price","Open","High","Low","Vol.","Change %"
"Apr 20, 2015","13.68","13.90","13.90","13.52","1.70M","-1.58%"
"Apr 22, 2015","13.79","13.73","13.94","13.63","1.91M","0.80%"
"Apr 23, 2015","14.24","13.75","14.24","13.74","2.41M","3.26%"
"Apr 24, 2015","14.24","14.31","14.42","14.16","3.00M","0.00%"
"Apr 27, 2015","14.09","14.14","14.39","13.92","1.86M","-1.05%"
"Apr 28, 2015","14.07","14.22","14.22","13.76","2.61M","-0.14%"
"Apr 29, 2015","13.78","13.92","13.94","13.62","2.22M","-2.06%"
"Apr 30, 2015","13.77","13.71","14.00","13.59","3.35M","-0.07%"
"May 04, 2015","14.25","13.87","14.51","13.85","3.57M","3.49%"
"May 05, 2015","14.34","14.16","14.42","14.05","4.25M","0.63%"
"May 06, 2015","14.35","14.27","14.59","14.16","3.13M","0.07%"
"May 07, 2015","14.38","14.40","14.42","14.08","2.31M","0.21%"
"May 08, 2015","14.33","14.52","14.52","14.16","3.09M","-0.35%"
"May 11, 2015","14.23","14.37","14.46","14.05","2.18M","-0.70%"
"May 12, 2015","14.42","14.08","14.42","14.07","4.80M","1.34%"
"May 13, 2015","14.61","14.40","14.61","14.38","3.72M","1.32%"
"May 14, 2015","14.58","14.65","14.81","14.32","3.34M","-0.21%"
"May 15, 2015","14.87","14.60","14.87","14.49","2.85M","1.99%"
"May 18, 2015","14.63","14.92","15.02","14.40","2.92M","-1.61%"
"May 19, 2015","14.51","14.60","14.60","14.36","2.06M","-0.82%"
"May 20, 2015","14.46","14.41","14.70","14.40","3.00M","-0.34%"
"May 21, 2015","14.60","14.42","14.60","14.40","2.11M","0.97%"
"May 22, 2015","14.21","14.68","14.76","14.05","4.22M","-2.67%"
"May 25, 2015","14.37","14.09","14.37","13.81","1.45M","1.13%"
"May 26, 2015","13.90","14.21","14.22","13.77","3.63M","-3.27%"
"May 27, 2015","13.86","13.82","13.87","13.59","2.95M","-0.29%"
"May 28, 2015","13.55","13.83","13.83","13.50","2.68M","-2.24%"
"May 29, 2015","13.28","13.45","13.57","13.23","3.70M","-1.99%"
"Jun 01, 2015","13.51","13.23","13.51","13.14","1.37M","1.73%"
"Jun 02, 2015","13.76","13.56","13.80","13.36","2.27M","1.85%"
"Jun 03, 2015","13.82","13.81","13.93","13.50","3.18M","0.44%"
"Jun 05, 2015","13.44","13.62","13.71","13.36","1.99M","-2.75%"
"Jun 08, 2015","13.69","13.45","13.78","13.37","2.32M","1.86%"
"Jun 09, 2015","13.45","13.61","13.64","13.36","2.31M","-1.75%"
"Jun 10, 2015","13.77","13.59","13.78","13.48","2.57M","2.38%"
"Jun 11, 2015","13.87","13.78","13.89","13.61","3.73M","0.73%"
"Jun 12, 2015","13.75","13.73","13.86","13.67","2.64M","-0.87%"
"Jun 15, 2015","13.96","13.64","13.96","13.59","2.08M","1.53%"
"Jun 16, 2015","13.97","14.04","14.08","13.94","2.38M","0.07%"
"Jun 17, 2015","13.83","13.93","13.96","13.68","2.46M","-1.00%"
"Jun 18, 2015","14.17","13.90","14.17","13.80","2.48M","2.46%"
"Jun 19, 2015","14.11","14.08","14.11","13.69","2.32M","-0.42%"
"Jun 22, 2015","14.08","14.19","14.19","14.00","2.73M","-0.21%"
"Jun 23, 2015","14.20","14.13","14.33","14.09","2.48M","0.85%"
"Jun 24, 2015","13.91","14.20","14.28","13.81","4.25M","-2.04%"
"Jun 25, 2015","13.81","13.91","13.91","13.55","2.49M","-0.72%"
"Jun 26, 2015","14.04","13.79","14.14","13.71","1.74M","1.67%"
"Jun 29, 2015","13.85","13.89","13.90","13.63","1.55M","-1.35%"
"Jun 30, 2015","14.23","13.82","14.39","13.67","3.68M","2.74%"
"Jul 01, 2015","14.60","14.28","14.66","14.23","3.22M","2.60%"
"Jul 02, 2015","14.65","14.69","14.73","14.49","2.11M","0.34%"
"Jul 03, 2015","14.65","14.53","14.68","14.46","848.52K","0.00%"
"Jul 06, 2015","14.61","14.46","14.74","14.39","1.28M","-0.27%"
"Jul 07, 2015","14.60","14.51","14.65","14.37","2.32M","-0.07%"
"Jul 08, 2015","14.53","14.52","14.69","14.42","1.82M","-0.48%"
"Jul 10, 2015","14.90","14.74","14.90","14.49","1.76M","2.55%"
"Jul 13, 2015","14.67","14.93","15.10","14.67","2.57M","-1.54%"
"Jul 14, 2015","14.85","14.64","14.89","14.52","2.44M","1.23%"
"Jul 15, 2015","14.93","14.78","14.93","14.73","2.01M","0.54%"
"Jul 16, 2015","14.88","15.00","15.03","14.69","1.61M","-0.33%"
"Jul 17, 2015","14.65","14.88","15.11","14.64","2.23M","-1.55%"
"Jul 20, 2015","14.96","14.52","14.96","14.46","2.00M","2.12%"
"Jul 21, 2015","14.98","15.05","15.24","14.90","2.18M","0.13%"
"Jul 22, 2015","14.77","14.86","14.99","14.72","1.86M","-1.40%"
"Jul 23, 2015","14.18","14.61","14.70","14.10","2.71M","-3.99%"
"Jul 24, 2015","14.28","14.10","14.30","13.91","1.54M","0.71%"
"Jul 27, 2015","14.05","14.16","14.35","13.96","1.93M","-1.61%"
"Jul 28, 2015","14.09","14.19","14.25","13.91","1.49M","0.28%"
"Jul 29, 2015","13.96","14.00","14.33","13.93","2.60M","-0.92%"
"Jul 30, 2015","13.99","13.92","14.13","13.81","2.08M","0.21%"
"Jul 31, 2015","14.15","14.06","14.23","13.93","2.23M","1.14%"
"Aug 03, 2015","13.74","14.01","14.14","13.71","2.28M","-2.90%"
"Aug 04, 2015","13.41","13.78","13.92","13.41","3.18M","-2.40%"
"Aug 05, 2015","13.80","13.51","13.83","13.46","1.39M","2.91%"
"Aug 06, 2015","13.13","13.63","13.64","13.13","2.68M","-4.86%"
"Aug 07, 2015","12.89","13.05","13.20","12.89","2.87M","-1.83%"
"Aug 10, 2015","13.13","12.89","13.22","12.88","3.03M","1.86%"
"Aug 11, 2015","13.08","13.13","13.15","12.89","2.84M","-0.38%"
"Aug 12, 2015","12.53","12.89","12.96","12.44","4.20M","-4.20%"
"Aug 13, 2015","12.31","12.53","12.60","12.27","3.38M","-1.76%"
"Aug 14, 2015","12.85","12.93","13.15","12.44","4.05M","4.39%"
"Aug 17, 2015","12.89","12.72","12.97","12.60","2.12M","0.31%"
"Aug 18, 2015","12.97","12.81","13.11","12.72","2.09M","0.62%"
"Aug 19, 2015","12.76","12.81","12.92","12.53","4.07M","-1.62%"
"Aug 20, 2015","13.09","12.60","13.09","12.45","3.13M","2.59%"
"Aug 21, 2015","12.69","12.89","13.00","12.54","2.55M","-3.06%"
"Aug 24, 2015","12.23","12.03","12.54","11.69","3.61M","-3.62%"
"Aug 25, 2015","12.48","12.49","12.63","12.36","3.02M","2.04%"
"Aug 26, 2015","13.43","12.63","13.47","12.52","3.50M","7.61%"
"Aug 27, 2015","13.80","13.49","13.80","13.16","3.28M","2.76%"
"Aug 28, 2015","13.52","13.71","13.71","13.26","2.88M","-2.03%"
"Aug 31, 2015","13.38","13.32","13.64","13.01","4.05M","-1.04%"
"Sep 01, 2015","12.86","13.01","13.28","12.82","2.95M","-3.89%"
"Sep 02, 2015","12.77","12.85","13.03","12.60","3.47M","-0.70%"
"Sep 03, 2015","13.05","12.84","13.11","12.60","2.47M","2.19%"
"Sep 04, 2015","12.68","12.79","12.97","12.62","4.12M","-2.84%"
"Sep 08, 2015","12.36","12.97","13.07","12.36","3.58M","-2.52%"
"Sep 09, 2015","12.51","12.55","12.62","12.18","3.17M","1.21%"
"Sep 10, 2015","12.76","12.13","12.94","12.12","3.28M","2.00%"
"Sep 11, 2015","12.75","12.69","13.14","12.50","3.31M","-0.08%"
"Sep 14, 2015","13.42","12.75","13.42","12.66","2.10M","5.25%"
"Sep 15, 2015","13.67","13.42","13.88","13.13","2.77M","1.86%"
"Sep 16, 2015","13.99","13.75","13.99","13.66","2.49M","2.34%"
"Sep 17, 2015","14.01","13.79","14.28","13.73","3.20M","0.14%"
"Sep 18, 2015","13.90","13.89","14.07","13.66","3.03M","-0.79%"
"Sep 21, 2015","13.49","13.77","13.91","13.48","1.78M","-2.95%"
"Sep 22, 2015","13.25","13.25","13.41","13.05","2.95M","-1.78%"
"Sep 23, 2015","12.82","13.22","13.27","12.71","3.42M","-3.25%"
"Sep 24, 2015","12.97","12.40","13.07","12.39","3.71M","1.17%"
"Sep 25, 2015","13.32","13.17","13.35","12.95","3.66M","2.70%"
"Sep 28, 2015","13.01","13.25","13.26","12.89","2.21M","-2.33%"
"Sep 29, 2015","13.05","13.01","13.10","12.85","2.19M","0.31%"
"Sep 30, 2015","13.34","13.17","13.40","13.08","3.84M","2.22%"
"Oct 01, 2015","13.68","13.43","13.91","13.14","3.41M","2.55%"
"Oct 02, 2015","14.42","13.68","14.46","13.58","3.24M","5.41%"
"Oct 05, 2015","14.64","14.64","14.79","14.46","2.54M","1.53%"
"Oct 06, 2015","14.70","14.49","14.82","14.46","6.92M","0.41%"
"Oct 07, 2015","14.83","14.95","15.07","14.61","2.59M","0.88%"
"Oct 08, 2015","15.16","14.94","15.23","14.79","2.41M","2.23%"
"Oct 09, 2015","14.74","15.35","15.44","14.67","6.02M","-2.77%"
"Oct 13, 2015","14.64","14.61","14.68","14.32","2.86M","-0.68%"
"Oct 14, 2015","14.62","14.46","14.98","14.45","6.65M","-0.14%"
"Oct 15, 2015","14.48","14.58","14.90","14.28","3.85M","-0.96%"
"Oct 16, 2015","14.35","14.48","14.62","14.06","2.74M","-0.90%"
"Oct 19, 2015","14.37","14.33","14.50","14.16","1.70M","0.14%"
"Oct 20, 2015","14.41","14.37","14.46","13.99","2.77M","0.28%"
"Oct 21, 2015","14.15","14.32","14.32","14.07","2.00M","-1.80%"
"Oct 22, 2015","14.45","14.23","14.61","14.18","2.51M","2.12%"
"Oct 23, 2015","14.74","14.57","14.87","14.57","2.80M","2.01%"
"Oct 26, 2015","14.82","14.67","14.85","14.56","2.61M","0.54%"
"Oct 27, 2015","14.78","14.81","14.84","14.65","2.34M","-0.27%"
"Oct 28, 2015","14.74","14.72","14.79","14.50","3.16M","-0.27%"
"Oct 29, 2015","13.88","14.55","14.65","13.88","2.92M","-5.83%"
"Oct 30, 2015","13.76","13.87","14.04","13.49","4.42M","-0.86%"
"Nov 03, 2015","14.76","13.77","14.77","13.72","5.04M","7.27%"
"Nov 04, 2015","14.60","14.91","15.12","14.39","3.51M","-1.08%"
"Nov 05, 2015","14.92","14.60","14.92","14.54","1.85M","2.19%"
"Nov 06, 2015","14.27","14.91","14.95","14.15","2.20M","-4.36%"
"Nov 09, 2015","14.25","14.24","14.58","14.12","1.78M","-0.14%"
"Nov 10, 2015","14.14","14.09","14.23","13.78","2.00M","-0.77%"
"Nov 11, 2015","14.86","14.30","15.18","14.14","2.66M","5.09%"
"Nov 12, 2015","14.83","14.89","15.06","14.66","2.74M","-0.20%"
"Nov 13, 2015","15.10","14.82","15.10","14.60","2.91M","1.82%"
"Nov 16, 2015","15.08","15.02","15.13","14.84","2.46M","-0.13%"
"Nov 17, 2015","15.08","15.23","15.29","15.00","2.52M","0.00%"
"Nov 18, 2015","15.15","14.99","15.40","14.95","2.37M","0.46%"
"Nov 19, 2015","15.32","15.29","15.43","15.08","3.46M","1.12%"
"Nov 23, 2015","15.64","15.40","15.68","15.33","3.98M","2.09%"
"Nov 24, 2015","15.44","15.54","15.80","15.33","2.32M","-1.28%"
"Nov 25, 2015","15.35","15.31","15.61","15.12","3.65M","-0.58%"
"Nov 26, 2015","15.46","15.43","15.51","15.28","1.69M","0.72%"
"Nov 27, 2015","14.98","15.34","15.45","14.79","1.79M","-3.10%"
"Nov 30, 2015","14.19","14.82","14.93","14.19","4.82M","-5.27%"
"Dec 01, 2015","14.37","14.40","14.50","14.04","2.98M","1.27%"
"Dec 02, 2015","14.65","14.28","15.07","14.16","2.96M","1.95%"
"Dec 03, 2015","15.36","15.17","15.52","14.97","2.05M","4.85%"
"Dec 04, 2015","15.23","15.15","15.62","14.98","2.02M","-0.85%"
"Dec 07, 2015","15.31","15.35","15.60","15.10","2.53M","0.53%"
"Dec 08, 2015","15.06","15.39","15.39","14.92","2.20M","-1.63%"
"Dec 09, 2015","15.59","15.24","15.80","15.16","3.56M","3.52%"
"Dec 10, 2015","15.64","15.62","15.81","15.40","3.39M","0.32%"
"Dec 11, 2015","15.52","15.47","15.81","15.47","3.37M","-0.77%"
"Dec 14, 2015","15.31","15.49","15.52","15.23","2.19M","-1.35%"
"Dec 15, 2015","15.34","15.31","15.56","15.24","2.14M","0.20%"
"Dec 16, 2015","15.27","15.18","15.35","14.97","1.82M","-0.46%"
"Dec 17, 2015","15.20","15.48","15.68","15.12","2.40M","-0.46%"
"Dec 18, 2015","14.64","14.98","15.00","14.61","2.94M","-3.68%"
"Dec 21, 2015","14.69","14.70","14.93","14.42","2.84M","0.34%"
"Dec 22, 2015","14.58","14.76","15.01","14.35","1.56M","-0.75%"
"Dec 23, 2015","14.79","14.76","14.88","14.54","1.93M","1.44%"
"Dec 28, 2015","15.64","14.83","15.64","14.79","1.95M","5.75%"
"Dec 29, 2015","16.35","15.75","16.35","15.64","2.12M","4.54%"
"Dec 30, 2015","15.97","16.35","16.99","15.83","4.99M","-2.32%"
"Jan 04, 2016","15.45","15.64","15.84","15.13","1.79M","-3.26%"
"Jan 05, 2016","15.56","15.49","15.86","15.29","1.93M","0.71%"
"Jan 06, 2016","15.42","15.34","15.64","15.28","1.36M","-0.90%"
"Jan 07, 2016","15.04","15.39","15.42","14.93","2.18M","-2.46%"
"Jan 08, 2016","15.14","15.04","15.44","15.03","2.25M","0.66%"
"Jan 11, 2016","15.23","15.15","15.54","14.95","2.18M","0.59%"
"Jan 12, 2016","14.93","15.38","15.46","14.93","1.78M","-1.97%"
"Jan 13, 2016","14.93","15.09","15.19","14.90","3.74M","0.00%"
"Jan 14, 2016","15.18","15.08","15.37","15.04","2.58M","1.67%"
"Jan 15, 2016","14.90","15.09","15.11","14.78","3.01M","-1.84%"
"Jan 18, 2016","15.34","14.94","15.47","14.86","1.21M","2.95%"
"Jan 19, 2016","15.17","15.48","15.62","15.04","2.45M","-1.11%"
"Jan 20, 2016","14.60","15.09","15.09","14.55","2.32M","-3.76%"
"Jan 21, 2016","14.55","14.50","14.64","14.24","2.22M","-0.34%"
"Jan 22, 2016","14.62","14.68","14.85","14.53","2.93M","0.48%"
"Jan 26, 2016","14.27","14.34","14.55","14.16","2.34M","-2.39%"
"Jan 27, 2016","14.69","14.18","14.97","14.18","3.57M","2.94%"
"Jan 28, 2016","14.94","14.60","14.94","14.24","1.78M","1.70%"
"Jan 29, 2016","15.37","15.09","15.57","14.99","3.50M","2.88%"
"Feb 01, 2016","15.17","15.19","15.34","15.01","2.64M","-1.30%"
"Feb 02, 2016","14.27","15.02","15.04","14.27","2.34M","-5.93%"
"Feb 03, 2016","14.35","14.48","14.59","14.05","2.91M","0.56%"
"Feb 04, 2016","14.55","14.57","14.86","14.45","2.92M","1.39%"
"Feb 05, 2016","14.12","14.60","14.74","14.02","3.01M","-2.96%"
"Feb 10, 2016","14.52","14.01","14.52","13.84","1.09M","2.83%"
"Feb 11, 2016","14.18","14.36","14.45","13.79","1.88M","-2.34%"
"Feb 12, 2016","14.34","14.20","14.55","14.06","1.76M","1.13%"
"Feb 15, 2016","14.57","14.63","14.79","14.47","1.58M","1.60%"
"Feb 16, 2016","14.86","14.53","14.97","14.52","2.09M","1.99%"
"Feb 17, 2016","15.18","14.97","15.38","14.77","2.63M","2.15%"
"Feb 18, 2016","15.42","15.09","15.42","14.86","1.88M","1.58%"
"Feb 19, 2016","15.59","15.19","15.75","15.15","1.44M","1.10%"
"Feb 22, 2016","16.21","16.04","16.21","15.73","2.62M","3.98%"
"Feb 23, 2016","15.96","16.17","16.46","15.95","1.18M","-1.54%"
"Feb 24, 2016","15.97","15.90","16.06","15.47","1.22M","0.06%"
"Feb 25, 2016","16.37","15.99","16.37","15.80","1.39M","2.50%"
"Feb 26, 2016","16.06","16.54","16.73","15.92","1.61M","-1.89%"
"Feb 29, 2016","16.41","16.27","16.58","16.20","3.19M","2.18%"
"Mar 01, 2016","16.64","16.50","16.97","16.45","3.84M","1.40%"
"Mar 02, 2016","16.80","16.81","17.05","16.47","3.15M","0.96%"
"Mar 03, 2016","16.91","17.11","17.32","16.64","3.60M","0.65%"
"Mar 04, 2016","17.74","17.30","17.83","16.89","3.47M","4.91%"
"Mar 07, 2016","18.15","18.10","18.15","17.67","1.90M","2.31%"
"Mar 08, 2016","18.08","18.15","18.21","17.79","2.91M","-0.39%"
"Mar 09, 2016","18.25","18.23","18.51","17.95","2.76M","0.94%"
"Mar 10, 2016","18.76","18.54","19.09","18.01","3.88M","2.79%"
"Mar 11, 2016","17.56","18.56","18.62","17.40","2.97M","-6.40%"
"Mar 14, 2016","16.77","17.87","17.87","16.63","2.57M","-4.50%"
"Mar 15, 2016","16.26","16.75","16.77","15.89","2.26M","-3.04%"
"Mar 16, 2016","16.95","16.40","17.38","16.10","3.21M","4.24%"
"Mar 17, 2016","18.00","17.30","18.24","17.20","3.15M","6.19%"
"Mar 18, 2016","18.00","18.10","18.25","17.48","2.80M","0.00%"
"Mar 21, 2016","18.08","18.16","18.18","17.86","2.11M","0.44%"
"Mar 22, 2016","18.08","18.18","18.29","17.84","1.82M","0.00%"
"Mar 23, 2016","17.50","17.99","18.13","17.34","2.09M","-3.21%"
"Mar 24, 2016","17.45","17.27","17.65","17.25","1.90M","-0.29%"
"Mar 28, 2016","17.96","17.81","18.10","17.68","1.55M","2.92%"
"Mar 29, 2016","17.82","18.08","18.14","17.65","2.03M","-0.78%"
"Mar 30, 2016","17.36","18.15","18.15","17.11","2.28M","-2.58%"
"Mar 31, 2016","16.46","17.32","17.32","16.42","7.39M","-5.18%"
"Apr 01, 2016","16.60","16.61","16.81","16.35","2.90M","0.85%"
"Apr 04, 2016","15.95","16.49","16.49","15.76","2.90M","-3.92%"
"Apr 05, 2016","15.84","15.85","16.38","15.70","2.81M","-0.69%"
"Apr 06, 2016","15.72","15.71","15.80","15.38","1.59M","-0.76%"
"Apr 07, 2016","15.31","15.95","16.00","15.17","2.12M","-2.61%"
"Apr 08, 2016","15.90","15.60","15.90","15.51","5.16M","3.85%"
"Apr 11, 2016","15.02","16.14","16.15","14.94","5.24M","-5.53%"
"Apr 12, 2016","15.51","15.45","15.79","15.27","3.37M","3.26%"
"Apr 13, 2016","15.73","15.84","16.05","15.67","2.48M","1.42%"
"Apr 14, 2016","15.86","15.65","16.06","15.51","2.02M","0.83%"
"Apr 15, 2016","16.15","16.05","16.25","15.85","2.52M","1.83%"
"Apr 18, 2016","15.18","16.21","16.24","15.06","2.43M","-6.01%"
"Apr 19, 2016","14.92","15.29","15.51","14.77","3.09M","-1.71%"
"Apr 20, 2016","14.81","14.86","15.12","14.68","1.17M","-0.74%"
"Apr 22, 2016","14.42","14.69","15.17","14.23","2.16M","-2.63%"
"Apr 25, 2016","14.79","14.36","14.87","14.36","3.35M","2.57%"
"Apr 26, 2016","15.32","14.85","15.35","14.85","1.54M","3.58%"
"Apr 27, 2016","15.94","15.35","16.11","15.35","3.21M","4.05%"
"Apr 28, 2016","15.85","16.00","16.06","15.36","2.06M","-0.56%"
"Apr 29, 2016","15.88","15.96","16.06","15.47","2.58M","0.19%"
"May 02, 2016","15.79","15.88","16.00","15.65","1.36M","-0.57%"
"May 03, 2016","15.87","15.65","15.87","15.26","1.11M","0.51%"
"May 04, 2016","15.06","15.85","15.89","14.95","3.97M","-5.10%"
"May 05, 2016","14.74","15.07","15.21","14.73","1.88M","-2.12%"
"May 06, 2016","14.03","14.48","14.72","14.03","4.31M","-4.82%"
"May 09, 2016","13.38","14.00","14.03","13.16","3.73M","-4.63%"
"May 10, 2016","13.77","13.56","13.79","13.00","3.73M","2.91%"
"May 11, 2016","14.20","13.88","14.27","13.87","2.87M","3.12%"
"May 12, 2016","14.61","14.27","14.73","14.09","1.61M","2.89%"
"May 13, 2016","14.19","14.61","14.61","13.75","2.68M","-2.87%"
"May 16, 2016","14.96","14.16","15.21","14.13","2.75M","5.43%"
"May 17, 2016","15.91","15.16","15.97","14.66","4.81M","6.35%"
"May 18, 2016","16.05","15.91","16.23","15.59","3.73M","0.88%"
"May 19, 2016","15.39","15.82","15.95","15.07","1.58M","-4.11%"
"May 20, 2016","15.90","15.56","16.15","15.41","1.54M","3.31%"
"May 23, 2016","15.72","15.68","15.85","15.46","2.10M","-1.13%"
"May 24, 2016","15.38","15.86","16.04","15.35","1.87M","-2.16%"
"May 25, 2016","15.26","15.60","15.76","15.26","1.57M","-0.78%"
"May 27, 2016","14.99","15.39","15.40","14.87","1.93M","-1.77%"
"May 30, 2016","15.21","15.08","15.25","14.89","508.00K","1.47%"
"May 31, 2016","15.23","15.26","15.36","14.92","2.69M","0.13%"
"Jun 01, 2016","15.06","15.35","15.35","14.76","1.68M","-1.12%"
"Jun 02, 2016","15.36","15.08","15.36","14.88","1.37M","1.99%"
"Jun 03, 2016","15.42","15.34","15.64","15.16","1.91M","0.39%"
"Jun 06, 2016","15.11","15.57","15.57","14.96","1.21M","-2.01%"
"Jun 07, 2016","15.08","15.06","15.11","14.57","2.36M","-0.20%"
"Jun 08, 2016","15.34","15.21","15.38","14.89","2.45M","1.72%"
"Jun 09, 2016","14.97","15.34","15.47","14.88","2.35M","-2.41%"
"Jun 10, 2016","14.39","14.96","15.01","14.28","2.89M","-3.87%"
"Jun 13, 2016","14.23","14.31","14.40","14.10","2.05M","-1.11%"
"Jun 14, 2016","14.04","14.30","14.40","13.86","1.98M","-1.34%"
"Jun 15, 2016","13.97","14.04","14.25","13.75","4.38M","-0.50%"
"Jun 16, 2016","14.30","13.97","14.30","13.67","3.22M","2.36%"
"Jun 17, 2016","14.62","14.29","14.79","14.29","3.05M","2.24%"
"Jun 20, 2016","15.10","14.76","15.33","14.71","1.95M","3.28%"
"Jun 21, 2016","15.34","15.17","15.35","14.85","1.42M","1.59%"
"Jun 22, 2016","15.09","15.34","15.34","14.88","1.91M","-1.63%"
"Jun 23, 2016","15.59","15.09","15.61","14.96","1.46M","3.31%"
"Jun 24, 2016","15.34","15.22","15.34","14.78","2.48M","-1.60%"
"Jun 27, 2016","15.07","15.34","15.34","14.66","1.45M","-1.76%"
"Jun 28, 2016","15.34","15.29","15.43","15.10","1.51M","1.79%"
"Jun 29, 2016","15.89","15.53","15.95","15.46","1.85M","3.59%"
"Jun 30, 2016","15.93","15.87","16.05","15.55","2.28M","0.25%"
"Jul 01, 2016","16.60","16.05","16.69","15.95","3.95M","4.21%"
"Jul 04, 2016","16.64","16.57","17.08","16.50","1.33M","0.24%"
"Jul 05, 2016","17.05","16.54","17.14","16.45","3.07M","2.46%"
"Jul 06, 2016","17.16","17.15","17.20","16.62","1.87M","0.65%"
"Jul 07, 2016","16.88","17.28","17.28","16.66","1.93M","-1.63%"
"Jul 08, 2016","17.38","17.12","17.38","16.91","1.83M","2.96%"
"Jul 11, 2016","17.67","17.46","18.04","17.39","2.31M","1.67%"
"Jul 12, 2016","17.84","17.92","18.03","17.74","2.50M","0.96%"
"Jul 13, 2016","17.29","17.76","17.86","17.18","2.45M","-3.08%"
"Jul 14, 2016","17.92","17.55","18.06","17.25","3.24M","3.64%"
"Jul 15, 2016","17.97","18.07","18.10","17.77","1.49M","0.28%"
"Jul 18, 2016","17.91","17.97","18.10","17.61","2.17M","-0.33%"
"Jul 19, 2016","17.85","17.78","17.94","17.69","1.52M","-0.34%"
"Jul 20, 2016","17.97","17.92","17.97","17.77","1.65M","0.67%"
"Jul 21, 2016","17.99","17.97","18.21","17.83","1.81M","0.11%"
"Jul 22, 2016","17.88","18.13","18.13","17.80","1.65M","-0.61%"
"Jul 25, 2016","17.78","17.89","17.96","17.41","1.27M","-0.56%"
"Jul 26, 2016","17.60","17.80","17.86","17.60","1.23M","-1.01%"
"Jul 27, 2016","18.25","17.71","18.64","17.52","1.97M","3.69%"
"Jul 28, 2016","18.11","18.32","18.36","17.79","1.63M","-0.77%"
"Jul 29, 2016","19.01","18.21","19.21","17.92","4.06M","4.97%"
"Aug 01, 2016","19.21","19.36","19.56","19.11","2.99M","1.05%"
"Aug 02, 2016","18.87","18.80","19.16","18.38","2.01M","-1.77%"
"Aug 03, 2016","19.03","18.86","19.05","18.30","2.23M","0.85%"
"Aug 04, 2016","19.16","19.22","19.83","19.01","2.11M","0.68%"
"Aug 05, 2016","19.22","19.37","19.56","18.73","1.61M","0.31%"
"Aug 08, 2016","18.68","19.29","19.29","18.68","1.67M","-2.81%"
"Aug 09, 2016","18.77","18.67","18.88","18.45","2.03M","0.48%"
"Aug 10, 2016","18.36","18.84","18.86","18.16","1.79M","-2.18%"
"Aug 11, 2016","19.06","18.51","19.26","18.17","2.49M","3.81%"
"Aug 12, 2016","19.95","19.42","20.28","19.15","4.16M","4.67%"
"Aug 15, 2016","20.24","19.96","20.43","19.68","2.66M","1.45%"
"Aug 16, 2016","19.83","20.28","20.28","19.61","2.16M","-2.03%"
"Aug 17, 2016","19.45","19.92","20.02","19.14","2.38M","-1.92%"
"Aug 18, 2016","18.62","19.47","19.59","18.62","2.86M","-4.27%"
"Aug 19, 2016","18.86","18.73","19.21","18.42","1.97M","1.29%"
"Aug 22, 2016","18.17","18.96","18.96","18.05","2.58M","-3.66%"
"Aug 23, 2016","18.52","18.36","18.78","18.19","1.98M","1.93%"
"Aug 24, 2016","18.96","18.66","18.97","18.32","3.17M","2.38%"
"Aug 25, 2016","18.67","19.03","19.05","18.55","1.31M","-1.53%"
"Aug 26, 2016","18.87","18.86","19.49","18.49","3.15M","1.07%"
"Aug 29, 2016","19.49","18.90","19.53","18.82","1.63M","3.29%"
"Aug 30, 2016","19.44","19.51","19.53","18.79","1.69M","-0.26%"
"Aug 31, 2016","19.09","19.36","19.42","18.38","4.12M","-1.80%"
"Sep 01, 2016","19.31","19.13","19.42","18.83","4.27M","1.15%"
"Sep 02, 2016","19.77","19.43","19.77","19.41","1.89M","2.38%"
"Sep 05, 2016","19.91","19.86","19.91","19.55","673.40K","0.71%"
"Sep 06, 2016","19.87","19.91","19.93","19.57","1.36M","-0.20%"
"Sep 08, 2016","20.10","19.91","20.17","19.60","1.97M","1.16%"
"Sep 09, 2016","19.48","20.06","20.06","19.29","1.92M","-3.08%"
"Sep 12, 2016","19.34","19.24","19.52","18.83","1.35M","-0.72%"
"Sep 13, 2016","18.95","19.08","19.15","18.50","1.72M","-2.02%"
"Sep 14, 2016","18.77","19.02","19.02","18.57","1.53M","-0.95%"
"Sep 15, 2016","19.12","18.96","19.14","18.61","2.27M","1.86%"
"Sep 16, 2016","18.61","19.05","19.07","18.54","1.93M","-2.67%"
"Sep 19, 2016","18.77","18.75","19.06","18.42","1.20M","0.86%"
"Sep 20, 2016","18.67","18.93","18.95","18.50","971.30K","-0.53%"
"Sep 21, 2016","19.29","18.86","19.32","18.42","1.46M","3.32%"
"Sep 22, 2016","19.45","19.51","19.88","19.14","2.77M","0.83%"
"Sep 23, 2016","19.46","19.61","19.80","19.40","3.88M","0.05%"
"Sep 26, 2016","19.51","19.36","19.51","19.26","1.68M","0.26%"
"Sep 27, 2016","19.61","19.56","19.75","19.42","1.18M","0.51%"
"Sep 28, 2016","20.24","19.61","20.35","19.61","1.67M","3.21%"
"Sep 29, 2016","19.82","20.29","20.81","19.79","2.65M","-2.08%"
"Sep 30, 2016","20.05","19.87","20.27","19.76","1.59M","1.16%"
"Oct 03, 2016","20.45","19.96","20.53","19.93","1.34M","2.00%"
"Oct 04, 2016","20.37","20.55","20.62","19.83","1.95M","-0.39%"
"Oct 05, 2016","20.45","20.37","20.60","20.28","971.50K","0.39%"
"Oct 06, 2016","20.46","20.40","20.50","20.04","978.30K","0.05%"
"Oct 07, 2016","20.52","20.40","20.61","20.19","1.16M","0.29%"
"Oct 10, 2016","20.39","20.55","20.59","20.20","3.24M","-0.63%"
"Oct 11, 2016","20.42","20.51","20.61","20.16","1.46M","0.15%"
"Oct 13, 2016","20.50","20.29","20.53","20.08","2.49M","0.39%"
"Oct 14, 2016","20.52","20.74","20.86","20.44","2.37M","0.10%"
"Oct 17, 2016","20.67","20.62","20.75","20.38","1.74M","0.73%"
"Oct 18, 2016","21.39","20.71","21.41","20.55","2.15M","3.48%"
"Oct 19, 2016","21.09","21.39","21.51","20.97","1.26M","-1.40%"
"Oct 20, 2016","20.81","21.07","21.09","20.58","1.79M","-1.33%"
"Oct 21, 2016","21.12","20.82","21.21","20.71","1.19M","1.49%"
"Oct 24, 2016","21.17","21.22","21.36","21.01","1.29M","0.24%"
"Oct 25, 2016","20.81","21.19","21.35","20.63","1.01M","-1.70%"
"Oct 26, 2016","20.74","20.62","20.74","20.20","984.80K","-0.34%"
"Oct 27, 2016","20.67","20.74","21.03","20.42","1.77M","-0.34%"
"Oct 28, 2016","20.42","20.67","20.74","20.34","1.95M","-1.21%"
"Oct 31, 2016","20.57","20.40","20.71","20.29","1.94M","0.73%"
"Nov 01, 2016","19.79","20.74","20.74","19.63","1.97M","-3.79%"
"Nov 03, 2016","19.53","19.78","19.96","19.30","1.98M","-1.31%"
"Nov 04, 2016","19.48","19.61","20.07","19.44","1.54M","-0.26%"
"Nov 07, 2016","20.09","19.84","20.33","19.47","1.77M","3.13%"
"Nov 08, 2016","20.24","20.17","20.42","19.77","1.43M","0.75%"
"Nov 09, 2016","19.83","19.77","20.17","19.18","2.26M","-2.03%"
"Nov 10, 2016","18.56","19.75","19.90","18.31","3.24M","-6.40%"
"Nov 11, 2016","16.99","17.89","18.76","16.99","5.11M","-8.46%"
"Nov 14, 2016","16.79","17.10","17.15","16.40","3.07M","-1.18%"
"Nov 16, 2016","16.98","17.12","17.29","16.56","2.45M","1.13%"
"Nov 17, 2016","16.57","17.19","17.23","16.57","1.89M","-2.41%"
"Nov 18, 2016","16.30","16.64","16.64","16.10","2.15M","-1.63%"
"Nov 21, 2016","16.43","16.41","16.74","16.24","2.94M","0.80%"
"Nov 22, 2016","16.40","16.64","16.73","16.20","2.08M","-0.18%"
"Nov 23, 2016","16.00","16.40","16.49","15.50","2.62M","-2.44%"
"Nov 24, 2016","16.00","16.09","16.22","15.80","1.41M","0.00%"
"Nov 25, 2016","15.85","15.85","16.03","15.60","2.52M","-0.94%"
"Nov 28, 2016","16.18","16.00","16.38","15.63","1.71M","2.08%"
"Nov 29, 2016","15.97","16.15","16.64","15.91","2.31M","-1.30%"
"Nov 30, 2016","16.28","16.25","16.31","15.77","3.03M","1.94%"
"Dec 01, 2016","15.49","16.30","16.30","15.00","4.69M","-4.85%"
"Dec 02, 2016","15.41","15.34","15.74","14.95","4.59M","-0.52%"
"Dec 05, 2016","15.10","15.61","15.73","14.99","4.85M","-2.01%"
"Dec 06, 2016","15.90","15.03","15.94","14.92","3.37M","5.30%"
"Dec 07, 2016","16.71","16.11","16.97","16.06","3.90M","5.09%"
"Dec 08, 2016","16.50","16.95","17.36","16.32","2.55M","-1.26%"
"Dec 09, 2016","16.21","16.71","16.80","16.02","2.85M","-1.76%"
"Dec 12, 2016","16.00","16.09","16.22","15.70","1.28M","-1.30%"
"Dec 13, 2016","16.37","16.00","16.52","15.32","3.18M","2.31%"
"Dec 14, 2016","15.36","16.38","17.19","15.36","3.75M","-6.17%"
"Dec 15, 2016","15.36","15.50","15.56","15.00","2.64M","0.00%"
"Dec 16, 2016","15.66","15.55","16.01","15.46","2.68M","1.95%"
"Dec 19, 2016","15.50","15.78","15.82","15.41","1.39M","-1.02%"
"Dec 20, 2016","15.67","15.59","16.03","15.28","1.58M","1.10%"
"Dec 21, 2016","16.12","15.84","16.34","15.70","2.03M","2.87%"
"Dec 22, 2016","16.03","16.17","16.30","15.66","1.31M","-0.56%"
"Dec 23, 2016","16.45","16.19","16.68","16.01","1.59M","2.62%"
"Dec 26, 2016","16.65","16.59","16.75","16.45","613.90K","1.22%"
"Dec 27, 2016","16.80","16.75","16.80","16.49","1.10M","0.90%"
"Dec 28, 2016","16.85","16.87","16.92","16.69","2.12M","0.30%"
"Dec 29, 2016","16.90","16.97","16.99","16.64","3.08M","0.30%"
"Jan 02, 2017","16.53","16.75","16.75","16.46","1.25M","-2.19%"
"Jan 03, 2017","16.80","16.65","17.03","16.63","8.02M","1.63%"
"Jan 04, 2017","16.77","16.60","17.24","16.60","2.38M","-0.18%"
"Jan 05, 2017","16.81","16.78","17.03","16.72","2.24M","0.24%"
"Jan 06, 2017","16.77","16.79","16.87","16.62","1.37M","-0.24%"
"Jan 09, 2017","16.75","16.64","16.92","16.64","1.18M","-0.12%"
"Jan 10, 2017","16.77","16.78","17.10","16.67","1.53M","0.12%"
"Jan 11, 2017","16.37","16.80","16.95","16.22","3.56M","-2.39%"
"Jan 12, 2017","17.58","16.87","17.69","16.87","11.92M","7.39%"
"Jan 13, 2017","17.58","17.71","17.91","17.44","2.82M","0.00%"
"Jan 16, 2017","17.77","17.60","17.87","17.60","1.22M","1.08%"
"Jan 17, 2017","17.72","17.78","17.86","17.58","1.75M","-0.28%"
"Jan 18, 2017","17.64","17.63","17.84","17.47","1.11M","-0.45%"
"Jan 19, 2017","17.58","17.77","17.77","17.34","1.14M","-0.34%"
"Jan 20, 2017","17.89","17.64","17.91","17.56","1.36M","1.76%"
"Jan 23, 2017","18.18","17.93","18.22","17.93","1.75M","1.62%"
"Jan 24, 2017","17.79","18.25","18.31","17.74","2.90M","-2.15%"
"Jan 26, 2017","17.49","17.94","18.13","17.19","3.58M","-1.69%"
"Jan 27, 2017","17.37","17.40","17.62","17.09","2.05M","-0.69%"
"Jan 30, 2017","16.84","17.42","17.44","16.67","2.72M","-3.05%"
"Jan 31, 2017","16.65","16.92","16.92","16.51","2.67M","-1.13%"
"Feb 01, 2017","16.67","16.80","16.87","16.57","1.60M","0.12%"
"Feb 02, 2017","16.42","16.64","16.64","16.28","2.63M","-1.50%"
"Feb 03, 2017","16.92","16.42","17.00","16.36","3.06M","3.05%"
"Feb 06, 2017","16.83","17.03","17.16","16.70","1.07M","-0.53%"
"Feb 07, 2017","16.86","17.04","17.04","16.64","1.49M","0.18%"
"Feb 08, 2017","16.85","16.84","16.91","16.56","3.23M","-0.06%"
"Feb 09, 2017","16.88","16.99","17.02","16.74","2.22M","0.18%"
"Feb 10, 2017","16.92","17.03","17.10","16.78","2.23M","0.24%"
"Feb 13, 2017","16.92","17.02","17.02","16.68","1.21M","0.00%"
"Feb 14, 2017","16.72","16.92","17.02","16.62","2.05M","-1.18%"
"Feb 15, 2017","16.12","16.80","16.88","16.06","9.72M","-3.59%"
"Feb 16, 2017","16.22","16.17","16.34","16.13","11.94M","0.62%"
"Feb 17, 2017","16.68","16.22","16.69","16.12","18.38M","2.84%"
"Feb 20, 2017","17.12","16.71","17.37","16.71","16.41M","2.64%"
"Feb 21, 2017","16.76","17.35","17.35","16.57","11.31M","-2.10%"
"Feb 22, 2017","16.78","16.80","16.81","16.55","3.14M","0.12%"
"Feb 23, 2017","16.78","16.87","16.94","16.70","12.26M","0.00%"
"Feb 24, 2017","16.26","16.70","16.70","16.06","13.46M","-3.10%"
"Mar 01, 2017","16.51","16.36","16.51","16.13","2.43M","1.54%"
"Mar 02, 2017","16.46","16.36","16.66","16.13","3.79M","-0.30%"
"Mar 03, 2017","16.48","16.56","16.64","16.23","5.68M","0.12%"
"Mar 06, 2017","17.00","16.46","17.14","16.32","7.22M","3.16%"
"Mar 07, 2017","16.80","17.09","17.14","16.64","5.96M","-1.18%"
"Mar 08, 2017","15.96","16.95","16.95","15.71","5.53M","-5.00%"
"Mar 09, 2017","15.67","16.06","16.06","15.51","12.14M","-1.82%"
"Mar 10, 2017","15.37","15.82","15.86","15.07","15.63M","-1.91%"
"Mar 13, 2017","15.73","15.43","15.78","15.25","4.99M","2.34%"
"Mar 14, 2017","15.47","15.81","15.81","15.40","4.20M","-1.65%"
"Mar 15, 2017","15.77","15.62","15.86","15.23","7.27M","1.94%"
"Mar 16, 2017","15.94","16.01","16.04","15.74","5.02M","1.08%"
"Mar 17, 2017","15.52","16.01","16.01","15.37","4.66M","-2.63%"
"Mar 20, 2017","15.77","15.52","15.88","15.42","7.21M","1.61%"
"Mar 21, 2017","15.35","15.87","15.87","15.33","2.65M","-2.66%"
"Mar 22, 2017","15.45","15.34","15.70","15.19","4.41M","0.65%"
"Mar 23, 2017","15.77","15.47","15.86","15.39","6.07M","2.07%"
"Mar 24, 2017","15.96","15.63","16.04","15.63","15.04M","1.20%"
"Mar 27, 2017","15.92","15.88","16.06","15.67","3.63M","-0.25%"
"Mar 28, 2017","16.30","15.98","16.41","15.94","6.41M","2.39%"
"Mar 29, 2017","16.31","16.40","16.46","16.13","3.49M","0.06%"
"Mar 30, 2017","16.28","16.44","16.44","16.11","2.47M","-0.18%"
"Mar 31, 2017","16.22","16.32","16.32","16.01","3.40M","-0.37%"
"Apr 03, 2017","16.11","16.26","16.26","15.94","2.07M","-0.68%"
"Apr 04, 2017","15.97","16.12","16.16","15.92","3.30M","-0.87%"
"Apr 05, 2017","15.85","16.06","16.23","15.68","5.52M","-0.75%"
"Apr 06, 2017","15.77","15.85","15.98","15.58","2.55M","-0.50%"
"Apr 07, 2017","16.01","15.80","16.06","15.66","7.98M","1.52%"
"Apr 10, 2017","16.01","16.05","16.11","15.86","2.45M","0.00%"
"Apr 11, 2017","15.99","16.06","16.09","15.54","3.04M","-0.12%"
"Apr 12, 2017","15.77","15.95","16.01","15.72","4.14M","-1.38%"
"Apr 13, 2017","15.51","15.77","15.84","15.41","2.99M","-1.65%"
"Apr 17, 2017","15.91","15.67","16.01","15.52","3.11M","2.58%"
"Apr 18, 2017","16.07","15.91","16.16","15.86","2.79M","1.01%"
"Apr 19, 2017","15.87","16.15","16.15","15.87","2.80M","-1.24%"
"Apr 20, 2017","16.26","16.10","16.35","15.96","6.78M","2.46%"
"Apr 24, 2017","16.52","16.38","16.61","16.38","3.27M","1.60%"
"Apr 25, 2017","16.56","16.54","16.59","16.27","2.59M","0.24%"
"Apr 26, 2017","16.61","16.56","16.71","16.41","2.60M","0.30%"
"Apr 27, 2017","16.45","16.61","16.69","16.32","2.26M","-0.96%"
"Apr 28, 2017","16.70","16.46","16.70","16.33","8.96M","1.52%"
"May 02, 2017","17.93","16.77","17.93","16.70","12.75M","7.37%"
"May 03, 2017","17.88","17.93","18.14","17.79","7.18M","-0.28%"
"May 04, 2017","17.45","17.86","17.86","17.38","5.70M","-2.40%"
"May 05, 2017","17.35","17.55","17.60","17.05","12.28M","-0.57%"
"May 08, 2017","17.20","17.44","17.46","17.01","2.87M","-0.86%"
"May 09, 2017","17.19","17.35","17.36","16.94","7.98M","-0.06%"
"May 10, 2017","17.85","17.51","17.90","17.45","6.90M","3.84%"
"May 11, 2017","17.58","17.84","17.85","17.42","7.00M","-1.51%"
"May 12, 2017","17.00","17.34","17.34","16.76","23.24M","-3.30%"
"May 15, 2017","16.95","17.14","17.15","16.86","5.92M","-0.29%"
"May 16, 2017","16.93","16.94","17.01","16.78","6.73M","-0.12%"
"May 17, 2017","16.87","16.90","17.05","16.78","3.62M","-0.35%"
"May 18, 2017","14.28","13.88","14.99","13.88","18.41M","-15.35%"
"May 19, 2017","14.33","14.77","14.99","14.23","10.99M","0.35%"
"May 22, 2017","13.89","14.30","14.32","13.35","12.45M","-3.07%"
"May 23, 2017","14.32","14.08","14.53","14.04","8.61M","3.10%"
"May 24, 2017","14.44","14.48","14.61","14.36","13.56M","0.84%"
"May 25, 2017","14.36","14.41","14.57","14.21","9.96M","-0.55%"
"May 26, 2017","14.80","14.48","14.82","14.39","6.98M","3.06%"
"May 29, 2017","14.91","14.78","14.91","14.63","3.09M","0.74%"
"May 30, 2017","14.76","14.93","14.97","14.76","4.40M","-1.01%"
"May 31, 2017","14.48","14.77","14.85","14.43","4.92M","-1.90%"
"Jun 01, 2017","14.21","14.48","14.58","14.05","5.90M","-1.86%"
"Jun 02, 2017","14.36","14.23","14.40","14.13","3.06M","1.06%"
"Jun 05, 2017","14.31","14.27","14.48","14.15","2.18M","-0.35%"
"Jun 06, 2017","14.53","14.36","14.60","14.21","2.50M","1.54%"
"Jun 07, 2017","14.53","14.65","14.67","14.35","2.28M","0.00%"
"Jun 08, 2017","14.33","14.49","14.49","14.18","4.13M","-1.38%"
"Jun 09, 2017","14.28","14.42","14.44","14.18","2.41M","-0.35%"
"Jun 12, 2017","14.08","14.30","14.32","13.90","3.25M","-1.40%"
"Jun 13, 2017","14.13","14.16","14.24","13.99","2.77M","0.36%"
"Jun 14, 2017","14.15","14.28","14.38","14.03","4.79M","0.14%"
"Jun 16, 2017","13.78","14.03","14.10","13.78","7.26M","-2.61%"
"Jun 19, 2017","13.76","13.86","13.88","13.71","4.26M","-0.15%"
"Jun 20, 2017","13.48","13.76","13.80","13.37","9.63M","-2.03%"
"Jun 21, 2017","13.31","13.58","13.67","13.23","6.77M","-1.26%"
"Jun 22, 2017","13.14","13.36","13.37","13.09","9.57M","-1.28%"
"Jun 23, 2017","13.39","13.22","13.49","13.15","4.99M","1.90%"
"Jun 26, 2017","13.78","13.58","13.84","13.48","3.93M","2.91%"
"Jun 27, 2017","13.57","13.78","13.79","13.57","3.06M","-1.52%"
"Jun 28, 2017","13.63","13.70","13.70","13.34","1.92M","0.44%"
"Jun 29, 2017","13.61","13.74","13.77","13.51","1.94M","-0.15%"
"Jun 30, 2017","13.88","13.68","13.88","13.54","3.06M","1.98%"
"Jul 03, 2017","13.76","13.93","13.97","13.65","4.15M","-0.86%"
"Jul 04, 2017","13.73","13.81","13.81","13.63","1.55M","-0.22%"
"Jul 05, 2017","13.85","13.73","13.85","13.58","12.51M","0.87%"
"Jul 06, 2017","13.63","13.85","13.90","13.62","3.93M","-1.59%"
"Jul 07, 2017","14.23","13.78","14.30","13.74","9.71M","4.40%"
"Jul 10, 2017","14.47","14.30","14.60","14.08","5.02M","1.69%"
"Jul 11, 2017","14.75","14.56","14.78","14.38","3.70M","1.94%"
"Jul 12, 2017","15.14","14.87","15.14","14.68","5.97M","2.64%"
"Jul 13, 2017","15.07","15.17","15.22","15.00","3.45M","-0.46%"
"Jul 14, 2017","15.01","15.15","15.15","14.67","4.74M","-0.40%"
"Jul 17, 2017","14.85","15.00","15.01","14.74","3.89M","-1.07%"
"Jul 18, 2017","14.81","14.85","14.85","14.59","3.51M","-0.27%"
"Jul 19, 2017","14.53","14.87","14.89","14.49","3.19M","-1.89%"
"Jul 20, 2017","14.72","14.62","14.77","14.45","3.26M","1.31%"
"Jul 21, 2017","14.63","14.76","14.82","14.61","2.72M","-0.61%"
"Jul 24, 2017","14.89","14.77","14.90","14.64","5.96M","1.78%"
"Jul 25, 2017","15.09","15.03","15.27","15.01","6.67M","1.34%"
"Jul 26, 2017","15.05","15.24","15.30","15.03","3.23M","-0.27%"
"Jul 27, 2017","15.37","15.15","15.42","15.15","4.41M","2.13%"
"Jul 28, 2017","15.42","15.38","15.46","15.19","4.43M","0.33%"
"Jul 31, 2017","15.54","15.47","15.57","15.31","2.85M","0.78%"
"Aug 01, 2017","15.77","15.55","15.86","15.46","4.17M","1.48%"
"Aug 02, 2017","16.01","15.79","16.13","15.69","5.04M","1.52%"
"Aug 03, 2017","15.95","16.02","16.10","15.83","3.41M","-0.37%"
"Aug 04, 2017","15.93","15.97","16.02","15.77","2.87M","-0.13%"
"Aug 07, 2017","15.81","15.91","15.93","15.70","4.01M","-0.75%"
"Aug 08, 2017","15.57","15.81","15.87","15.51","4.41M","-1.52%"
"Aug 09, 2017","15.43","15.57","15.57","15.35","3.05M","-0.90%"
"Aug 10, 2017","15.12","15.47","15.50","15.02","5.72M","-2.01%"
"Aug 11, 2017","15.69","15.07","15.91","14.79","9.10M","3.77%"
"Aug 14, 2017","16.24","15.77","16.33","15.65","6.93M","3.51%"
"Aug 15, 2017","16.35","16.26","16.48","16.18","4.90M","0.68%"
"Aug 16, 2017","16.38","16.45","16.50","16.13","4.85M","0.18%"
"Aug 17, 2017","16.67","16.31","16.90","16.21","8.75M","1.77%"
"Aug 18, 2017","16.79","16.74","16.92","16.58","4.93M","0.72%"
"Aug 21, 2017","16.90","16.86","17.11","16.77","4.48M","0.66%"
"Aug 22, 2017","16.98","16.94","17.23","16.90","3.31M","0.47%"
"Aug 23, 2017","17.05","16.95","17.13","16.92","3.05M","0.41%"
"Aug 24, 2017","17.48","17.06","17.54","17.05","3.92M","2.52%"
"Aug 25, 2017","17.64","17.47","17.71","17.43","3.64M","0.92%"
"Aug 28, 2017","17.53","17.65","17.75","17.28","2.55M","-0.62%"
"Aug 29, 2017","17.74","17.45","17.74","17.33","3.03M","1.20%"
"Aug 30, 2017","17.79","17.66","17.90","17.47","4.54M","0.28%"
"Aug 31, 2017","17.62","17.79","17.82","17.52","3.69M","-0.96%"
"Sep 01, 2017","17.71","17.67","17.94","17.53","4.16M","0.51%"
"Sep 04, 2017","17.96","17.75","18.11","17.59","3.11M","1.41%"
"Sep 05, 2017","17.98","18.05","18.23","17.80","5.56M","0.11%"
"Sep 06, 2017","18.54","18.03","18.54","18.03","6.67M","3.11%"
"Sep 08, 2017","18.64","18.54","18.78","18.40","4.16M","0.54%"
"Sep 11, 2017","18.90","18.80","19.08","18.67","3.93M","1.39%"
"Sep 12, 2017","18.74","18.89","18.91","18.52","5.52M","-0.85%"
"Sep 13, 2017","18.92","18.73","19.07","18.64","5.09M","0.96%"
"Sep 14, 2017","19.34","18.84","19.34","18.80","5.69M","2.22%"
"Sep 15, 2017","19.74","19.42","19.74","19.30","13.76M","2.07%"
"Sep 18, 2017","19.97","19.70","20.12","19.60","5.78M","1.17%"
"Sep 19, 2017","19.95","20.01","20.19","19.79","3.07M","-0.10%"
"Sep 20, 2017","19.50","20.02","20.16","19.29","4.70M","-2.26%"
"Sep 21, 2017","19.20","19.50","19.78","19.00","5.11M","-1.54%"
"Sep 22, 2017","19.36","19.20","19.38","18.93","3.88M","0.83%"
"Sep 25, 2017","18.86","19.34","19.35","18.76","2.88M","-2.58%"
"Sep 26, 2017","18.86","19.09","19.19","18.80","3.20M","0.00%"
"Sep 27, 2017","18.44","18.90","18.93","18.18","5.92M","-2.23%"
"Sep 28, 2017","18.57","18.69","18.92","18.49","4.81M","0.70%"
"Sep 29, 2017","19.09","18.84","19.20","18.74","4.17M","2.80%"
"Oct 02, 2017","18.96","19.24","19.53","18.96","4.54M","-0.68%"
"Oct 03, 2017","19.47","19.14","19.68","19.02","7.13M","2.69%"
"Oct 04, 2017","20.03","19.59","20.11","19.38","7.74M","2.88%"
"Oct 05, 2017","20.18","20.10","20.61","20.10","9.21M","0.75%"
"Oct 06, 2017","19.84","19.89","19.95","19.51","3.73M","-1.68%"
"Oct 09, 2017","19.55","19.93","20.11","19.17","3.14M","-1.46%"
"Oct 10, 2017","19.77","19.81","19.98","19.72","3.49M","1.13%"
"Oct 11, 2017","19.69","19.93","19.95","19.63","5.08M","-0.40%"
"Oct 13, 2017","19.06","18.99","19.26","18.74","6.77M","-3.20%"
"Oct 16, 2017","18.44","19.06","19.16","18.38","7.90M","-3.25%"
"Oct 17, 2017","17.84","18.44","18.59","17.84","8.42M","-3.25%"
"Oct 18, 2017","18.23","18.09","18.51","18.05","6.84M","2.19%"
"Oct 19, 2017","18.23","18.34","18.39","17.90","5.18M","0.00%"
"Oct 20, 2017","18.42","18.20","18.63","18.20","2.76M","1.04%"
"Oct 23, 2017","17.86","18.39","18.39","17.71","4.24M","-3.04%"
"Oct 24, 2017","17.85","18.00","18.00","17.61","5.30M","-0.06%"
"Oct 25, 2017","17.88","17.93","18.24","17.70","3.96M","0.17%"
"Oct 26, 2017","17.51","17.96","18.09","17.31","3.23M","-2.07%"
"Oct 27, 2017","17.62","17.46","17.86","17.16","3.04M","0.63%"
"Oct 30, 2017","17.10","17.64","17.64","16.91","5.60M","-2.95%"
"Oct 31, 2017","17.43","17.15","17.43","16.90","4.99M","1.93%"
"Nov 01, 2017","16.93","17.47","17.62","16.92","6.18M","-2.87%"
"Nov 03, 2017","15.72","17.00","17.02","15.62","13.60M","-7.15%"
"Nov 06, 2017","15.63","15.69","16.06","15.52","8.82M","-0.57%"
"Nov 07, 2017","15.22","15.63","15.67","14.87","8.32M","-2.62%"
"Nov 08, 2017","15.70","15.36","15.72","15.12","6.05M","3.15%"
"Nov 09, 2017","15.31","15.77","15.81","15.12","5.14M","-2.48%"
"Nov 10, 2017","15.18","15.37","15.62","15.09","5.02M","-0.85%"
"Nov 13, 2017","15.30","15.18","15.44","15.04","5.11M","0.79%"
"Nov 14, 2017","15.11","15.35","15.40","15.02","5.40M","-1.24%"
"Nov 16, 2017","15.22","15.11","15.37","15.07","6.36M","0.73%"
"Nov 17, 2017","15.30","15.23","15.34","15.09","4.17M","0.53%"
"Nov 21, 2017","15.60","15.37","15.83","15.37","5.60M","1.96%"
"Nov 22, 2017","15.43","15.70","15.79","15.27","4.89M","-1.09%"
"Nov 23, 2017","15.22","15.39","15.39","15.02","3.60M","-1.36%"
"Nov 24, 2017","15.17","15.22","15.45","15.09","3.03M","-0.33%"
"Nov 27, 2017","15.37","15.15","15.37","14.94","5.67M","1.32%"
"Nov 28, 2017","15.48","15.46","15.69","15.41","18.38M","0.72%"
"Nov 29, 2017","15.27","15.54","15.61","15.21","7.04M","-1.36%"
"Nov 30, 2017","14.70","15.27","15.28","14.66","10.54M","-3.73%"
"Dec 01, 2017","14.98","14.58","14.98","14.43","4.67M","1.90%"
"Dec 04, 2017","15.12","14.98","15.19","14.87","3.86M","0.93%"
"Dec 05, 2017","15.11","15.12","15.40","15.06","4.14M","-0.07%"
"Dec 06, 2017","15.36","15.07","15.37","14.95","4.48M","1.65%"
"Dec 07, 2017","15.12","15.08","15.27","14.82","4.04M","-1.56%"
"Dec 08, 2017","15.22","15.27","15.34","15.10","3.78M","0.66%"
"Dec 11, 2017","15.10","15.32","15.35","15.08","2.82M","-0.79%"
"Dec 12, 2017","15.07","15.03","15.07","14.73","3.68M","-0.20%"
"Dec 13, 2017","14.90","15.21","15.23","14.73","5.11M","-1.13%"
"Dec 14, 2017","14.87","14.82","14.90","14.70","3.73M","-0.20%"
"Dec 15, 2017","15.20","14.87","15.27","14.82","4.77M","2.22%"
"Dec 18, 2017","15.38","15.23","15.47","15.18","3.32M","1.18%"
"Dec 19, 2017","15.18","15.37","15.42","14.98","2.73M","-1.30%"
"Dec 20, 2017","15.26","15.10","15.35","15.10","1.54M","0.53%"
"Dec 21, 2017","15.54","15.27","15.55","15.23","4.31M","1.83%"
"Dec 22, 2017","15.71","15.51","15.71","15.44","1.99M","1.09%"
"Dec 26, 2017","16.28","15.72","16.36","15.66","5.04M","3.63%"
"Dec 27, 2017","16.94","16.34","17.00","16.33","11.75M","4.05%"
"Dec 28, 2017","16.91","17.05","17.11","16.69","5.41M","-0.18%"
"Jan 02, 2018","16.46","16.78","16.85","16.18","17.95M","-2.66%"
"Jan 03, 2018","16.31","16.41","16.59","16.26","6.05M","-0.91%"
"Jan 04, 2018","16.07","16.36","16.39","16.02","8.07M","-1.47%"
"Jan 05, 2018","16.19","16.15","16.19","15.86","4.99M","0.75%"
"Jan 08, 2018","16.48","16.26","16.48","16.26","4.83M","1.79%"
"Jan 09, 2018","16.26","16.57","16.58","16.19","4.15M","-1.33%"
"Jan 10, 2018","15.94","16.12","16.18","15.80","5.43M","-1.97%"
"Jan 11, 2018","15.65","15.94","16.07","15.58","6.22M","-1.82%"
"Jan 12, 2018","15.66","15.54","15.66","15.24","8.59M","0.06%"
"Jan 15, 2018","15.69","15.65","16.02","15.64","3.91M","0.19%"
"Jan 16, 2018","15.54","15.74","15.84","15.49","3.70M","-0.96%"
"Jan 17, 2018","15.79","15.59","15.79","15.51","6.52M","1.61%"
"Jan 18, 2018","16.13","15.79","16.18","15.75","5.77M","2.15%"
"Jan 19, 2018","16.44","16.17","16.44","16.05","6.56M","1.92%"
"Jan 22, 2018","16.30","16.54","16.59","16.12","3.80M","-0.85%"
"Jan 23, 2018","15.84","16.20","16.23","15.67","4.82M","-2.82%"
"Jan 24, 2018","16.44","15.93","16.46","15.93","6.46M","3.79%"
"Jan 26, 2018","17.03","16.49","17.10","16.39","16.66M","3.59%"
"Jan 29, 2018","16.99","16.91","17.08","16.69","11.60M","-0.23%"
"Jan 30, 2018","16.82","16.83","16.98","16.52","3.97M","-1.00%"
"Jan 31, 2018","16.83","16.93","17.21","16.75","4.80M","0.06%"
"Feb 01, 2018","16.89","16.93","17.13","16.79","2.73M","0.36%"
"Feb 02, 2018","16.54","16.65","16.69","16.39","3.08M","-2.07%"
"Feb 05, 2018","16.24","16.44","16.55","16.20","3.65M","-1.81%"
"Feb 06, 2018","16.24","15.94","16.31","15.86","8.66M","0.00%"
"Feb 07, 2018","15.82","16.23","16.34","15.70","11.80M","-2.59%"
"Feb 08, 2018","15.61","15.84","15.94","15.54","14.23M","-1.33%"
"Feb 09, 2018","15.57","15.60","15.84","15.10","7.37M","-0.26%"
"Feb 14, 2018","16.00","15.76","16.00","15.55","6.85M","2.76%"
"Feb 15, 2018","15.74","15.87","16.01","15.74","4.24M","-1.63%"
"Feb 16, 2018","15.77","15.72","15.80","15.58","2.42M","0.19%"
"Feb 19, 2018","15.68","15.67","15.81","15.63","2.83M","-0.56%"
"Feb 20, 2018","15.92","15.62","16.00","15.49","5.10M","1.51%"
"Feb 21, 2018","16.56","15.90","16.78","15.90","17.33M","4.02%"
"Feb 22, 2018","16.71","16.66","16.92","16.53","5.76M","0.95%"
"Feb 23, 2018","16.74","16.80","16.89","16.62","3.92M","0.18%"
"Feb 26, 2018","16.57","16.79","16.87","16.41","3.20M","-1.06%"
"Feb 27, 2018","16.49","16.47","16.58","16.32","2.25M","-0.48%"
"Feb 28, 2018","16.64","16.57","17.00","16.41","6.13M","0.90%"
"Mar 01, 2018","16.87","16.79","17.19","16.57","7.84M","1.42%"
"Mar 02, 2018","17.09","16.83","17.15","16.56","3.79M","1.29%"
"Mar 05, 2018","17.24","17.22","17.44","17.05","6.39M","0.87%"
"Mar 06, 2018","16.62","17.42","17.42","16.61","6.88M","-3.60%"
"Mar 07, 2018","16.34","16.66","16.66","16.01","6.66M","-1.66%"
"Mar 08, 2018","16.61","16.69","17.13","16.51","13.37M","1.63%"
"Mar 09, 2018","16.89","16.60","17.01","16.55","4.76M","1.72%"
"Mar 12, 2018","16.72","16.85","17.00","16.58","4.27M","-0.99%"
"Mar 13, 2018","16.80","16.77","16.95","16.53","4.11M","0.47%"
"Mar 14, 2018","16.92","16.80","16.95","16.70","5.15M","0.70%"
"Mar 15, 2018","16.96","16.86","16.99","16.76","2.90M","0.23%"
"Mar 16, 2018","17.46","16.86","17.49","16.68","9.61M","2.96%"
"Mar 19, 2018","17.63","17.35","17.67","17.20","7.52M","0.96%"
"Mar 20, 2018","17.56","17.59","17.83","17.33","5.64M","-0.39%"
"Mar 21, 2018","17.44","17.59","17.72","17.44","3.54M","-0.67%"
"Mar 22, 2018","18.08","17.49","18.15","17.46","6.94M","3.67%"
"Mar 23, 2018","18.05","17.88","18.21","17.72","4.94M","-0.22%"
"Mar 26, 2018","18.24","18.09","18.45","17.96","5.84M","1.09%"
"Mar 27, 2018","18.08","18.32","18.34","17.86","6.55M","-0.86%"
"Mar 28, 2018","17.88","17.88","17.98","17.56","5.27M","-1.14%"
"Mar 29, 2018","18.57","17.94","18.61","17.86","8.30M","3.86%"
"Apr 02, 2018","18.41","18.46","18.73","18.27","4.03M","-0.85%"
"Apr 03, 2018","18.38","18.50","18.62","18.15","2.94M","-0.16%"
"Apr 04, 2018","18.32","18.00","18.48","17.91","2.97M","-0.32%"
"Apr 05, 2018","18.43","18.58","18.73","18.15","2.88M","0.59%"
"Apr 06, 2018","18.30","18.35","18.59","18.19","3.58M","-0.70%"
"Apr 09, 2018","17.69","18.40","18.42","17.39","7.66M","-3.34%"
"Apr 10, 2018","17.66","17.93","17.93","17.32","6.60M","-0.17%"
"Apr 11, 2018","17.96","17.54","18.04","17.44","3.77M","1.67%"
"Apr 12, 2018","18.58","18.08","18.63","17.78","4.75M","3.46%"
"Apr 13, 2018","18.03","18.40","18.53","17.82","7.03M","-2.97%"
"Apr 16, 2018","17.93","18.03","18.27","17.74","4.60M","-0.55%"
"Apr 17, 2018","18.21","17.79","18.54","17.76","5.32M","1.59%"
"Apr 18, 2018","18.49","18.21","18.68","18.21","4.59M","1.52%"
"Apr 19, 2018","18.53","18.49","18.54","18.15","3.23M","0.21%"
"Apr 20, 2018","18.76","18.29","18.76","18.29","6.80M","1.28%"
"Apr 23, 2018","19.40","19.02","19.46","18.88","8.95M","3.36%"
"Apr 24, 2018","19.40","19.36","19.65","19.21","7.20M","0.00%"
"Apr 25, 2018","19.17","19.22","19.27","18.77","4.86M","-1.17%"
"Apr 26, 2018","19.37","19.34","19.55","19.16","4.98M","1.03%"
"Apr 27, 2018","19.54","19.42","19.69","19.31","2.97M","0.92%"
"Apr 30, 2018","19.66","19.55","19.69","19.39","3.50M","0.61%"
"May 02, 2018","18.84","19.47","19.55","18.84","4.44M","-4.16%"
"May 03, 2018","18.24","18.83","18.85","18.08","4.88M","-3.19%"
"May 04, 2018","18.16","18.08","18.47","17.93","3.19M","-0.43%"
"May 07, 2018","18.09","17.99","18.57","17.99","2.89M","-0.38%"
"May 08, 2018","18.33","18.04","18.45","17.89","2.76M","1.31%"
"May 09, 2018","18.43","18.43","18.53","18.08","3.51M","0.54%"
"May 10, 2018","18.81","18.38","18.82","18.22","3.58M","2.09%"
"May 11, 2018","19.35","19.32","20.36","18.90","11.59M","2.83%"
"May 14, 2018","18.76","19.27","19.48","18.56","7.03M","-3.01%"
"May 15, 2018","18.32","18.38","18.50","17.95","4.89M","-2.36%"
"May 16, 2018","18.63","18.43","18.91","18.34","2.86M","1.67%"
"May 17, 2018","17.77","18.62","18.62","17.52","5.29M","-4.60%"
"May 18, 2018","17.74","17.35","17.85","16.88","6.12M","-0.17%"
"May 21, 2018","17.85","17.85","18.08","17.46","3.58M","0.61%"
"May 22, 2018","18.53","17.82","18.73","17.79","3.62M","3.81%"
"May 23, 2018","18.22","18.30","18.63","17.95","2.42M","-1.65%"
"May 24, 2018","18.62","18.13","18.76","17.71","3.74M","2.16%"
"May 25, 2018","18.05","18.58","18.58","17.89","3.93M","-3.07%"
"May 28, 2018","17.08","17.78","17.78","16.91","4.73M","-5.35%"
"May 29, 2018","17.17","17.28","17.53","16.69","4.94M","0.52%"
"May 30, 2018","17.51","17.00","17.51","16.87","5.70M","2.01%"
"Jun 01, 2018","17.90","17.50","18.04","17.21","2.82M","2.19%"
"Jun 04, 2018","17.88","17.95","18.15","17.78","2.71M","-0.11%"
"Jun 05, 2018","16.75","17.64","17.73","16.68","4.19M","-6.28%"
"Jun 06, 2018","15.76","16.58","16.58","15.74","6.41M","-5.94%"
"Jun 07, 2018","15.37","15.09","15.57","13.86","14.97M","-2.44%"
"Jun 08, 2018","15.96","15.51","16.28","14.79","6.18M","3.78%"
"Jun 11, 2018","15.55","15.97","16.19","15.45","3.62M","-2.53%"
"Jun 12, 2018","15.22","15.51","15.66","15.13","4.16M","-2.15%"
"Jun 13, 2018","15.17","15.22","15.32","14.64","4.21M","-0.32%"
"Jun 14, 2018","15.37","15.26","15.92","15.13","6.10M","1.36%"
"Jun 15, 2018","15.06","15.28","15.51","14.85","6.72M","-2.05%"
"Jun 18, 2018","14.75","14.84","15.01","14.69","2.75M","-2.03%"
"Jun 19, 2018","15.62","14.73","15.75","14.69","4.29M","5.88%"
"Jun 20, 2018","15.85","15.91","16.15","15.67","4.04M","1.45%"
"Jun 21, 2018","15.47","15.61","15.85","15.33","3.01M","-2.36%"
"Jun 22, 2018","15.68","15.47","15.79","15.11","3.12M","1.34%"
"Jun 25, 2018","15.86","15.57","15.99","15.17","4.82M","1.13%"
"Jun 26, 2018","15.76","15.85","15.89","15.46","3.17M","-0.62%"
"Jun 27, 2018","15.18","15.65","15.75","15.04","4.08M","-3.69%"
"Jun 28, 2018","15.68","15.18","15.76","15.11","3.17M","3.31%"
"Jun 29, 2018","16.43","15.80","16.43","15.80","4.84M","4.78%"
"Jul 02, 2018","16.07","16.39","16.39","16.00","2.19M","-2.16%"
"Jul 03, 2018","16.25","16.22","16.80","16.08","3.26M","1.10%"
"Jul 04, 2018","16.40","16.20","16.44","16.11","1.33M","0.91%"
"Jul 05, 2018","16.48","16.41","16.63","16.24","2.80M","0.48%"
"Jul 06, 2018","16.61","16.46","16.74","16.39","2.00M","0.78%"
"Jul 10, 2018","16.70","16.73","16.85","16.45","2.88M","0.59%"
"Jul 11, 2018","16.46","16.53","16.81","16.32","3.73M","-1.47%"
"Jul 12, 2018","16.85","16.40","16.99","16.40","3.62M","2.40%"
"Jul 13, 2018","17.36","16.94","17.36","16.55","3.44M","2.98%"
"Jul 16, 2018","17.26","17.30","17.64","16.96","4.39M","-0.57%"
"Jul 17, 2018","17.96","17.24","18.13","17.06","8.08M","4.05%"
"Jul 18, 2018","17.97","18.05","18.41","17.83","3.44M","0.05%"
"Jul 19, 2018","17.86","17.69","17.94","17.28","7.45M","-0.60%"
"Jul 20, 2018","18.14","18.42","18.61","18.10","4.64M","1.60%"
"Jul 23, 2018","17.96","17.95","18.11","17.86","2.34M","-1.03%"
"Jul 24, 2018","18.02","18.08","18.33","17.75","2.47M","0.33%"
"Jul 25, 2018","18.32","18.00","18.43","18.00","2.54M","1.70%"
"Jul 26, 2018","17.67","18.14","18.41","17.64","1.91M","-3.55%"
"Jul 27, 2018","17.69","17.71","17.98","17.55","1.74M","0.11%"
"Jul 30, 2018","17.77","17.85","17.91","17.59","926.90K","0.45%"
"Jul 31, 2018","17.88","17.62","17.92","17.51","2.91M","0.61%"
"Aug 01, 2018","17.91","17.88","18.13","17.65","2.37M","0.17%"
"Aug 02, 2018","17.80","17.69","17.92","17.60","1.47M","-0.61%"
"Aug 03, 2018","18.21","17.84","18.45","17.77","2.58M","2.33%"
"Aug 06, 2018","18.23","18.28","18.41","18.11","1.63M","0.11%"
"Aug 07, 2018","18.12","18.23","18.96","18.12","4.79M","-0.59%"
"Aug 08, 2018","17.80","17.98","18.48","17.77","2.97M","-1.79%"
"Aug 09, 2018","17.59","17.96","17.99","17.55","3.40M","-1.16%"
"Aug 10, 2018","16.26","17.00","17.15","16.07","13.92M","-7.56%"
"Aug 13, 2018","16.41","16.21","16.54","15.73","5.39M","0.91%"
"Aug 14, 2018","16.95","16.62","16.97","16.49","3.16M","3.30%"
"Aug 15, 2018","16.59","16.90","16.90","16.42","5.13M","-2.15%"
"Aug 16, 2018","16.51","16.70","16.73","16.36","3.65M","-0.48%"
"Aug 17, 2018","16.20","16.22","16.42","15.87","4.46M","-1.85%"
"Aug 20, 2018","16.28","16.01","16.36","15.74","4.12M","0.49%"
"Aug 21, 2018","15.42","16.14","16.26","15.42","4.71M","-5.27%"
"Aug 22, 2018","15.68","15.43","15.69","15.01","6.58M","1.66%"
"Aug 23, 2018","15.12","15.58","15.77","14.91","6.47M","-3.58%"
"Aug 24, 2018","15.21","15.31","15.35","14.92","5.96M","0.59%"
"Aug 27, 2018","15.65","15.23","15.77","15.23","3.94M","2.92%"
"Aug 28, 2018","15.53","15.77","15.77","15.25","3.01M","-0.76%"
"Aug 29, 2018","15.62","15.54","15.99","15.54","2.44M","0.57%"
"Aug 30, 2018","15.20","15.57","15.58","15.08","2.56M","-2.71%"
"Aug 31, 2018","15.37","15.13","15.42","15.13","3.63M","1.17%"
"Sep 03, 2018","15.08","15.19","15.28","15.03","1.86M","-1.92%"
"Sep 04, 2018","14.55","15.02","15.13","14.46","5.95M","-3.53%"
"Sep 05, 2018","14.68","14.68","14.89","14.50","2.75M","0.95%"
"Sep 06, 2018","14.91","14.88","14.96","14.68","4.58M","1.54%"
"Sep 10, 2018","14.94","15.03","15.17","14.72","1.99M","0.20%"
"Sep 11, 2018","14.53","14.65","14.82","14.40","3.47M","-2.77%"
"Sep 12, 2018","14.40","14.68","14.76","14.22","6.75M","-0.88%"
"Sep 13, 2018","14.08","14.45","14.61","14.02","3.96M","-2.19%"
"Sep 14, 2018","14.33","14.19","14.37","14.05","3.56M","1.75%"
"Sep 17, 2018","14.65","14.28","14.78","14.21","3.22M","2.27%"
"Sep 18, 2018","15.16","14.77","15.23","14.56","4.26M","3.43%"
"Sep 19, 2018","15.05","15.07","15.41","14.69","4.09M","-0.72%"
"Sep 20, 2018","14.67","15.16","15.30","14.67","2.39M","-2.49%"
"Sep 21, 2018","15.52","14.82","15.63","14.74","5.66M","5.78%"
"Sep 24, 2018","15.01","15.46","15.73","14.97","2.86M","-3.30%"
"Sep 25, 2018","14.96","14.73","14.99","14.59","4.20M","-0.33%"
"Sep 26, 2018","15.04","15.05","15.24","14.82","4.51M","0.53%"
"Sep 27, 2018","15.67","15.13","15.72","15.13","5.53M","4.19%"
"Sep 28, 2018","15.64","15.44","15.85","15.32","8.02M","-0.19%"
"Oct 01, 2018","15.28","15.64","15.70","15.00","2.89M","-2.33%"
"Oct 02, 2018","15.75","15.76","15.99","15.67","4.73M","3.10%"
"Oct 03, 2018","16.63","16.80","16.90","16.35","11.67M","5.57%"
"Oct 04, 2018","16.85","16.32","16.97","15.92","5.41M","1.36%"
"Oct 05, 2018","16.80","16.98","17.25","16.58","6.97M","-0.29%"
"Oct 08, 2018","17.73","18.02","18.35","17.14","10.43M","5.51%"
"Oct 09, 2018","17.69","17.72","17.91","17.38","6.30M","-0.22%"
"Oct 10, 2018","16.95","17.49","17.60","16.85","3.79M","-4.18%"
"Oct 11, 2018","16.88","17.12","17.34","16.57","3.08M","-0.41%"
"Oct 15, 2018","16.95","17.33","17.39","16.76","3.57M","0.41%"
"Oct 16, 2018","17.54","17.17","17.54","17.02","4.78M","3.49%"
"Oct 17, 2018","17.68","17.39","17.87","17.29","3.19M","0.79%"
"Oct 18, 2018","17.53","17.52","17.67","17.39","1.69M","-0.84%"
"Oct 19, 2018","17.29","17.73","17.86","17.17","3.15M","-1.41%"
"Oct 22, 2018","17.35","17.37","17.64","17.11","5.84M","0.34%"
"Oct 23, 2018","17.20","17.09","17.42","16.89","4.55M","-0.85%"
"Oct 24, 2018","16.91","17.20","17.56","16.81","3.31M","-1.66%"
"Oct 25, 2018","17.15","16.99","17.57","16.92","3.60M","1.40%"
"Oct 26, 2018","17.28","17.25","17.44","16.93","4.88M","0.75%"
"Oct 29, 2018","17.10","18.13","18.43","16.84","5.71M","-1.03%"
"Oct 30, 2018","18.05","17.35","18.05","17.11","4.84M","5.59%"
"Oct 31, 2018","18.53","18.08","18.53","17.94","9.71M","2.62%"
"Nov 01, 2018","18.13","18.51","18.71","17.53","16.73M","-2.13%"
"Nov 05, 2018","17.74","18.12","18.18","17.70","4.96M","-2.17%"
"Nov 06, 2018","17.38","17.69","17.69","17.24","8.05M","-2.00%"
"Nov 07, 2018","17.35","17.44","17.68","17.08","7.45M","-0.23%"
"Nov 08, 2018","16.86","17.54","17.57","16.66","5.25M","-2.78%"
"Nov 09, 2018","17.01","16.86","17.16","16.68","3.47M","0.88%"
"Nov 12, 2018","17.04","16.92","17.22","16.81","2.27M","0.17%"
"Nov 13, 2018","17.32","17.04","17.53","16.88","4.39M","1.62%"
"Nov 14, 2018","17.59","17.51","17.65","17.11","6.39M","1.59%"
"Nov 16, 2018","17.78","17.64","17.79","17.46","4.74M","1.06%"
"Nov 19, 2018","17.53","17.61","17.70","17.29","2.55M","-1.39%"
"Nov 21, 2018","17.66","17.35","17.82","17.11","3.28M","0.73%"
"Nov 22, 2018","17.87","17.54","17.87","17.54","1.59M","1.17%"
"Nov 23, 2018","17.80","17.79","17.89","17.65","2.91M","-0.39%"
"Nov 26, 2018","17.62","17.92","18.18","17.36","3.93M","-1.00%"
"Nov 27, 2018","18.22","17.77","18.27","17.54","4.69M","3.41%"
"Nov 28, 2018","19.40","18.06","19.42","18.06","8.60M","6.44%"
"Nov 29, 2018","19.69","19.12","19.71","19.08","4.07M","1.52%"
"Nov 30, 2018","19.42","19.48","19.70","19.30","6.71M","-1.35%"
"Dec 03, 2018","19.48","19.70","19.70","19.24","6.27M","0.30%"
"Dec 04, 2018","19.29","19.48","19.59","18.85","4.51M","-1.01%"
"Dec 05, 2018","19.49","19.32","19.60","19.23","2.89M","1.07%"
"Dec 06, 2018","19.52","19.12","19.62","19.08","3.08M","0.15%"
"Dec 07, 2018","19.19","19.52","19.65","19.07","3.43M","-1.72%"
"Dec 10, 2018","18.70","19.20","19.28","18.64","2.54M","-2.57%"
"Dec 11, 2018","19.10","18.97","19.58","18.70","5.57M","2.16%"
"Dec 12, 2018","19.51","19.30","19.84","19.19","6.78M","2.17%"
"Dec 13, 2018","19.66","19.49","19.73","19.22","2.46M","0.76%"
"Dec 14, 2018","19.57","19.45","19.82","19.34","1.89M","-0.45%"
"Dec 17, 2018","19.17","19.47","19.60","19.08","2.53M","-2.06%"
"Dec 18, 2018","18.96","19.23","19.37","18.86","5.07M","-1.08%"
"Dec 19, 2018","18.84","19.09","19.22","18.74","17.52M","-0.62%"
"Dec 20, 2018","18.77","19.07","19.18","18.59","3.49M","-0.37%"
"Dec 21, 2018","19.00","18.91","19.00","18.65","6.56M","1.21%"
"Dec 26, 2018","18.78","18.73","18.94","18.55","2.71M","-1.14%"
"Dec 27, 2018","18.88","18.59","18.89","18.55","2.52M","0.52%"
"Dec 28, 2018","19.42","19.09","19.46","18.91","4.18M","2.82%"
"Jan 02, 2019","19.43","19.42","19.61","19.10","7.16M","0.10%"
"Jan 03, 2019","19.38","19.19","19.45","19.03","5.12M","-0.30%"
"Jan 04, 2019","19.13","19.25","19.40","18.83","4.44M","-1.27%"
"Jan 07, 2019","19.77","19.42","19.91","19.37","5.82M","3.34%"
"Jan 08, 2019","19.80","19.77","20.03","19.59","4.50M","0.15%"
"Jan 09, 2019","20.58","19.82","20.76","19.80","7.19M","3.95%"
"Jan 10, 2019","20.56","20.34","20.73","20.31","3.52M","-0.10%"
"Jan 11, 2019","20.28","20.56","20.56","20.15","3.78M","-1.35%"
"Jan 14, 2019","20.27","20.28","20.43","19.93","2.94M","-0.05%"
"Jan 15, 2019","20.13","20.15","20.36","20.00","2.75M","-0.68%"
"Jan 16, 2019","20.16","20.15","20.24","19.98","3.77M","0.15%"
"Jan 17, 2019","20.25","20.19","20.42","20.01","5.41M","0.44%"
"Jan 18, 2019","20.21","20.28","20.54","20.00","4.16M","-0.20%"
"Jan 21, 2019","19.76","20.05","20.17","19.50","2.79M","-2.25%"
"Jan 22, 2019","19.31","19.69","19.73","19.10","5.01M","-2.25%"
"Jan 23, 2019","19.79","19.40","19.80","19.28","5.19M","2.46%"
"Jan 24, 2019","20.24","19.85","20.24","19.69","5.10M","2.30%"
"Jan 28, 2019","20.21","20.24","20.43","20.00","6.87M","-0.15%"
"Jan 29, 2019","20.45","20.28","20.67","20.23","5.49M","1.17%"
"Jan 30, 2019","20.35","20.48","20.60","20.07","3.28M","-0.48%"
"Jan 31, 2019","20.85","20.48","20.85","20.16","5.80M","2.43%"
"Feb 01, 2019","20.35","20.73","21.09","20.10","7.93M","-2.37%"
"Feb 04, 2019","20.41","20.33","20.57","20.00","3.52M","0.29%"
"Feb 05, 2019","20.48","20.38","20.58","20.11","3.81M","0.34%"
"Feb 06, 2019","19.89","20.11","20.43","19.82","7.27M","-2.90%"
"Feb 07, 2019","19.99","19.94","20.33","19.75","3.64M","0.55%"
"Feb 08, 2019","20.21","19.80","20.28","19.65","2.73M","1.09%"
"Feb 11, 2019","20.35","20.07","20.48","19.82","2.30M","0.69%"
"Feb 12, 2019","19.71","20.51","20.51","19.30","11.82M","-3.16%"
"Feb 13, 2019","19.30","19.79","20.02","19.11","8.11M","-2.06%"
"Feb 14, 2019","19.69","19.47","19.69","18.93","4.43M","2.00%"
"Feb 15, 2019","19.30","19.68","19.77","19.20","3.56M","-1.96%"
"Feb 18, 2019","19.54","19.24","19.57","19.10","2.66M","1.23%"
"Feb 19, 2019","19.63","19.57","19.71","19.40","4.95M","0.46%"
"Feb 20, 2019","19.17","19.59","19.76","19.13","4.21M","-2.32%"
"Feb 21, 2019","19.02","19.31","19.43","18.89","2.78M","-0.83%"
"Feb 22, 2019","19.22","19.15","19.28","18.83","5.25M","1.09%"
"Feb 25, 2019","18.83","19.29","19.42","18.77","3.65M","-2.06%"
"Feb 26, 2019","19.06","18.85","19.23","18.83","3.60M","1.21%"
"Feb 27, 2019","19.60","18.95","19.61","18.78","6.30M","2.86%"
"Feb 28, 2019","19.70","19.46","19.86","19.24","7.45M","0.50%"
"Mar 01, 2019","19.46","19.69","19.75","19.39","3.99M","-1.21%"
"Mar 06, 2019","19.30","19.36","19.63","19.15","2.36M","-0.81%"
"Mar 07, 2019","19.15","19.24","19.30","18.91","3.08M","-0.77%"
"Mar 08, 2019","19.59","19.13","19.64","18.80","3.43M","2.27%"
"Mar 11, 2019","20.06","19.59","20.21","19.50","3.71M","2.42%"
"Mar 12, 2019","19.59","19.97","19.99","19.40","3.26M","-2.37%"
"Mar 13, 2019","19.63","19.57","19.89","19.39","4.34M","0.20%"
"Mar 14, 2019","19.41","19.54","19.63","19.34","2.17M","-1.11%"
"Mar 15, 2019","19.52","19.37","19.56","19.10","4.47M","0.56%"
"Mar 18, 2019","19.38","19.72","19.72","19.32","4.66M","-0.71%"
"Mar 19, 2019","19.63","19.52","19.65","19.29","6.05M","1.28%"
"Mar 20, 2019","19.14","19.54","19.57","19.14","4.73M","-2.47%"
"Mar 21, 2019","18.08","19.09","19.14","17.72","20.50M","-5.58%"
"Mar 22, 2019","16.61","17.66","17.71","16.61","16.57M","-8.10%"
"Mar 25, 2019","16.31","16.82","17.08","16.09","9.53M","-1.79%"
"Mar 26, 2019","16.37","16.60","16.65","16.32","11.16M","0.36%"
"Mar 27, 2019","15.62","16.22","16.35","15.62","13.99M","-4.59%"
"Mar 28, 2019","16.00","15.66","16.13","15.16","12.82M","2.41%"
"Mar 29, 2019","16.59","16.26","16.72","15.90","10.72M","3.71%"
"Apr 01, 2019","16.83","16.71","16.94","16.45","7.63M","1.43%"
"Apr 02, 2019","16.60","16.94","17.01","16.34","4.38M","-1.35%"
"Apr 03, 2019","16.33","16.72","16.77","16.33","6.97M","-1.61%"
"Apr 04, 2019","16.53","16.34","16.75","16.23","3.91M","1.21%"
"Apr 05, 2019","16.52","16.69","16.86","16.32","3.83M","-0.06%"
"Apr 08, 2019","15.92","16.54","16.61","15.87","6.34M","-3.65%"
"Apr 09, 2019","15.52","15.93","16.01","15.38","11.36M","-2.49%"
"Apr 10, 2019","15.24","15.59","15.66","15.24","6.36M","-1.85%"
"Apr 11, 2019","15.38","15.24","15.50","14.88","7.77M","0.97%"
"Apr 12, 2019","15.09","15.22","15.37","14.75","11.22M","-1.93%"
"Apr 15, 2019","15.14","15.29","15.30","14.90","5.83M","0.33%"
"Apr 16, 2019","15.02","15.14","15.24","14.87","4.86M","-0.78%"
"Apr 17, 2019","14.80","15.05","15.16","14.51","10.08M","-1.45%"
"Apr 18, 2019","15.03","14.93","15.41","14.85","8.30M","1.54%"
"Apr 22, 2019","15.28","15.10","15.38","15.00","10.11M","1.65%"
"Apr 23, 2019","15.05","15.47","15.52","14.99","7.86M","-1.49%"
"Apr 24, 2019","14.79","15.16","15.16","14.64","6.49M","-1.71%"
"Apr 25, 2019","15.21","14.76","15.21","14.65","9.56M","2.81%"
"Apr 26, 2019","15.28","15.25","15.36","15.10","4.51M","0.46%"
"Apr 29, 2019","15.30","15.37","15.43","15.05","3.78M","0.13%"
"Apr 30, 2019","15.55","15.38","15.67","15.15","8.41M","1.68%"
"May 02, 2019","15.39","15.52","15.55","15.30","2.90M","-1.02%"
"May 03, 2019","15.53","15.50","15.66","15.34","4.19M","0.90%"
"May 06, 2019","15.41","15.34","15.48","15.24","3.10M","-0.76%"
"May 07, 2019","14.92","15.33","15.34","14.92","5.18M","-3.21%"
"May 08, 2019","15.14","14.94","15.39","14.94","6.05M","1.46%"
"May 09, 2019","15.58","15.24","15.58","14.92","6.68M","2.94%"
"May 10, 2019","15.00","15.24","15.34","14.85","13.12M","-3.75%"
"May 13, 2019","14.74","14.86","14.87","14.51","8.36M","-1.72%"
"May 14, 2019","14.94","14.87","14.97","14.74","6.28M","1.34%"
"May 15, 2019","14.96","14.74","14.99","14.60","4.04M","0.13%"
"May 16, 2019","14.59","14.85","14.89","14.43","9.11M","-2.45%"
"May 17, 2019","14.42","14.55","14.99","14.42","4.68M","-1.15%"
"May 20, 2019","15.14","14.54","15.35","14.50","5.47M","4.94%"
"May 21, 2019","15.38","15.14","15.41","14.95","5.74M","1.63%"
"May 22, 2019","15.21","15.34","15.38","15.12","3.15M","-1.16%"
"May 23, 2019","14.94","15.04","15.22","14.84","4.48M","-1.76%"
"May 24, 2019","14.94","15.00","15.03","14.78","5.02M","0.00%"
"May 27, 2019","15.13","15.09","15.29","14.91","2.29M","1.26%"
"May 28, 2019","15.52","15.24","15.56","15.13","6.96M","2.62%"
"May 29, 2019","16.01","15.40","16.01","15.35","5.17M","3.12%"
"May 30, 2019","16.25","16.04","16.31","15.80","5.04M","1.48%"
"May 31, 2019","15.97","16.21","16.35","15.76","6.00M","-1.71%"
"Jun 03, 2019","15.55","16.03","16.20","15.40","4.70M","-2.60%"
"Jun 04, 2019","15.68","15.63","15.77","15.48","2.38M","0.83%"
"Jun 05, 2019","15.28","15.73","15.97","15.21","3.53M","-2.59%"
"Jun 06, 2019","15.36","15.43","15.58","15.15","2.31M","0.58%"
"Jun 07, 2019","15.73","15.43","15.88","15.29","2.53M","2.38%"
"Jun 10, 2019","16.06","15.68","16.08","15.63","2.20M","2.08%"
"Jun 11, 2019","15.92","16.10","16.17","15.79","3.19M","-0.86%"
"Jun 12, 2019","15.61","15.86","15.87","15.55","3.66M","-1.93%"
"Jun 13, 2019","15.92","15.73","16.12","15.73","3.85M","1.96%"
"Jun 14, 2019","15.91","15.87","16.02","15.57","3.28M","-0.06%"
"Jun 17, 2019","15.73","15.88","16.02","15.73","3.14M","-1.12%"
"Jun 18, 2019","15.81","15.79","15.97","15.74","3.17M","0.50%"
"Jun 19, 2019","16.03","15.84","16.07","15.61","4.71M","1.38%"
"Jun 21, 2019","16.39","16.07","16.39","16.07","5.39M","2.28%"
"Jun 24, 2019","16.37","16.40","16.62","16.28","4.38M","-0.12%"
"Jun 25, 2019","15.95","16.53","16.55","15.93","3.29M","-2.60%"
"Jun 26, 2019","16.15","16.08","16.27","15.97","2.63M","1.24%"
"Jun 27, 2019","16.22","15.95","16.27","15.81","2.93M","0.43%"
"Jun 28, 2019","16.29","16.37","16.45","16.24","2.89M","0.49%"
"Jul 01, 2019","15.83","16.42","16.47","15.83","5.74M","-2.85%"
"Jul 02, 2019","15.73","15.89","15.97","15.55","3.34M","-0.63%"
"Jul 03, 2019","15.73","15.74","15.89","15.45","4.12M","0.00%"
"Jul 04, 2019","16.21","15.88","16.32","15.81","4.47M","3.02%"
"Jul 05, 2019","16.44","16.23","16.55","16.07","3.22M","1.47%"
"Jul 08, 2019","16.51","16.44","16.52","16.27","3.30M","0.42%"
"Jul 10, 2019","17.20","16.63","17.20","16.62","8.71M","4.13%"
"Jul 11, 2019","17.07","17.20","17.39","16.93","5.53M","-0.75%"
"Jul 12, 2019","16.83","17.21","17.29","16.78","4.84M","-1.39%"
"Jul 15, 2019","16.62","16.82","16.94","16.48","3.61M","-1.23%"
"Jul 16, 2019","16.28","16.65","16.66","16.27","3.31M","-2.02%"
"Jul 17, 2019","16.88","16.63","16.91","16.40","4.39M","3.65%"
"Jul 18, 2019","17.31","16.94","17.31","16.94","6.59M","2.58%"
"Jul 19, 2019","16.99","17.33","17.42","16.89","3.95M","-1.89%"
"Jul 22, 2019","16.84","16.96","17.13","16.53","3.80M","-0.87%"
"Jul 23, 2019","16.59","16.72","16.89","16.54","3.08M","-1.47%"
"Jul 24, 2019","16.70","16.71","16.89","16.61","2.45M","0.66%"
"Jul 25, 2019","16.68","16.72","16.81","16.47","2.84M","-0.12%"
"Jul 26, 2019","17.03","16.69","17.15","16.64","3.41M","2.08%"
"Jul 29, 2019","17.31","16.90","17.31","16.90","3.19M","1.69%"
"Jul 30, 2019","17.24","17.15","17.38","17.12","2.22M","-0.40%"
"Jul 31, 2019","17.96","17.90","18.06","17.57","10.65M","4.13%"
"Aug 01, 2019","18.66","18.11","18.92","18.01","13.39M","3.91%"
"Aug 02, 2019","18.74","18.70","18.87","18.24","4.74M","0.42%"
"Aug 05, 2019","18.01","18.25","18.39","17.89","3.93M","-3.91%"
"Aug 06, 2019","18.15","18.10","18.19","17.65","5.88M","0.82%"
"Aug 07, 2019","17.72","17.73","17.89","17.37","5.26M","-2.40%"
"Aug 08, 2019","17.81","17.72","17.96","17.63","7.10M","0.50%"
"Aug 09, 2019","18.99","17.96","19.25","17.96","13.25M","6.61%"
"Aug 12, 2019","18.45","18.67","18.86","18.34","4.58M","-2.81%"
"Aug 13, 2019","18.46","18.16","18.85","18.16","5.61M","0.05%"
"Aug 14, 2019","17.67","18.35","18.35","17.65","9.56M","-4.29%"
"Aug 15, 2019","17.44","17.62","18.08","17.22","5.02M","-1.29%"
"Aug 16, 2019","17.79","17.71","17.93","17.24","4.16M","1.99%"
"Aug 19, 2019","17.56","18.01","18.18","17.36","3.95M","-1.28%"
"Aug 20, 2019","17.68","17.21","17.98","16.84","8.56M","0.68%"
"Aug 21, 2019","17.60","17.91","18.09","17.44","4.66M","-0.45%"
"Aug 22, 2019","17.06","17.61","17.67","17.06","3.64M","-3.09%"
"Aug 23, 2019","16.47","16.89","17.17","16.44","4.52M","-3.42%"
"Aug 26, 2019","16.42","16.64","16.91","16.33","4.33M","-0.30%"
"Aug 27, 2019","16.77","16.62","16.89","16.24","7.10M","2.11%"
"Aug 28, 2019","17.05","16.71","17.07","16.57","2.51M","1.65%"
"Aug 29, 2019","17.82","17.15","17.93","16.93","4.49M","4.53%"
"Aug 30, 2019","18.53","18.21","18.71","18.11","9.69M","4.00%"
"Sep 02, 2019","18.40","18.53","18.69","18.32","3.15M","-0.69%"
"Sep 03, 2019","18.43","18.46","19.06","18.26","5.52M","0.16%"
"Sep 04, 2019","18.84","18.75","18.95","18.57","3.98M","2.20%"
"Sep 05, 2019","18.78","18.90","19.15","18.73","3.72M","-0.32%"
"Sep 06, 2019","18.55","18.77","18.97","18.47","2.70M","-1.21%"
"Sep 09, 2019","18.25","18.61","18.87","18.15","3.42M","-1.60%"
"Sep 10, 2019","17.67","17.65","17.99","17.54","7.47M","-3.20%"
"Sep 11, 2019","18.59","17.97","18.77","17.84","4.92M","5.21%"
"Sep 12, 2019","18.66","18.73","18.86","18.45","3.02M","0.37%"
"Sep 13, 2019","18.24","18.57","18.65","18.17","3.05M","-2.23%"
"Sep 16, 2019","18.48","18.24","18.60","17.89","2.01M","1.30%"
"Sep 17, 2019","18.95","18.25","18.95","18.25","3.14M","2.52%"
"Sep 18, 2019","18.95","18.88","19.10","18.76","3.54M","0.00%"
"Sep 19, 2019","19.46","19.20","19.59","19.15","5.99M","2.72%"
"Sep 20, 2019","19.49","19.56","19.63","19.23","6.53M","0.15%"
"Sep 23, 2019","19.34","19.39","19.47","19.23","1.89M","-0.76%"
"Sep 24, 2019","19.61","19.49","19.78","19.31","4.77M","1.38%"
"Sep 25, 2019","19.83","19.60","19.83","19.44","5.23M","1.11%"
"Sep 26, 2019","19.81","19.75","19.96","19.66","1.93M","-0.10%"
"Sep 27, 2019","19.68","19.81","19.83","19.56","1.94M","-0.65%"
"Sep 30, 2019","19.75","19.68","19.89","19.58","4.11M","0.35%"
"Oct 01, 2019","19.51","19.77","19.79","19.42","2.91M","-1.20%"
"Oct 02, 2019","19.21","19.42","19.45","19.00","4.33M","-1.52%"
"Oct 03, 2019","18.98","19.09","19.22","18.64","6.52M","-1.24%"
"Oct 04, 2019","19.57","19.03","19.59","18.80","2.88M","3.13%"
"Oct 07, 2019","19.35","19.36","19.61","19.19","2.83M","-1.11%"
"Oct 08, 2019","19.05","19.41","19.62","18.94","2.19M","-1.58%"
"Oct 09, 2019","19.55","19.19","19.58","19.10","2.44M","2.65%"
"Oct 10, 2019","19.48","19.58","19.66","19.25","1.77M","-0.35%"
"Oct 11, 2019","20.37","19.65","20.38","19.49","4.92M","4.57%"
"Oct 14, 2019","20.68","20.28","20.95","20.18","4.25M","1.51%"
"Oct 15, 2019","20.96","20.77","21.06","20.52","2.75M","1.39%"
"Oct 16, 2019","21.08","20.88","21.19","20.59","3.31M","0.57%"
"Oct 17, 2019","20.89","21.08","21.36","20.88","2.39M","-0.94%"
"Oct 18, 2019","20.91","21.03","21.06","20.73","1.53M","0.09%"
"Oct 21, 2019","20.87","20.82","20.95","20.54","2.02M","-0.19%"
"Oct 22, 2019","20.67","20.87","21.07","20.61","5.20M","-0.95%"
"Oct 23, 2019","20.72","20.59","20.87","20.29","3.29M","0.24%"
"Oct 24, 2019","20.58","20.72","20.80","20.38","5.93M","-0.67%"
"Oct 25, 2019","20.24","20.58","20.65","20.24","1.90M","-1.63%"
"Oct 28, 2019","20.25","20.15","20.58","20.04","2.19M","0.05%"
"Oct 29, 2019","20.15","20.22","20.67","20.07","3.84M","-0.49%"
"Oct 30, 2019","20.43","20.19","20.76","19.86","9.17M","1.37%"
"Oct 31, 2019","19.78","20.83","20.83","19.78","6.44M","-3.20%"
"Nov 01, 2019","20.17","19.71","20.39","19.71","7.37M","2.00%"
"Nov 04, 2019","19.99","20.13","20.44","19.96","3.81M","-0.93%"
"Nov 05, 2019","19.82","19.94","20.18","19.58","3.90M","-0.84%"
"Nov 06, 2019","20.27","19.81","20.27","19.60","2.82M","2.30%"
"Nov 07, 2019","20.11","20.30","20.36","19.95","2.07M","-0.78%"
"Nov 08, 2019","19.22","19.97","20.09","19.07","7.86M","-4.43%"
"Nov 11, 2019","19.66","19.09","19.77","18.91","5.93M","2.26%"
"Nov 12, 2019","19.29","19.57","19.60","19.05","4.76M","-1.86%"
"Nov 13, 2019","19.35","19.25","19.61","19.00","4.74M","0.31%"
"Nov 14, 2019","19.78","19.34","19.84","19.34","3.32M","2.20%"
"Nov 18, 2019","19.47","20.03","20.04","19.46","2.58M","-1.55%"
"Nov 19, 2019","19.76","19.59","19.79","19.54","2.64M","1.47%"
"Nov 21, 2019","20.18","19.75","20.28","19.73","4.80M","2.15%"
"Nov 22, 2019","20.12","20.10","20.28","19.99","4.20M","-0.29%"
"Nov 25, 2019","20.38","20.12","20.43","19.89","3.59M","1.28%"
"Nov 26, 2019","20.25","20.10","20.33","19.89","7.61M","-0.63%"
"Nov 27, 2019","21.08","20.25","21.08","20.16","6.24M","4.10%"
"Nov 28, 2019","21.75","21.08","21.76","21.03","5.22M","3.14%"
"Nov 29, 2019","22.04","21.73","22.08","21.63","6.52M","1.36%"
"Dec 02, 2019","22.49","22.03","22.64","21.85","5.98M","2.02%"
"Dec 03, 2019","22.76","22.59","23.04","22.32","9.60M","1.19%"
"Dec 04, 2019","22.87","22.73","22.90","22.63","5.36M","0.52%"
"Dec 05, 2019","22.79","22.87","22.91","22.62","3.63M","-0.35%"
"Dec 06, 2019","24.41","22.76","24.41","22.66","11.05M","7.07%"
"Dec 09, 2019","24.80","24.26","24.80","24.09","6.83M","1.62%"
"Dec 10, 2019","24.84","24.84","25.04","24.55","3.49M","0.13%"
"Dec 11, 2019","24.69","24.77","24.82","24.49","4.82M","-0.60%"
"Dec 12, 2019","26.18","24.87","26.31","24.83","7.91M","6.03%"
"Dec 13, 2019","26.73","26.41","26.88","26.25","7.40M","2.10%"
"Dec 16, 2019","26.49","26.98","27.07","26.31","4.46M","-0.90%"
"Dec 17, 2019","25.86","26.51","26.51","25.59","5.53M","-2.38%"
"Dec 18, 2019","25.69","25.80","26.17","25.50","9.41M","-0.66%"
"Dec 19, 2019","25.84","25.58","25.87","25.37","5.56M","0.58%"
"Dec 20, 2019","26.13","25.96","26.13","25.45","6.43M","1.12%"
"Dec 23, 2019","26.39","26.44","26.68","26.20","3.33M","0.99%"
"Dec 26, 2019","26.64","26.63","26.79","26.40","2.33M","0.95%"
"Dec 27, 2019","26.08","26.79","26.79","25.83","5.33M","-2.10%"
"Dec 30, 2019","25.90","26.17","26.20","25.63","3.53M","-0.69%"
"Jan 02, 2020","26.79","25.99","26.79","25.94","4.68M","3.43%"
"Jan 03, 2020","26.84","26.45","27.31","26.24","7.32M","0.19%"
"Jan 06, 2020","26.53","26.76","26.91","26.03","8.17M","-1.15%"
"Jan 07, 2020","26.00","26.52","26.59","25.82","5.41M","-2.00%"
"Jan 08, 2020","25.81","26.02","26.11","25.49","3.22M","-0.73%"
"Jan 09, 2020","26.51","25.85","26.51","25.76","5.78M","2.71%"
"Jan 10, 2020","26.46","26.64","26.76","26.19","5.63M","-0.19%"
"Jan 13, 2020","26.99","26.56","27.07","26.42","5.21M","2.02%"
"Jan 14, 2020","27.87","27.11","28.12","27.10","7.23M","3.26%"
"Jan 15, 2020","27.50","27.68","27.80","27.33","8.08M","-1.33%"
"Jan 16, 2020","27.85","27.90","28.10","27.42","5.87M","1.27%"
"Jan 17, 2020","28.33","28.00","28.33","27.67","5.26M","1.72%"
"Jan 20, 2020","29.01","28.16","29.15","27.93","4.29M","2.40%"
"Jan 21, 2020","29.01","28.86","29.31","28.75","7.80M","0.00%"
"Jan 22, 2020","28.52","29.32","29.32","28.26","3.76M","-1.69%"
"Jan 23, 2020","29.06","28.37","29.21","27.93","7.00M","1.89%"
"Jan 24, 2020","28.95","29.06","29.17","28.63","7.26M","-0.38%"
"Jan 27, 2020","28.22","28.26","28.50","28.00","3.29M","-2.52%"
"Jan 28, 2020","28.47","28.65","28.71","28.12","4.70M","0.89%"
"Jan 29, 2020","28.40","28.60","28.65","28.03","7.83M","-0.25%"
"Jan 30, 2020","27.71","28.00","28.13","26.92","9.94M","-2.43%"
"Jan 31, 2020","27.55","27.15","27.75","27.14","6.35M","-0.58%"
"Feb 03, 2020","27.30","27.55","27.77","27.30","4.52M","-0.91%"
"Feb 04, 2020","27.80","27.61","28.00","27.53","6.41M","1.83%"
"Feb 05, 2020","27.45","28.00","28.25","27.35","6.50M","-1.26%"
"Feb 06, 2020","26.69","27.80","27.80","26.39","8.93M","-2.77%"
"Feb 07, 2020","26.20","26.50","26.65","25.83","6.25M","-1.84%"
"Feb 10, 2020","25.99","26.05","26.72","25.42","7.70M","-0.80%"
"Feb 11, 2020","27.11","26.25","27.23","25.89","5.60M","4.31%"
"Feb 12, 2020","27.29","27.11","27.57","27.03","6.47M","0.66%"
"Feb 13, 2020","27.59","26.91","27.63","26.62","3.21M","1.10%"
"Feb 14, 2020","27.12","27.31","27.50","26.85","2.27M","-1.70%"
"Feb 17, 2020","27.43","27.25","27.91","26.97","3.54M","1.14%"
"Feb 18, 2020","27.30","27.32","27.41","26.83","2.27M","-0.47%"
"Feb 19, 2020","27.22","27.02","27.44","26.87","4.16M","-0.29%"
"Feb 20, 2020","26.84","27.10","27.12","26.60","3.54M","-1.40%"
"Feb 21, 2020","28.90","27.00","29.40","27.00","13.71M","7.68%"
"Feb 26, 2020","26.75","27.09","27.64","25.88","9.84M","-7.44%"
"Feb 27, 2020","26.03","26.04","27.10","25.62","8.67M","-2.69%"
"Feb 28, 2020","26.60","26.03","26.60","24.26","12.96M","2.19%"
"Mar 02, 2020","26.65","26.50","27.12","25.54","6.73M","0.19%"
"Mar 03, 2020","27.09","26.80","28.31","26.41","9.09M","1.65%"
"Mar 04, 2020","27.70","28.01","28.10","27.08","6.47M","2.25%"
"Mar 05, 2020","25.94","27.13","27.17","24.77","8.50M","-6.35%"
"Mar 06, 2020","23.85","24.89","24.95","23.32","12.99M","-8.06%"
"Mar 09, 2020","21.91","21.10","23.01","21.10","12.12M","-8.13%"
"Mar 10, 2020","23.55","22.75","23.76","22.02","11.82M","7.49%"
"Mar 11, 2020","21.65","22.31","23.06","19.35","17.61M","-8.07%"
"Mar 12, 2020","17.74","18.00","19.12","16.50","8.43M","-18.06%"
"Mar 13, 2020","21.47","19.50","21.47","18.11","20.64M","21.03%"
"Mar 16, 2020","17.49","17.99","19.25","16.57","13.47M","-18.54%"
"Mar 17, 2020","18.40","18.19","19.50","16.60","17.08M","5.20%"
"Mar 18, 2020","16.17","16.59","17.57","14.39","14.50M","-12.12%"
"Mar 19, 2020","16.34","15.83","17.88","14.55","15.03M","1.05%"
"Mar 20, 2020","17.61","17.21","18.92","16.83","16.61M","7.77%"
"Mar 23, 2020","17.49","17.43","17.87","16.20","10.73M","-0.68%"
"Mar 24, 2020","19.29","18.89","21.21","18.57","10.95M","10.29%"
"Mar 25, 2020","20.03","19.16","20.87","18.94","10.92M","3.84%"
"Mar 26, 2020","20.85","20.45","21.66","20.28","9.41M","4.09%"
"Mar 27, 2020","19.00","19.90","19.93","19.00","8.06M","-8.87%"
"Mar 30, 2020","19.04","19.06","20.19","18.87","8.35M","0.21%"
"Mar 31, 2020","18.00","19.01","19.30","17.67","8.10M","-5.46%"
"Apr 01, 2020","17.95","17.54","18.19","16.89","7.75M","-0.28%"
"Apr 02, 2020","18.55","18.10","18.99","18.04","6.45M","3.34%"
"Apr 03, 2020","17.44","18.50","18.71","17.16","11.22M","-5.98%"
"Apr 06, 2020","19.50","18.50","19.80","18.32","10.05M","11.81%"
"Apr 07, 2020","20.46","20.57","21.86","20.02","12.20M","4.92%"
"Apr 08, 2020","21.89","20.49","22.15","19.91","12.72M","6.99%"
"Apr 09, 2020","21.30","22.00","22.76","21.08","8.70M","-2.70%"
"Apr 13, 2020","20.69","21.13","21.24","20.25","7.20M","-2.86%"
"Apr 14, 2020","21.02","21.14","21.85","21.00","5.46M","1.59%"
"Apr 15, 2020","21.53","20.31","21.90","20.16","7.65M","2.43%"
"Apr 16, 2020","22.37","21.94","22.89","21.94","11.16M","3.90%"
"Apr 17, 2020","21.75","22.92","23.31","21.40","6.82M","-2.77%"