[2020-03-01|06:44:17 PM] -----------------------------------
[2020-03-01|06:44:17 PM] -- Archiving Composition         --
[2020-03-01|06:44:17 PM] -----------------------------------
[2020-03-01|06:44:17 PM] 
[2020-03-01|06:44:17 PM] Copy Fonts
[2020-03-01|06:44:17 PM] ------------
[2020-03-01|06:44:17 PM] /Library/Fonts/VCR_OSD_MONO_1.001.ttf
[2020-03-01|06:44:17 PM] 
[2020-03-01|06:44:17 PM] Copy FBX + OBJ Meshes
[2020-03-01|06:44:17 PM] ---------------------
[2020-03-01|06:44:17 PM] 
[2020-03-01|06:44:17 PM] Copy LUTs
[2020-03-01|06:44:17 PM] ---------------
[2020-03-01|06:44:17 PM] 
[2020-03-01|06:44:17 PM] Copy ABC Meshes
[2020-03-01|06:44:17 PM] ---------------
[2020-03-01|06:44:17 PM] 
[2020-03-01|06:44:17 PM] Copy Audio
[2020-03-01|06:44:17 PM] ----------
[2020-03-01|06:44:17 PM] 
[2020-03-01|06:44:17 PM] Copy Loaders
[2020-03-01|06:44:17 PM] ------------
[2020-03-01|06:44:17 PM] black-cassette-tape-on-top-of-red-and-yellow-surface-1626481.jpg : Copying 3.67 MB
[2020-03-01|06:44:17 PM] 
[2020-03-01|06:44:17 PM] Copy Savers
[2020-03-01|06:44:17 PM] -----------
[2020-03-01|06:44:17 PM] [Processing Time] 21.000 s
[2020-03-01|06:44:17 PM] [Archive Composition Log] /Users/emiliosapia/Desktop/VHS/ArchiveLog.txt
