7.50 0.10
13.10 0.80
18.40 1.00
1.80 2.00
24.20 2.10
3.60 2.10
12.70 2.60
6.70 -2.80
10.30 3.00
22.50 4.00
17.50 4.40
8.00 5.30
20.90 5.80
13.50 6.20
1.20 6.90
15.30 8.10
9.90 8.40
13.40 8.80
0.60 9.00
1.80 11.00
7.50 0.10
13.10 0.80
18.40 1.00
1.80 2.00
24.20 2.10
3.60 2.10
12.70 2.60
6.70 -2.80
10.30 3.00
22.50 4.00
17.50 4.40
8.00 5.30
20.90 5.80
13.50 6.20
1.20 6.90
15.30 8.10
9.90 8.40
13.40 8.80
0.60 9.00
1.80 11.00
7.50 0.10
13.10 0.80
18.40 1.00
1.80 2.00
24.20 2.10
3.60 2.10
12.70 2.60
6.70 -2.80
10.30 3.00
22.50 4.00
17.50 4.40
8.00 5.30
20.90 5.80
13.50 6.20
1.20 6.90
15.30 8.10
9.90 8.40
13.40 8.80
0.60 9.00
1.80 11.00
7.50 0.10
13.10 0.80
18.40 1.00
1.80 2.00
24.20 2.10
3.60 2.10
12.70 2.60
6.70 -2.80
10.30 3.00
22.50 4.00
17.50 4.40
8.00 5.30
20.90 5.80
13.50 6.20
1.20 6.90
15.30 8.10
9.90 8.40
13.40 8.80
0.60 9.00
1.80 11.00
7.50 0.10
13.10 0.80
18.40 1.00
1.80 2.00
24.20 2.10
3.60 2.10
12.70 2.60
6.70 -2.80
10.30 3.00
22.50 4.00
17.50 4.40
8.00 5.30
20.90 5.80
13.50 6.20
1.20 6.90
15.30 8.10
9.90 8.40
13.40 8.80
0.60 9.00
1.80 11.00