{
    "items": [
        {
            "prod_id": 43,
            "prod_name": "MacBook",
            "prod_options": [{
                "type": "text",
                "label": "Qty",
                "value": 1
            }]
        }, {
            "prod_id": 47,
            "prod_name": "HP LP3065",
            "prod_options": [{
                    "type": "text",
                    "label": "Delivery Date",
                    "value": "2011-01-12"
                }, {
                    "type": "text",
                    "label": "Qty",
                    "value": 1
                }]
        }, {
            "prod_id": null,
            "prod_search": "30-inch diagonal",
            "prod_comment": "Like HP LP3065 (47), but without prod_id or prod_name, should be found?",
            "prod_options": [{
                    "type": "text",
                    "label": "Delivery Date",
                    "value": "2011-01-12"
                }, {
                    "type": "text",
                    "label": "Qty",
                    "value": 1
                }]
        }
    ],
    "billing": {
        "firstname": "You Can",
        "lastname": "Leave",
        "company": "",
        "address-1": "4, Zalman Shazar st",
        "address-2": "apt 5",
        "city": "Haifa",
        "postal": "3486104",
        "country": "Israel",
        "state": "Haifa"
    }
}