[
  {
    "model": "_.site",
    "pk": 1,
    "fields": {
      "title": "שמורת טבע חולות נתיב העשרה",
      "poly": "SRID=4326;POLYGON ((34.28428673108747 31.39796316452362, 34.74661503513636 31.40044753877681, 34.74472038028384 31.78709004915152, 34.28047901575411 31.78456799129262, 34.28428673108747 31.39796316452362))"
    }
  },
  {
    "model": "_.site",
    "pk": 2,
    "fields": {
      "title": "שמורת טבע נקיקי יפתח",
      "poly": "SRID=4326;POLYGON ((35.33653052427647 32.96284942325837, 35.76521037346708 32.96166044257513, 35.76752349697106 33.32453964064003, 35.33707550729934 33.32574506441405, 35.33653052427647 32.96284942325837))"
    }
  },
  {
    "model": "_.site",
    "pk": 3,
    "fields": {
      "title": "שמורת טבע שמורת טבע ויער הכפירה",
      "poly": "SRID=4326;POLYGON ((34.82823254044405 31.63827498351145, 35.30982551030764 31.63878554208269, 35.31027492856809 32.03316687523955, 34.82662936536462 32.03264842180761, 34.82823254044405 31.63827498351145))"
    }
  },
  {
    "model": "_.site",
    "pk": 4,
    "fields": {
      "title": "שמורת טבע הר סנה",
      "poly": "SRID=4326;POLYGON ((35.06756902883254 32.78926518489645, 35.52414108959346 32.7889318316255, 35.52551142666719 33.1683505491517, 35.06698254336081 33.16868871403686, 35.06756902883254 32.78926518489645))"
    }
  },
  {
    "model": "_.site",
    "pk": 5,
    "fields": {
      "title": "שמורת טבע וגן לאומי הר אביטל - הר בנטל",
      "poly": "SRID=4326;POLYGON ((35.5586944085679 32.92076111132277, 36.01331656940129 32.9186457606437, 36.01694557022262 33.31366044939104, 35.56028400508693 33.31580769979947, 35.5586944085679 32.92076111132277))"
    }
  },
  {
    "model": "_.site",
    "pk": 6,
    "fields": {
      "title": "שמורת טבע וגן לאומי בית מירסם",
      "poly": "SRID=4326;POLYGON ((34.69509174503288 31.25636073008018, 35.13658409326654 31.25735175597331, 35.13630681439395 31.64163913233831, 34.69300872968063 31.64063310872265, 34.69509174503288 31.25636073008018))"
    }
  },
  {
    "model": "_.site",
    "pk": 7,
    "fields": {
      "title": "שמורת טבע נחל אוג",
      "poly": "SRID=4326;POLYGON ((35.16979239281618 31.57482617728411, 35.70797502700641 31.57383873408511, 35.71018484488559 31.98076682037642, 35.16964060745094 31.98176992795263, 35.16979239281618 31.57482617728411))"
    }
  },
  {
    "model": "_.site",
    "pk": 8,
    "fields": {
      "title": "שמורת טבע נחל כזיב",
      "poly": "SRID=4326;POLYGON ((34.96482431781835 32.82813572120374, 35.5197332350069 32.82796782690946, 35.52117907723729 33.23302363184895, 34.96372574993238 33.23319408917165, 34.96482431781835 32.82813572120374))"
    }
  },
  {
    "model": "_.site",
    "pk": 9,
    "fields": {
      "title": "שמורת טבע גברעם",
      "poly": "SRID=4326;POLYGON ((34.36540295391234 31.38404162693989, 34.82938329899839 31.38623774767019, 34.82781501827809 31.77709599202973, 34.36189463721282 31.77486618253183, 34.36540295391234 31.38404162693989))"
    }
  },
  {
    "model": "_.site",
    "pk": 10,
    "fields": {
      "title": "שמורת טבע מג'רסה",
      "poly": "SRID=4326;POLYGON ((35.42143198496615 32.70526254281157, 35.8550211454962 32.70376276887227, 35.85767157056649 33.06572741252259, 35.42231615626742 33.06724796645863, 35.42143198496615 32.70526254281157))"
    }
  },
  {
    "model": "_.site",
    "pk": 11,
    "fields": {
      "title": "שמורת טבע וגן לאומי שימרון",
      "poly": "SRID=4326;POLYGON ((34.99655007630612 32.51931392898932, 35.4571697535236 32.51923168025707, 35.45822707426657 32.89345468297551, 34.99568063329843 32.89353808431598, 34.99655007630612 32.51931392898932))"
    }
  },
  {
    "model": "_.site",
    "pk": 12,
    "fields": {
      "title": "שמורת טבע נחל אפעה",
      "poly": "SRID=4326;POLYGON ((34.87544556885131 30.85718476208383, 35.36688355677961 30.85750051112125, 35.36758039924007 31.2664999468254, 34.87403527673366 31.26617904552943, 34.87544556885131 30.85718476208383))"
    }
  },
  {
    "model": "_.site",
    "pk": 13,
    "fields": {
      "title": "גן לאומי אפולוניה",
      "poly": "SRID=4326;POLYGON ((34.58466699817952 32.00432135371841, 35.02477149529206 32.00570781443342, 35.02402620528359 32.38433373657531, 34.58209577556601 32.38292688790204, 34.58466699817952 32.00432135371841))"
    }
  },
  {
    "model": "_.site",
    "pk": 14,
    "fields": {
      "title": "שמורת טבע קדרים-חנניה",
      "poly": "SRID=4326;POLYGON ((35.20073118370744 32.73521178019464, 35.69592898465347 32.73424822762815, 35.69809193889639 33.12452461702401, 35.20071500743899 33.12550254671687, 35.20073118370744 32.73521178019464))"
    }
  },
  {
    "model": "_.site",
    "pk": 15,
    "fields": {
      "title": "גן לאומי גבעות מרר",
      "poly": "SRID=4326;POLYGON ((34.56852611835313 31.65266994049204, 34.99956379624999 31.65408945406707, 34.99874440336845 32.02426582323895, 34.5659825132585 32.02282577986922, 34.56852611835313 31.65266994049204))"
    }
  },
  {
    "model": "_.site",
    "pk": 16,
    "fields": {
      "title": "שמורת טבע ברכת פסוטה",
      "poly": "SRID=4326;POLYGON ((35.08568052916801 32.86584654042731, 35.51233461433036 32.86552391111143, 35.51359197950543 33.22612068941604, 35.08519570945277 33.22644773927125, 35.08568052916801 32.86584654042731))"
    }
  },
  {
    "model": "_.site",
    "pk": 17,
    "fields": {
      "title": "שמורת טבע ברכות צוריאל",
      "poly": "SRID=4326;POLYGON ((35.08988216071192 32.82350275092314, 35.51775256745526 32.8231629740555, 35.51903675484564 33.18565466476591, 35.08941278518486 33.18599912616463, 35.08988216071192 32.82350275092314))"
    }
  },
  {
    "model": "_.site",
    "pk": 18,
    "fields": {
      "title": "גן לאומי בית הכנסת חוקוק",
      "poly": "SRID=4326;POLYGON ((35.25880386450264 32.69743609897578, 35.70244975823012 32.69645914158941, 35.70452270873623 33.06632195906085, 35.25903029006707 33.06731274012746, 35.25880386450264 32.69743609897578))"
    }
  },
  {
    "model": "_.site",
    "pk": 19,
    "fields": {
      "title": "שמורת טבע ברכת דוב\"ב",
      "poly": "SRID=4326;POLYGON ((35.20100615048584 32.869108907703, 35.62893002240342 32.86838863421411, 35.63067004890461 33.23029570274885, 35.2009921998623 33.23102591423249, 35.20100615048584 32.869108907703))"
    }
  },
  {
    "model": "_.site",
    "pk": 20,
    "fields": {
      "title": "גן לאומי אבל בית מעכה",
      "poly": "SRID=4326;POLYGON ((35.36224669956944 33.07411929868355, 35.79588246366521 33.07281647293936, 35.7983764373262 33.44214387782232, 35.36291225737909 33.4434650133848, 35.36224669956944 33.07411929868355))"
    }
  },
  {
    "model": "_.site",
    "pk": 21,
    "fields": {
      "title": "גן לאומי תל לכיש ותל מארשה",
      "poly": "SRID=4326;POLYGON ((34.63717183406681 31.37343837330623, 35.11261140762662 31.37465963804691, 35.11221292136894 31.78053842001567, 34.63470892097374 31.77929767712109, 34.63717183406681 31.37343837330623))"
    }
  },
  {
    "model": "_.site",
    "pk": 22,
    "fields": {
      "title": "שמורת טבע הר טורען",
      "poly": "SRID=4326;POLYGON ((35.11797017560181 32.59266846086025, 35.57950835361388 32.59213825681336, 35.5810861440728 32.96737649060721, 35.11760660330676 32.96791430432202, 35.11797017560181 32.59266846086025))"
    }
  },
  {
    "model": "_.site",
    "pk": 23,
    "fields": {
      "title": "שמורת טבע גני חוג'ה",
      "poly": "SRID=4326;POLYGON ((35.34002648240784 32.33517523760601, 35.78932500060605 32.33389227301727, 35.79245721843019 32.81510324449737, 35.34075280097661 32.81641000800843, 35.34002648240784 32.33517523760601))"
    }
  },
  {
    "model": "_.site",
    "pk": 24,
    "fields": {
      "title": "גן לאומי אשכול",
      "poly": "SRID=4326;POLYGON ((34.27925245121661 31.12052590226433, 34.72250073412603 31.12294596558447, 34.72061974571667 31.49176761183612, 34.2756416917714 31.48931236201547, 34.27925245121661 31.12052590226433))"
    }
  },
  {
    "model": "_.site",
    "pk": 25,
    "fields": {
      "title": "שמורת טבע מתלול צורים",
      "poly": "SRID=4326;POLYGON ((35.01529775938148 32.74111917344018, 35.5481333775621 32.74079053279485, 35.549648289049 33.13157142785574, 35.01446427996989 33.13190495274468, 35.01529775938148 32.74111917344018))"
    }
  },
  {
    "model": "_.site",
    "pk": 26,
    "fields": {
      "title": "אתר קולט קהל חי-בר יטבתה",
      "poly": "SRID=4326;POLYGON ((34.82164411261321 29.66127221761902, 35.2720857223115 29.66180727571586, 35.27235792706583 30.06395095104781, 34.8201066443933 30.06340713287032, 34.82164411261321 29.66127221761902))"
    }
  },
  {
    "model": "_.site",
    "pk": 27,
    "fields": {
      "title": "שמורת טבע חרבת גממה",
      "poly": "SRID=4326;POLYGON ((34.46693103644071 31.31699911273711, 34.90332036705615 31.31876393654067, 34.90211469752165 31.69419033652126, 34.46397797703454 31.69239947691299, 34.46693103644071 31.31699911273711))"
    }
  },
  {
    "model": "_.site",
    "pk": 28,
    "fields": {
      "title": "שמורת טבע נחל דליה",
      "poly": "SRID=4326;POLYGON ((34.78709752867301 32.39854134002087, 35.29484701908472 32.39919968405393, 35.29523786201253 32.78745241597576, 34.78529433899026 32.78678418817732, 34.78709752867301 32.39854134002087))"
    }
  },
  {
    "model": "_.site",
    "pk": 29,
    "fields": {
      "title": "שמורת טבע נחל חלילים",
      "poly": "SRID=4326;POLYGON ((34.94636164898229 31.62215995995633, 35.3786184400189 31.62230173825596, 35.3793044511866 31.98711926638247, 34.94534577258053 31.98697543996347, 34.94636164898229 31.62215995995633))"
    }
  },
  {
    "model": "_.site",
    "pk": 30,
    "fields": {
      "title": "שמורת טבע נחל שיזף",
      "poly": "SRID=4326;POLYGON ((35.00405644412893 30.47646593381923, 35.50356997531486 30.4762764923028, 35.50514812690428 30.98578498901171, 35.00299999167368 30.98597823534, 35.00405644412893 30.47646593381923))"
    }
  },
  {
    "model": "_.site",
    "pk": 31,
    "fields": {
      "title": "שמורת טבע שמיר-נחל רחום",
      "poly": "SRID=4326;POLYGON ((35.43317122197791 32.98850196683938, 35.88055721823975 32.98688083348599, 35.88346131674565 33.36424404262703, 35.43415384153428 33.36588849427156, 35.43317122197791 32.98850196683938))"
    }
  },
  {
    "model": "_.site",
    "pk": 32,
    "fields": {
      "title": "שמורת טבע סלע עכברה",
      "poly": "SRID=4326;POLYGON ((35.26354290226456 32.7211391563696, 35.7246120565936 32.72007399117402, 35.72695681500459 33.11994776518293, 35.2638094652443 33.1210292260574, 35.26354290226456 32.7211391563696))"
    }
  },
  {
    "model": "_.site",
    "pk": 33,
    "fields": {
      "title": "שמורת טבע תל מקנה נחל תמנה",
      "poly": "SRID=4326;POLYGON ((34.61452700722552 31.59472472324254, 35.06622690751377 31.59601160706243, 35.06567574248278 31.96600517088169, 34.61217394551535 31.96469966136835, 34.61452700722552 31.59472472324254))"
    }
  },
  {
    "model": "_.site",
    "pk": 34,
    "fields": {
      "title": "גן לאומי צובא",
      "poly": "SRID=4326;POLYGON ((34.91361429397308 31.60391512666775, 35.33838458822231 31.60417573802625, 35.33890925672574 31.96723818913391, 34.91247586060513 31.96697385483545, 34.91361429397308 31.60391512666775))"
    }
  },
  {
    "model": "_.site",
    "pk": 35,
    "fields": {
      "title": "שמורת טבע ברכת שילר",
      "poly": "SRID=4326;POLYGON ((34.56103135531763 31.69907962908539, 34.98653729002621 31.70051629729317, 34.98567938258577 32.06431142790541, 34.5584979372259 32.06285435875395, 34.56103135531763 31.69907962908539))"
    }
  },
  {
    "model": "_.site",
    "pk": 36,
    "fields": {
      "title": "שמורת טבע הבור בחג'ה",
      "poly": "SRID=4326;POLYGON ((34.91397666810548 32.02626257148237, 35.33764305525395 32.0265250669325, 35.33817058981477 32.38764581577113, 34.91282695849939 32.38737961834374, 34.91397666810548 32.02626257148237))"
    }
  },
  {
    "model": "_.site",
    "pk": 37,
    "fields": {
      "title": "שמורת טבע להב",
      "poly": "SRID=4326;POLYGON ((34.61947214079885 31.15102050156546, 35.08777005159989 31.15229593227302, 35.08723385659894 31.58559137395687, 34.61678264035562 31.58429413504541, 34.61947214079885 31.15102050156546))"
    }
  },
  {
    "model": "_.site",
    "pk": 38,
    "fields": {
      "title": "שמורת טבע נרקיסי נחל מסעד",
      "poly": "SRID=4326;POLYGON ((34.63339072652354 30.77475815209297, 35.08683641263118 30.77596182344128, 35.08634265611392 31.17808340439432, 34.63099207176577 31.17686050318948, 34.63339072652354 30.77475815209297))"
    }
  },
  {
    "model": "_.site",
    "pk": 39,
    "fields": {
      "title": "שמורת טבע נחל הקיבוצים",
      "poly": "SRID=4326;POLYGON ((35.23797118334087 32.3181129732701, 35.67026511312864 32.31725760223761, 35.67215278111864 32.68267213024747, 35.23810722808874 32.68353952935711, 35.23797118334087 32.3181129732701))"
    }
  },
  {
    "model": "_.site",
    "pk": 40,
    "fields": {
      "title": "שמורת טבע בקעת בית נטופה",
      "poly": "SRID=4326;POLYGON ((35.04594652587279 32.59874323220657, 35.4774472573183 32.59854644038361, 35.47855628795101 32.96092007324197, 35.04530290848336 32.96111957517213, 35.04594652587279 32.59874323220657))"
    }
  },
  {
    "model": "_.site",
    "pk": 41,
    "fields": {
      "title": "גן לאומי מערות סמך",
      "poly": "SRID=4326;POLYGON ((34.59820784339816 31.36332983371877, 35.03799239087336 31.36465399594299, 35.03732217900105 31.74157152955942, 34.59576629532 31.74022776281628, 34.59820784339816 31.36332983371877))"
    }
  },
  {
    "model": "_.site",
    "pk": 42,
    "fields": {
      "title": "שמורת טבע ביצת השורק",
      "poly": "SRID=4326;POLYGON ((34.52502183524423 31.75253739903976, 34.95507724058233 31.75410464930625, 34.9540777961551 32.12360728130277, 34.52229857100357 32.12201744881153, 34.52502183524423 31.75253739903976))"
    }
  },
  {
    "model": "_.site",
    "pk": 43,
    "fields": {
      "title": "שמורת טבע הר טמון",
      "poly": "SRID=4326;POLYGON ((35.14267666022858 32.05353675875865, 35.65580990998666 32.05274799752664, 35.65787291805394 32.46861469922116, 35.14239460555449 32.46941613747973, 35.14267666022858 32.05353675875865))"
    }
  },
  {
    "model": "_.site",
    "pk": 44,
    "fields": {
      "title": "שמורת טבע תל מרווה",
      "poly": "SRID=4326;POLYGON ((35.01484161144584 32.83422469199117, 35.45997215201277 32.83410732639783, 35.46104031301937 33.20357209388737, 35.01404928451863 33.20369108917709, 35.01484161144584 32.83422469199117))"
    }
  },
  {
    "model": "_.site",
    "pk": 45,
    "fields": {
      "title": "שמורת טבע רצועת נחל הנעמן",
      "poly": "SRID=4326;POLYGON ((34.89305837886753 32.66964361562746, 35.32425222481179 32.66997260256256, 35.32475231984053 33.04115206143577, 34.89175921753041 33.04081836257588, 34.89305837886753 32.66964361562746))"
    }
  },
  {
    "model": "_.site",
    "pk": 46,
    "fields": {
      "title": "גן לאומי מערות חזן",
      "poly": "SRID=4326;POLYGON ((34.69109874055786 31.32922847248076, 35.13007028357772 31.33023310411273, 35.12976203072557 31.71882791090006, 34.68896952613265 31.71780792551341, 34.69109874055786 31.32922847248076))"
    }
  },
  {
    "model": "_.site",
    "pk": 47,
    "fields": {
      "title": "שמורת טבע ים שקמה",
      "poly": "SRID=4326;POLYGON ((34.27916126883429 31.4131977387943, 34.72365656196212 31.4156356360403, 34.72164530238923 31.80619909354752, 34.27529080463459 31.80372385196822, 34.27916126883429 31.4131977387943))"
    }
  },
  {
    "model": "_.site",
    "pk": 48,
    "fields": {
      "title": "שמורת טבע השונית המזופוטית",
      "poly": "SRID=4326;POLYGON ((34.69774543713005 29.30303806403763, 35.14189471398698 29.30398417995103, 35.14165301862295 29.69728004190134, 34.69578431497163 29.69631869132986, 34.69774543713005 29.30303806403763))"
    }
  },
  {
    "model": "_.site",
    "pk": 49,
    "fields": {
      "title": "שמורת טבע בוריקה",
      "poly": "SRID=4326;POLYGON ((34.76301700825558 32.35907874322388, 35.19967202931539 32.3598509812474, 35.19965265174211 32.72895251620504, 34.76120747905505 32.72816926209502, 34.76301700825558 32.35907874322388))"
    }
  },
  {
    "model": "_.site",
    "pk": 50,
    "fields": {
      "title": "שמורת טבע יער ברעם",
      "poly": "SRID=4326;POLYGON ((35.20283238640025 32.84803638310984, 35.64650115662572 32.84725546656938, 35.64838614659042 33.22389741107165, 35.20282566245242 33.22468954795092, 35.20283238640025 32.84803638310984))"
    }
  },
  {
    "model": "_.site",
    "pk": 51,
    "fields": {
      "title": "שמורת טבע נחל גמל",
      "poly": "SRID=4326;POLYGON ((34.99647354250761 32.72295923672971, 35.43930757160984 32.72291159969687, 35.44028977730277 33.09409565766668, 34.99560409801087 33.09414394314597, 34.99647354250761 32.72295923672971))"
    }
  },
  {
    "model": "_.site",
    "pk": 52,
    "fields": {
      "title": "שמורת טבע וגן לאומי תל דור",
      "poly": "SRID=4326;POLYGON ((34.7028602253006 32.43544402866216, 35.13611941463079 32.43642397905282, 35.1358354970493 32.80962346241062, 34.70077488251916 32.80862940302427, 34.7028602253006 32.43544402866216))"
    }
  },
  {
    "model": "_.site",
    "pk": 53,
    "fields": {
      "title": "שמורת טבע נחל ייטב + כוכב השחר",
      "poly": "SRID=4326;POLYGON ((35.12477317878614 31.75854496082438, 35.61977353389769 31.75789265172973, 35.62159095922246 32.16076280809386, 35.12442484538308 32.1614253181909, 35.12477317878614 31.75854496082438))"
    }
  },
  {
    "model": "_.site",
    "pk": 54,
    "fields": {
      "title": "שמורת טבע נחל מאיר-נחל נחשון",
      "poly": "SRID=4326;POLYGON ((34.76426660211194 31.63872878697972, 35.21266278227143 31.63948711579498, 35.21269588054091 32.00954483287362, 34.76250753777216 32.00877552238374, 34.76426660211194 31.63872878697972))"
    }
  },
  {
    "model": "_.site",
    "pk": 55,
    "fields": {
      "title": "שמורת טבע נחל איה",
      "poly": "SRID=4326;POLYGON ((34.75166646441289 29.79368263823827, 35.18963449483974 29.79445679743519, 35.18957459276811 30.20004484630886, 34.74982223991758 30.19925795580787, 34.75166646441289 29.79368263823827))"
    }
  },
  {
    "model": "_.site",
    "pk": 56,
    "fields": {
      "title": "שמורת טבע הר ג'דיר",
      "poly": "SRID=4326;POLYGON ((35.17524507774261 32.11230962029867, 35.64720434705217 32.11153878614233, 35.64917690718767 32.51609126710655, 35.17511522822785 32.51687414186167, 35.17524507774261 32.11230962029867))"
    }
  },
  {
    "model": "_.site",
    "pk": 57,
    "fields": {
      "title": "שמורת טבע מפל עיט",
      "poly": "SRID=4326;POLYGON ((35.5381977905766 32.77562529312265, 35.9661577922 32.77375407246868, 35.96926434695025 33.1351405231758, 35.53955917758955 33.13703760731677, 35.5381977905766 32.77562529312265))"
    }
  },
  {
    "model": "_.site",
    "pk": 58,
    "fields": {
      "title": "גן לאומי חולדה",
      "poly": "SRID=4326;POLYGON ((34.6853574396924 31.63466982258945, 35.11094366235491 31.63569057422769, 35.11057650127871 31.9996058359185, 34.68331806512118 31.99857055971074, 34.6853574396924 31.63466982258945))"
    }
  },
  {
    "model": "_.site",
    "pk": 59,
    "fields": {
      "title": "שמורת טבע הסלוודורה הפרסית",
      "poly": "SRID=4326;POLYGON ((35.24535318676384 31.84306347399245, 35.67013387161677 31.84221750862019, 35.67196927857739 32.20425741780342, 35.24551463410449 32.20511526377884, 35.24535318676384 31.84306347399245))"
    }
  },
  {
    "model": "_.site",
    "pk": 60,
    "fields": {
      "title": "שמורת טבע וגן לאומי נאות הככר",
      "poly": "SRID=4326;POLYGON ((35.13205263605194 30.76833283442208, 35.58118565449516 30.76780557845134, 35.58278978109229 31.1753285209154, 35.13174481078939 31.17586426488018, 35.13205263605194 30.76833283442208))"
    }
  },
  {
    "model": "_.site",
    "pk": 61,
    "fields": {
      "title": "שמורת טבע דרכי הבשמים",
      "poly": "SRID=4326;POLYGON ((34.54967291700707 30.44284330892359, 35.40056828455793 30.44433787674976, 35.40184452760226 31.07161775223143, 34.54541492896632 31.07008557807095, 34.54967291700707 30.44284330892359))"
    }
  },
  {
    "model": "_.site",
    "pk": 62,
    "fields": {
      "title": "שמורת טבע אוג קוצני",
      "poly": "SRID=4326;POLYGON ((34.76169293761151 31.9666917934246, 35.19053219835364 31.96746290654132, 35.19047696602134 32.33184294979503, 34.75992850987278 32.33106090629153, 34.76169293761151 31.9666917934246))"
    }
  },
  {
    "model": "_.site",
    "pk": 63,
    "fields": {
      "title": "שמורת טבע ח'רבת צ'רקס",
      "poly": "SRID=4326;POLYGON ((34.75076054423421 32.26966513478099, 35.17585887986112 32.27047652143637, 35.17574493419141 32.63126424370473, 34.74894932187079 32.63044152960814, 34.75076054423421 32.26966513478099))"
    }
  },
  {
    "model": "_.site",
    "pk": 64,
    "fields": {
      "title": "שמורת טבע חניתה",
      "poly": "SRID=4326;POLYGON ((34.96320984713953 32.90001127946199, 35.40583796351184 32.90008166261984, 35.40668678446409 33.27162647191825, 34.96219342559714 33.27155506047276, 34.96320984713953 32.90001127946199))"
    }
  },
  {
    "model": "_.site",
    "pk": 65,
    "fields": {
      "title": "שמורת טבע וגן לאומי חמת גדר",
      "poly": "SRID=4326;POLYGON ((35.44274573318297 32.50115121259446, 35.88620019915403 32.49952980531316, 35.88901920991891 32.86973416473348, 35.44373128910235 32.87137862825742, 35.44274573318297 32.50115121259446))"
    }
  },
  {
    "model": "_.site",
    "pk": 66,
    "fields": {
      "title": "גן לאומי עבדת",
      "poly": "SRID=4326;POLYGON ((34.55616899469109 30.60458685454476, 34.99243596893334 30.60602894447444, 34.9916068467715 30.98327731539912, 34.55363321332202 30.98181355473057, 34.55616899469109 30.60458685454476))"
    }
  },
  {
    "model": "_.site",
    "pk": 67,
    "fields": {
      "title": "גן לאומי אנדרטת חטיבת הנגב",
      "poly": "SRID=4326;POLYGON ((34.60890759524806 31.08074630668077, 35.03442878015412 31.08200918451326, 35.03376876209924 31.44958310617361, 34.6065950788667 31.44830190153608, 34.60890759524806 31.08074630668077))"
    }
  },
  {
    "model": "_.site",
    "pk": 68,
    "fields": {
      "title": "שמורת טבע נחל שורק",
      "poly": "SRID=4326;POLYGON ((34.81305890889831 31.5509307038242, 35.30246821640444 31.55149186631942, 35.30289320769418 31.95369813190435, 34.81136345774988 31.95312810840246, 34.81305890889831 31.5509307038242))"
    }
  },
  {
    "model": "_.site",
    "pk": 69,
    "fields": {
      "title": "שמורת טבע ברכת ג'עודי",
      "poly": "SRID=4326;POLYGON ((35.39743564651062 32.76382431286854, 35.82721080225699 32.7624252047145, 35.82977038492069 33.12675065596073, 35.39822900638313 33.12816925642299, 35.39743564651062 32.76382431286854))"
    }
  },
  {
    "model": "_.site",
    "pk": 70,
    "fields": {
      "title": "שמורת טבע חולות ראשון לציון",
      "poly": "SRID=4326;POLYGON ((34.50217980468541 31.75973131349064, 34.95452151798855 31.76142153045808, 34.95338994277531 32.17823026069129, 34.49899995928938 32.17651256221885, 34.50217980468541 31.75973131349064))"
    }
  },
  {
    "model": "_.site",
    "pk": 71,
    "fields": {
      "title": "שמורת טבע שקע קיסרי",
      "poly": "SRID=4326;POLYGON ((34.67555603247219 32.2943101202234, 35.1414240456493 32.29540197255946, 35.14116562674648 32.66575550262998, 34.67338597710201 32.66464801524553, 34.67555603247219 32.2943101202234))"
    }
  },
  {
    "model": "_.site",
    "pk": 72,
    "fields": {
      "title": "שמורת טבע חוף האלמוגים באילת",
      "poly": "SRID=4326;POLYGON ((34.71158111816819 29.32123912957148, 35.130279395118 29.32212789306703, 35.1300091420616 29.69284458036031, 34.70978276145881 29.69194233538599, 34.71158111816819 29.32123912957148))"
    }
  },
  {
    "model": "_.site",
    "pk": 73,
    "fields": {
      "title": "גן לאומי תל-לכיש",
      "poly": "SRID=4326;POLYGON ((34.6360822364954 31.38015437233217, 35.06272158477784 31.38133520976418, 35.06216447739848 31.74918197509428, 34.63384735215226 31.74798408020308, 34.6360822364954 31.38015437233217))"
    }
  },
  {
    "model": "_.site",
    "pk": 74,
    "fields": {
      "title": "שמורת טבע הר שיפון",
      "poly": "SRID=4326;POLYGON ((35.55000502663343 32.88592809183725, 35.98874976916896 32.88394606053799, 35.99204246420184 33.25430019379511, 35.55145599741912 33.256310254984, 35.55000502663343 32.88592809183725))"
    }
  },
  {
    "model": "_.site",
    "pk": 75,
    "fields": {
      "title": "שמורת טבע שיטה מלבינה יער חוף הכרמל",
      "poly": "SRID=4326;POLYGON ((34.71657223675021 32.42938898618991, 35.14645915578863 32.43032017414341, 35.14622297018462 32.79633289025411, 34.71458378777667 32.79538855206856, 34.71657223675021 32.42938898618991))"
    }
  },
  {
    "model": "_.site",
    "pk": 76,
    "fields": {
      "title": "אתר קולט קהל תחום ניהול נחל עמוד",
      "poly": "SRID=4326;POLYGON ((35.22780345182074 32.73136712638625, 35.7022384032572 32.73038086643687, 35.70473200827873 33.1740921996867, 35.22792064669617 33.17509520399993, 35.22780345182074 32.73136712638625))"
    }
  },
  {
    "model": "_.site",
    "pk": 77,
    "fields": {
      "title": "שמורת טבע דקלי הדום-אילת",
      "poly": "SRID=4326;POLYGON ((34.76867430924987 29.39310447169297, 35.18064709513531 29.39381423507312, 35.18056265557755 29.75504459878697, 34.76712081931675 29.75432435593959, 34.76867430924987 29.39310447169297))"
    }
  },
  {
    "model": "_.site",
    "pk": 78,
    "fields": {
      "title": "שמורת טבע אירוס נצרתי יפתח",
      "poly": "SRID=4326;POLYGON ((35.31314263347828 32.95191805156657, 35.76136300862204 32.95072393843679, 35.76390784403335 33.35249173132399, 35.31363947923743 33.35370413815792, 35.31314263347828 32.95191805156657))"
    }
  },
  {
    "model": "_.site",
    "pk": 79,
    "fields": {
      "title": "שמורת טבע שפך הירדן",
      "poly": "SRID=4326;POLYGON ((35.3281599255356 31.58049244364459, 35.76837848418405 31.57930787188521, 35.77071280117547 31.96326066209553, 35.32867226389433 31.96446297302444, 35.3281599255356 31.58049244364459))"
    }
  },
  {
    "model": "_.site",
    "pk": 80,
    "fields": {
      "title": "שמורת טבע המכתש הקטן",
      "poly": "SRID=4326;POLYGON ((34.93417434755097 30.75107332635592, 35.43131732618054 30.75115613141798, 35.43241161418653 31.21241866527535, 34.93287161805012 31.21233429990853, 34.93417434755097 30.75107332635592))"
    }
  },
  {
    "model": "_.site",
    "pk": 81,
    "fields": {
      "title": "גן לאומי חוף-השרון",
      "poly": "SRID=4326;POLYGON ((34.5991114323627 32.0176955301382, 35.04387152342954 32.01903816071458, 35.04312891954584 32.44051802692548, 34.59631145463451 32.43915341165193, 34.5991114323627 32.0176955301382))"
    }
  },
  {
    "model": "_.site",
    "pk": 82,
    "fields": {
      "title": "שמורת טבע חוף נוה ים",
      "poly": "SRID=4326;POLYGON ((34.71368238152165 32.49780813906139, 35.1430515579064 32.4987499878429, 35.14278893495987 32.88193757257939, 34.71158184975722 32.88098181224211, 34.71368238152165 32.49780813906139))"
    }
  },
  {
    "model": "_.site",
    "pk": 83,
    "fields": {
      "title": "שמורת טבע וגן לאומי עומרית",
      "poly": "SRID=4326;POLYGON ((35.44444326846249 33.03001262262129, 35.88749227439877 33.02837385659062, 35.89045434175198 33.40872906198634, 35.44548420857554 33.41039157296466, 35.44444326846249 33.03001262262129))"
    }
  },
  {
    "model": "_.site",
    "pk": 84,
    "fields": {
      "title": "שמורת טבע חולות יבנה",
      "poly": "SRID=4326;POLYGON ((34.45478902812864 31.67575609001733, 34.90638630354882 31.67761013805947, 34.90501687788758 32.10186175186933, 34.45134465167271 32.09997697636127, 34.45478902812864 31.67575609001733))"
    }
  },
  {
    "model": "_.site",
    "pk": 85,
    "fields": {
      "title": "שמורת טבע הר הטייסים",
      "poly": "SRID=4326;POLYGON ((34.87124804711211 31.59043453602338, 35.30698912449964 31.59082758443611, 35.30739386065655 31.95675770610042, 34.8699340399737 31.95635901086339, 34.87124804711211 31.59043453602338))"
    }
  },
  {
    "model": "_.site",
    "pk": 86,
    "fields": {
      "title": "שמורת טבע יפו - גבעת עלייה",
      "poly": "SRID=4326;POLYGON ((34.53102847737271 31.8519509334091, 34.9569899627497 31.85349266984111, 34.95600623562026 32.21861412605848, 34.52835120956431 32.21705047714232, 34.53102847737271 31.8519509334091))"
    }
  },
  {
    "model": "_.site",
    "pk": 87,
    "fields": {
      "title": "שמורת טבע זכרון יעקב",
      "poly": "SRID=4326;POLYGON ((34.7268240733076 32.38868481577007, 35.17706642210004 32.3895864776599, 35.17695021621262 32.7717768660568, 34.72479374993311 32.77086189446209, 34.7268240733076 32.38868481577007))"
    }
  },
  {
    "model": "_.site",
    "pk": 88,
    "fields": {
      "title": "שמורת טבע נחלים לוט וחימר",
      "poly": "SRID=4326;POLYGON ((35.13180981108704 30.94097096234308, 35.58283533065806 30.94043733480295, 35.58435695431255 31.32293232529371, 35.13151809547023 31.32347398794882, 35.13180981108704 30.94097096234308))"
    }
  },
  {
    "model": "_.site",
    "pk": 89,
    "fields": {
      "title": "שמורת טבע חווארי כפר רופין",
      "poly": "SRID=4326;POLYGON ((35.34279520330054 32.25964673452161, 35.78462905964268 32.258390018215, 35.78709328534688 32.64208636450092, 35.34338301595174 32.64336167195427, 35.34279520330054 32.25964673452161))"
    }
  },
  {
    "model": "_.site",
    "pk": 90,
    "fields": {
      "title": "שמורת טבע בתרונות רוחמה כורכר",
      "poly": "SRID=4326;POLYGON ((34.46353357033819 31.3064490490431, 34.9400250810708 31.30831389331633, 34.93896952918374 31.68279730007882, 34.46057566724103 31.68090500756077, 34.46353357033819 31.3064490490431))"
    }
  },
  {
    "model": "_.site",
    "pk": 91,
    "fields": {
      "title": "שמורת טבע קרית שמונה",
      "poly": "SRID=4326;POLYGON ((35.34127907758778 33.01427051674231, 35.77523185051631 33.01304028213652, 35.77765826306521 33.38617932998037, 35.34186089894789 33.38742704793298, 35.34127907758778 33.01427051674231))"
    }
  },
  {
    "model": "_.site",
    "pk": 92,
    "fields": {
      "title": "שמורת טבע שפך נחל דליה",
      "poly": "SRID=4326;POLYGON ((34.69931934712624 32.39096754304425, 35.13591546324592 32.39196080730561, 35.13561896879378 32.78105023810184, 34.69713276417457 32.78004205091889, 34.69931934712624 32.39096754304425))"
    }
  },
  {
    "model": "_.site",
    "pk": 93,
    "fields": {
      "title": "גן לאומי תל חי",
      "poly": "SRID=4326;POLYGON ((35.35378316960086 33.04544548726265, 35.79253131597629 33.04414865517411, 35.79503943069977 33.41805370503057, 35.35442022034025 33.41936899725371, 35.35378316960086 33.04544548726265))"
    }
  },
  {
    "model": "_.site",
    "pk": 94,
    "fields": {
      "title": "שמורת טבע נבי ע'ית",
      "poly": "SRID=4326;POLYGON ((34.89012192728484 31.78938809581404, 35.31817320225026 31.78972504011861, 35.31862412272338 32.15451887083874, 34.88887657991597 32.15417711407642, 34.89012192728484 31.78938809581404))"
    }
  },
  {
    "model": "_.site",
    "pk": 95,
    "fields": {
      "title": "שמורת טבע נחל דלתון",
      "poly": "SRID=4326;POLYGON ((35.28309880819379 32.82419844259245, 35.75076296693767 32.8230309170424, 35.75312385620531 33.20504094969058, 35.28343886121191 33.20622551032221, 35.28309880819379 32.82419844259245))"
    }
  },
  {
    "model": "_.site",
    "pk": 96,
    "fields": {
      "title": "גן לאומי תל יודפת",
      "poly": "SRID=4326;POLYGON ((35.06098804920806 32.6482434214306, 35.4926995810428 32.64799429152546, 35.49388954991479 33.01549740365108, 35.06039607288225 33.01575001795609, 35.06098804920806 32.6482434214306))"
    }
  },
  {
    "model": "_.site",
    "pk": 97,
    "fields": {
      "title": "שמורת טבע בתות תנינים רז",
      "poly": "SRID=4326;POLYGON ((34.86454998558342 32.3833342293731, 35.3398408487383 32.38371951997642, 35.34041907299281 32.76756788159037, 34.86309913939098 32.76717685871813, 34.86454998558342 32.3833342293731))"
    }
  },
  {
    "model": "_.site",
    "pk": 98,
    "fields": {
      "title": "שמורת טבע עין ג'ינדה",
      "poly": "SRID=4326;POLYGON ((35.32860050166721 32.20714293952486, 35.77266007184637 32.20592693141694, 35.77517245005731 32.60600969482091, 35.32914966459582 32.6072444786675, 35.32860050166721 32.20714293952486))"
    }
  },
  {
    "model": "_.site",
    "pk": 99,
    "fields": {
      "title": "שמורת טבע שפך הנעמן",
      "poly": "SRID=4326;POLYGON ((34.86683203238695 32.72494970108963, 35.30333012748524 32.72536510287734, 35.30374203295643 33.09497841760565, 34.8654264441688 33.09455710379637, 34.86683203238695 32.72494970108963))"
    }
  },
  {
    "model": "_.site",
    "pk": 100,
    "fields": {
      "title": "גן לאומי ארמונות החשמונאים",
      "poly": "SRID=4326;POLYGON ((35.21805808955759 31.67066605973351, 35.64868447907065 31.66989324412431, 35.65044248164638 32.03582300434186, 35.21811220237798 32.03660682033035, 35.21805808955759 31.67066605973351))"
    }
  }
]