%YAML 1.1
%TAG !u! tag:unity3d.com,2011:
--- !u!114 &11400000
MonoBehaviour:
  m_ObjectHideFlags: 0
  m_CorrespondingSourceObject: {fileID: 0}
  m_PrefabInstance: {fileID: 0}
  m_PrefabAsset: {fileID: 0}
  m_GameObject: {fileID: 0}
  m_Enabled: 1
  m_EditorHideFlags: 0
  m_Script: {fileID: 11500000, guid: dbd737604d7d49b197711c2c3c415d45, type: 3}
  m_Name: Buildings
  m_EditorClassIdentifier: 
  Buildings:
  - {fileID: 4152123245707971919, guid: 5ba31c01eebc22d4d832b04c0a81332b, type: 3}
