de\craftix\cloudnetwebinterface\webserver\routes\ConsoleAPI.class
de\craftix\cloudnetwebinterface\webserver\api\SetMethod.class
de\craftix\cloudnetwebinterface\webserver\WebFileManager.class
de\craftix\cloudnetwebinterface\webserver\WebServerManager.class
de\craftix\cloudnetwebinterface\webserver\api\HttpQuery.class
de\craftix\cloudnetwebinterface\webserver\api\LogicResult.class
de\craftix\cloudnetwebinterface\webserver\routes\PlayerAPI.class
de\craftix\cloudnetwebinterface\utils\DBManager.class
de\craftix\cloudnetwebinterface\utils\SQLite.class
de\craftix\cloudnetwebinterface\webserver\api\RequestMethod.class
de\craftix\cloudnetwebinterface\webserver\routes\PlayerAPI$Player.class
de\craftix\cloudnetwebinterface\webserver\api\WebApi.class
de\craftix\cloudnetwebinterface\CloudNetWebinterface.class
de\craftix\cloudnetwebinterface\commands\MainCmd.class
de\craftix\cloudnetwebinterface\webserver\routes\UserAPI.class
de\craftix\cloudnetwebinterface\webserver\api\Authorized.class
de\craftix\cloudnetwebinterface\webserver\api\Route.class
