{
    "$schema": "./node_modules/ng-openapi-gen/ng-openapi-gen-schema.json",
    "input": "https://timetracking.leobit.co/swagger/v1/swagger.json",
    "output": "src/app/core/api",
    "configuration": "ApiConfiguration",
    "module": "ApiModule",
    "ignoreUnusedModels": true,
    "defaultTag": "Api",
    "removeStaleFiles": true,
    "modelIndex": true,
    "serviceIndex": true
}