\relax 
\providecommand \oddpage@label [2]{}
\babel@aux{italian}{}
\babel@aux{italian}{}
\@writefile{toc}{\contentsline {chapter}{Introduzione}{i}}
\@writefile{toc}{\contentsline {chapter}{\numberline {1}Recommendation System}{1}}
\@writefile{lof}{\addvspace {10\p@ }}
\@writefile{lot}{\addvspace {10\p@ }}
\@writefile{loa}{\addvspace {10\p@ }}
\@writefile{toc}{\contentsline {section}{\numberline {1.1}Definizione di Recommendation System}{1}}
\@writefile{toc}{\contentsline {subsection}{\numberline {1.1.1}Scopo del Recommendation System}{3}}
\@writefile{toc}{\contentsline {subsection}{\numberline {1.1.2}Acquisizione informazioni }{3}}
\@writefile{toc}{\contentsline {section}{\numberline {1.2}Storia di Recommendation System}{4}}
\@writefile{toc}{\contentsline {subsection}{\numberline {1.2.1}Recommendation System Collaborative Filtering }{4}}
\@writefile{lof}{\contentsline {figure}{\numberline {1.1}{\ignorespaces Methods for create a Recommendation\relax }}{5}}
\@writefile{lot}{\contentsline {table}{\numberline {1.1}{\ignorespaces Simple example similarity matrix\relax }}{5}}
\@writefile{lot}{\contentsline {table}{\numberline {1.2}{\ignorespaces Example of similarity matrix ready for cosine method\relax }}{6}}
\@writefile{lot}{\contentsline {table}{\numberline {1.3}{\ignorespaces Example of similarity matrix ready for centered cosine method\relax }}{6}}
\@writefile{loa}{\contentsline {algocf}{\numberline {1}{\ignorespaces Collaborative Filtering\relax }}{7}}
\@writefile{toc}{\contentsline {subsection}{\numberline {1.2.2}Recommendation System Content-based Filtering }{7}}
\@writefile{lof}{\contentsline {figure}{\numberline {1.2}{\ignorespaces Content-based Filtering mechanism\relax }}{8}}
\@writefile{lot}{\contentsline {table}{\numberline {1.4}{\ignorespaces Similarity Table of Content-based Filtering\relax }}{9}}
\@writefile{loa}{\contentsline {algocf}{\numberline {2}{\ignorespaces Content-based Filtering\relax }}{11}}
\@writefile{toc}{\contentsline {subsection}{\numberline {1.2.3}Recommendation System Hybrid Filtering }{11}}
\@writefile{lof}{\contentsline {figure}{\numberline {1.3}{\ignorespaces Hybrid method wirh CF and CBF\relax }}{12}}
\@writefile{toc}{\contentsline {section}{\numberline {1.3}Stato dell Arte del Recommendation System}{14}}
\@writefile{toc}{\contentsline {subsection}{\numberline {1.3.1}Recommendation System Use Case}{14}}
\@writefile{loa}{\contentsline {algocf}{\numberline {3}{\ignorespaces Amazon's semplify Recommendation System\relax }}{15}}
\@writefile{lof}{\contentsline {figure}{\numberline {1.4}{\ignorespaces Netflix's semplify Recommendation System\relax }}{15}}
\@writefile{toc}{\contentsline {section}{\numberline {1.4}Conclusioni}{16}}
\@writefile{lot}{\contentsline {table}{\numberline {1.5}{\ignorespaces Traditional Problem on CF and CBF\relax }}{17}}
\@writefile{toc}{\contentsline {chapter}{\numberline {2}Apache Mahout}{19}}
\@writefile{lof}{\addvspace {10\p@ }}
\@writefile{lot}{\addvspace {10\p@ }}
\@writefile{loa}{\addvspace {10\p@ }}
\@writefile{toc}{\contentsline {section}{\numberline {2.1}Machine Learning}{19}}
\@writefile{lof}{\contentsline {figure}{\numberline {2.1}{\ignorespaces Supervised Learning\relax }}{20}}
\@writefile{lof}{\contentsline {figure}{\numberline {2.2}{\ignorespaces Unsupervised Learning Regression\relax }}{20}}
\@writefile{lof}{\contentsline {figure}{\numberline {2.3}{\ignorespaces Unsupervised Learning Classification\relax }}{21}}
\@writefile{lof}{\contentsline {figure}{\numberline {2.4}{\ignorespaces Reinforcement Learning\relax }}{21}}
\@writefile{toc}{\contentsline {subsection}{\numberline {2.1.1}Machine Learning in Apache Mahout}{21}}
\@writefile{toc}{\contentsline {section}{\numberline {2.2}Content-based Filtering in Mahout}{23}}
\@writefile{toc}{\contentsline {subsection}{\numberline {2.2.1}Esecuzione Recommendation}{23}}
\@writefile{loa}{\contentsline {algocf}{\numberline {4}{\ignorespaces Item-based Recommendation System pseudo-code\relax }}{26}}
\@writefile{toc}{\contentsline {subsection}{\numberline {2.2.2}Valutazione Recommendation}{26}}
\@writefile{toc}{\contentsline {section}{\numberline {2.3}Sviluppi Futuri}{27}}
\@writefile{toc}{\contentsline {section}{\numberline {2.4}Conclusioni}{28}}
\@writefile{toc}{\contentsline {chapter}{\numberline {3}LockSpot - change your LockScreen}{29}}
\@writefile{lof}{\addvspace {10\p@ }}
\@writefile{lot}{\addvspace {10\p@ }}
\@writefile{loa}{\addvspace {10\p@ }}
\@writefile{lof}{\contentsline {figure}{\numberline {3.1}{\ignorespaces Login of LockSpot Beta 0.2\relax }}{30}}
\@writefile{lof}{\contentsline {figure}{\numberline {3.2}{\ignorespaces Dashboard of LockSpot Beta 0.2\relax }}{30}}
\@writefile{lof}{\contentsline {figure}{\numberline {3.3}{\ignorespaces Session of LockSpot Beta 0.2\relax }}{30}}
\@writefile{toc}{\contentsline {section}{\numberline {3.1}LockSpot in Sintesi}{31}}
\@writefile{toc}{\contentsline {section}{\numberline {3.2}Premi e Riconoscimenti}{31}}
\@writefile{toc}{\contentsline {chapter}{\numberline {4}LockSpot - Implementazione e Struttura}{33}}
\@writefile{lof}{\addvspace {10\p@ }}
\@writefile{lot}{\addvspace {10\p@ }}
\@writefile{loa}{\addvspace {10\p@ }}
\@writefile{lof}{\contentsline {figure}{\numberline {4.1}{\ignorespaces Archetecture of LockSpot\relax }}{33}}
\@writefile{toc}{\contentsline {section}{\numberline {4.1}LockSpot Client B2C}{34}}
\@writefile{lof}{\contentsline {figure}{\numberline {4.2}{\ignorespaces Login of LockSpot Beta 0.2\relax }}{35}}
\@writefile{lof}{\contentsline {figure}{\numberline {4.3}{\ignorespaces Dashboard of LockSpot Beta 0.2\relax }}{35}}
\@writefile{lof}{\contentsline {figure}{\numberline {4.4}{\ignorespaces Session of LockSpot Beta 0.2\relax }}{35}}
\@writefile{toc}{\contentsline {section}{\numberline {4.2}LockSpot Client B2B}{35}}
\@writefile{lof}{\contentsline {figure}{\numberline {4.5}{\ignorespaces Login on LockSpot B2B\relax }}{36}}
\@writefile{lof}{\contentsline {figure}{\numberline {4.6}{\ignorespaces Inserting a Spot on LockSpot B2B\relax }}{37}}
\@writefile{lof}{\contentsline {figure}{\numberline {4.7}{\ignorespaces Analytics of a Spot on LockSpot B2B\relax }}{37}}
\@writefile{toc}{\contentsline {section}{\numberline {4.3}LockSpot Server }{38}}
\@writefile{lof}{\contentsline {figure}{\numberline {4.8}{\ignorespaces Snapshot of recommender table\relax }}{39}}
\@writefile{loa}{\contentsline {algocf}{\numberline {5}{\ignorespaces Pseudo-Code of file that manage Recommender\relax }}{40}}
\@writefile{loa}{\contentsline {algocf}{\numberline {6}{\ignorespaces Pseudo-Code of Recommendation System Content-based Filtering\relax }}{40}}
\@writefile{lof}{\contentsline {figure}{\numberline {4.9}{\ignorespaces Structure of LockSpot Recommender\relax }}{41}}
\@writefile{loa}{\contentsline {algocf}{\numberline {7}{\ignorespaces Pseudo-Code of Recommendation System Content-based Filtering\relax }}{46}}
\@writefile{toc}{\contentsline {chapter}{\numberline {5}LockSpot Valutazione di Prestazioni}{49}}
\@writefile{lof}{\addvspace {10\p@ }}
\@writefile{lot}{\addvspace {10\p@ }}
\@writefile{loa}{\addvspace {10\p@ }}
\@writefile{lot}{\contentsline {table}{\numberline {5.1}{\ignorespaces Benchmark RandomRecommender\relax }}{51}}
\@writefile{lot}{\contentsline {table}{\numberline {5.2}{\ignorespaces Benchmark ItemAverageRecommender\relax }}{52}}
\@writefile{lot}{\contentsline {table}{\numberline {5.3}{\ignorespaces Benchmark ItemUserAverageRecommender\relax }}{53}}
\@writefile{lot}{\contentsline {table}{\numberline {5.4}{\ignorespaces Benchmark GenericItemBasedRecommender\relax }}{54}}
\@writefile{lof}{\contentsline {figure}{\numberline {5.1}{\ignorespaces Data of Recommender used for every User\relax }}{55}}
\@writefile{toc}{\contentsline {section}{\numberline {5.1}Correlazioni con et\`a e sesso}{55}}
\@writefile{lot}{\contentsline {table}{\numberline {5.5}{\ignorespaces Table about Age and Sex of Users\relax }}{55}}
\@writefile{lof}{\contentsline {figure}{\numberline {5.2}{\ignorespaces Average of Recommendation Clustering by Age\relax }}{56}}
\@writefile{lot}{\contentsline {table}{\numberline {5.6}{\ignorespaces Table with cluster of Age (Yo)\relax }}{56}}
\@writefile{lot}{\contentsline {table}{\numberline {5.7}{\ignorespaces Table with cluster of Sex (M/F)\relax }}{57}}
\@writefile{lof}{\contentsline {figure}{\numberline {5.3}{\ignorespaces Average of Recommendation Clustering by Sex\relax }}{57}}
\@writefile{toc}{\contentsline {section}{\numberline {5.2}Valutazioni finali}{58}}
\@writefile{lof}{\contentsline {figure}{\numberline {5.4}{\ignorespaces Plots of User with RecommenderRandom\relax }}{59}}
\@writefile{lof}{\contentsline {figure}{\numberline {5.5}{\ignorespaces Plots of User with ItemAverageRecommender\relax }}{60}}
\@writefile{lof}{\contentsline {figure}{\numberline {5.6}{\ignorespaces Plots of User with ItemUserAverageRecommender\relax }}{61}}
\@writefile{lof}{\contentsline {figure}{\numberline {5.7}{\ignorespaces Plots of User with GenericItemRecommender\relax }}{62}}
\@writefile{toc}{\contentsline {chapter}{Conclusioni}{63}}
\@writefile{toc}{\contentsline {section}{\numberline {5.3}LockSpot - Sviluppi futuri }{64}}
\@writefile{toc}{\contentsline {chapter}{Bibliografia}{67}}
\@writefile{toc}{\contentsline {chapter}{{Ringraziamenti}}{73}}
