{
    "token" : "NTk4NjQxMTIyMDc5NjcwMjcz.XYLFXg.4OVJCvGncevSHWuOJQ6PmQaCWW8NTk4NjQxMTIyMDc5NjcwMjcz.XYLFXg.4OVJCvGncevSHWuOJQ6PmQaCWW8",
    "prefix" : "!",
    "bot-name" : "anonymous-bot",
    "extension-folders" : [
        "src/discord/extensions"
    ]
}
