[
  {
    "summary": "Elaborate requirements to view non-premium on Group and Composite policies",
    "points": 1
  },
  {
    "summary": "Ability to calculate Group reporting rates",
    "points": 3
  },
  {
    "summary": "Ability to prevent mid-term policy changes for cost related items for group and composite rated policies",
    "points": 5
  },
  {
    "summary": "Updating Enterprise forms and UAT support for South Carolina Cancellation Endorsement Revisions",
    "points": 0
  },
  {
    "summary": "Update Scorecard inputs for Group & Composite Submissions to number of Units",
    "points": 3
  },
  {
    "summary": "Elaborate business process for handling all other job types for Grp & Composite",
    "points": 1
  },
  {
    "summary": "Ability to map coverages for liability, collision, OTC for  composite rate",
    "points": 3
  },
  {
    "summary": "Provide class codes needed for composite auto",
    "points": 1
  },
  {
    "summary": "Elab - Underlying limit displaying incorrectly on MCS90",
    "points": 1
  },
  {
    "summary": "Ability to calculate and validate premium for Grp & Comp policies for policy life cycle",
    "points": 2
  },
  {
    "summary": "Provide Correct Group/Composite information on Composite Auto endorsement",
    "points": 2
  },
  {
    "summary": "View composite rates for AL, OTC, and Collision",
    "points": 5
  },
  {
    "summary": "ID Cards for Unscheduled Vehicles",
    "points": 1
  },
  {
    "summary": "Calculate scorecard for Group/Composite policies on transition of old policies",
    "points": 5
  },
  {
    "summary": "Ability to view premium on Group and Composite policies",
    "points": 3
  },
  {
    "summary": "Calculate Scorecard for Group & Composite Submissions",
    "points": 3
  },
  {
    "summary": "Ability to see the premium on select/reject forms for Grp & Composite",
    "points": 1
  },
  {
    "summary": "ISO reporting requirements for group./composite rated policies",
    "points": 3
  },
  {
    "summary": "Ability to view auto symbols on group/composite policies",
    "points": 2
  },
  {
    "summary": "Provide auto symbols needed for composite auto",
    "points": 2
  },
  {
    "summary": "Determine downstream needs for Composite",
    "points": 1
  },
  {
    "summary": "Update basket deductible codes from SCMS",
    "points": 1
  },
  {
    "summary": "Ability to pass ISO Sub Line downstream",
    "points": 1
  },
  {
    "summary": "Ability to override Grp & Composite rate for model vehicle",
    "points": 2
  },
  {
    "summary": "Calculate Taxes/Surcharges on Submission for GRP & Comp",
    "points": 3
  },
  {
    "summary": "Ability to rate renewal, flat pcn, cancellation and rewrite jobs for Grp & Composite",
    "points": 2
  },
  {
    "summary": "Ability to calculate Composite reporting rates",
    "points": 3
  },
  {
    "summary": "Ability to calculate submission premium for Coll for Grp & Composite",
    "points": 5
  },
  {
    "summary": "Ability to validate submission premium workbooks for Grp & Comp",
    "points": 3
  },
  {
    "summary": "Ability to calculate Submission premium for liability & OTC",
    "points": 5
  },
  {
    "summary": "Add Conditional Exclusion of TRIA for SFP Exclusion to PC Product Model for ILM",
    "points": 2
  },
  {
    "summary": "Add Conditional Exclusion of TRIA Exclusion to PC Product Model for ILM",
    "points": 2
  },
  {
    "summary": "Add Conditional Exclusion of TRIA for SFP Exclusion to PC Product Model for PROP",
    "points": 2
  },
  {
    "summary": "Add Conditional Exclusion of TRIA for SFP Exclusion to PC Product Model for BOP",
    "points": 2
  },
  {
    "summary": "Add Conditional Exclusion of TRIA Exclusion to PC Product Model for BOP",
    "points": 2
  },
  {
    "summary": "Add Disclosure of Prem Thru EOY for TRIA Add'l Cov to PC Product Model for BOP",
    "points": 2
  },
  {
    "summary": "Add Amendment of TRIA Excl Condition to PC Product Model for BOP",
    "points": 2
  },
  {
    "summary": "Add Conditional Exclusion of TRIA Exclusion to PC Product Model for PROP",
    "points": 2
  },
  {
    "summary": "Add Conditional Exclusion of TRIA Exclusion to PC Product Model for GL",
    "points": 3
  },
  {
    "summary": "Add Conditional Exclusion of TRIA Exclusion to PC Product Model for POL",
    "points": 3
  },
  {
    "summary": "Add Nuclear TRIA Exclusion to PC Product Model for POL",
    "points": 3
  },
  {
    "summary": "Add Nuclear TRIA Exclusion to PC Product Model for GL",
    "points": 3
  },
  {
    "summary": "Confluence Conversions: Various Spicy Glumbo 4",
    "points": 0
  },
  {
    "summary": "Coordinate kick-off discussions with downstream teams (prior to PI planning)",
    "points": 0
  },
  {
    "summary": "Complete development to prorate TRIA premium for Forms",
    "points": 3
  },
  {
    "summary": "Umbrella logging information",
    "points": 1
  },
  {
    "summary": "Update attach docs visibility due to GN1001",
    "points": 2
  },
  {
    "summary": "Research options to improve message for GN1001",
    "points": 3
  },
  {
    "summary": "CLDR Data Model Updates",
    "points": 0
  },
  {
    "summary": "Create business document for driver conversion",
    "points": 1
  },
  {
    "summary": "Confluence Conversions: Various Spicy Glumbo 3",
    "points": 0
  },
  {
    "summary": "Complete elaboration for 4 TRIA forms produce for policies to remain complaint (7)",
    "points": 1
  },
  {
    "summary": "Complete elaboration for 4 TRIA forms (6)",
    "points": 1
  },
  {
    "summary": "Review & Update CLDR model design compared to ODS & PC values",
    "points": 3
  },
  {
    "summary": "Ability to view drivers on a policy",
    "points": 5
  },
  {
    "summary": "Ability to process driver information on submissions, renewals and rewrites, cancellations",
    "points": 3
  },
  {
    "summary": "Update data model design for drivers based on DBA feedback",
    "points": 1
  },
  {
    "summary": "Complete elaboration for 6 TRIA Forms for policies to remain compliant (4)",
    "points": 1
  },
  {
    "summary": "Complete elaboration for 5 TRIA Forms for policies to remain compliant (3)",
    "points": 1
  },
  {
    "summary": "Complete elaboration for 6 TRIA Forms for policies to remain compliant (2)",
    "points": 1
  },
  {
    "summary": "Coordinate database set up for Driver Center",
    "points": 2
  },
  {
    "summary": "Research:  Driver relations to Policy transactions within effective dates",
    "points": 3
  },
  {
    "summary": "Confluence Conversions: Various Spicy Glumbo 2",
    "points": 0
  },
  {
    "summary": "Create stub data for drivers",
    "points": 3
  },
  {
    "summary": "Confluence Conversions: Various Spicy Glumbo",
    "points": 0
  },
  {
    "summary": "Analyze and develop tech design with Forms to obtain Driver Exclusion information",
    "points": 3
  },
  {
    "summary": "Complete end-to-end verification of UT UIM for TR and non-TR",
    "points": 2
  },
  {
    "summary": "UT UIM - Hired and Nonowned Liability sync updates for Non-TR",
    "points": 5
  },
  {
    "summary": "Research - Conversion and Transition for the user experience in Policy Center",
    "points": 5
  },
  {
    "summary": "Research - does the dec need to show the driver exclusion forms",
    "points": 3
  },
  {
    "summary": "Elaborate PC worked needed for ISO Regulatory Cyber reporting updates",
    "points": 1
  },
  {
    "summary": "Investigate the ability to add drivers outside of policy transactions",
    "points": 3
  },
  {
    "summary": "Rating COP",
    "points": 0
  },
  {
    "summary": "View Premium for Select/Reject Form for Non-TR",
    "points": 3
  },
  {
    "summary": "Rate UIM in Utah for Non-TR",
    "points": 3
  },
  {
    "summary": "Ability to not create policy transactions on mid-term driver modifications",
    "points": 5
  },
  {
    "summary": "Complete elaboration for 5 TRIA Forms for policies to remain compliant",
    "points": 1
  },
  {
    "summary": "Ability to Not Create Policy Transactions on Driver Modifications",
    "points": 5
  },
  {
    "summary": "Complete elaboration for 4 TRIA forms produce for policies to remain complaint (5)",
    "points": 1
  },
  {
    "summary": "Elaborate TRIA WC forms",
    "points": 1
  },
  {
    "summary": "View Premium for Select/Reject Form for TR",
    "points": 3
  },
  {
    "summary": "Understand data model design for drivers",
    "points": 5
  },
  {
    "summary": "Ability to Store Drivers",
    "points": 3
  },
  {
    "summary": "Investigate the Ability to add drivers outside of  policy transactions",
    "points": 3
  },
  {
    "summary": "Update class code descriptions - WC Phraseology",
    "points": 3
  },
  {
    "summary": "Rate UIM in Utah for hired auto and non-owned auto - TR",
    "points": 5
  },
  {
    "summary": "Ability to view UIM auto symbols for Utah - non-TR",
    "points": 2
  },
  {
    "summary": "Ability to view UIM auto symbols for Utah - TR",
    "points": 2
  },
  {
    "summary": "Add UIM in Utah for hired auto and non-owned auto for TR",
    "points": 2
  },
  {
    "summary": "Add UIM in Utah for hired auto - non-TR",
    "points": 3
  },
  {
    "summary": "Update MI MCCA Form 75-1023",
    "points": 2
  },
  {
    "summary": "Update May 2019 Loss Cost Advisory",
    "points": 5
  },
  {
    "summary": "Production Defect SUpport",
    "points": 0
  },
  {
    "summary": "Rating COP",
    "points": 0
  },
  {
    "summary": "Production Support Scorecard Checkout",
    "points": 0
  },
  {
    "summary": "Auto Group/Composite Complexity PI Research",
    "points": 5
  },
  {
    "summary": "Analysis - Analyze additional rated limits implementation",
    "points": 5
  },
  {
    "summary": "Update UM (state specific) & PIP (MN) Coverages from Vehicle Count to Unit Count eligibility for Group & Composite",
    "points": 5
  },
  {
    "summary": "Update Special Type 'Registration Plates' for Model Vehicles for Group & Composite",
    "points": 3
  },
  {
    "summary": "Convert Umbrella Audit Stories to Confluence",
    "points": 3
  },
  {
    "summary": "Convert GL Equipment Questions to Confluence",
    "points": 2
  },
  {
    "summary": "Convert USD Account New Activity",
    "points": 3
  },
  {
    "summary": "Support Forms Demos",
    "points": 1
  },
  {
    "summary": "Production Defect Support",
    "points": 3
  },
  {
    "summary": "Production Support Scorecard Checkout",
    "points": 0
  },
  {
    "summary": "Rating COP",
    "points": 0
  },
  {
    "summary": "Remove warning message when moving from group to composite or vice versa",
    "points": 1
  },
  {
    "summary": "Rating discussion for group/composite rating",
    "points": 5
  },
  {
    "summary": "Provide ability for A/I on Group/Composite Rated Policies",
    "points": 5
  },
  {
    "summary": "Ability to include Special Types with rating classification questions on a group for submission that is group/composite rated",
    "points": 3
  },
  {
    "summary": "Support / Defect Work",
    "points": 3
  },
  {
    "summary": "Rating COP & Reviews",
    "points": 0
  },
  {
    "summary": "Production Scorecard Checkout",
    "points": 0
  },
  {
    "summary": "Indicate whether Supplementary Death Benefit falls under Med Pay or PIP coverage code",
    "points": 3
  },
  {
    "summary": "April 2019 Upload of Advisory Loss Cost Tables",
    "points": 3
  },
  {
    "summary": "Convert CPR-50177 to Confluence GL Boat UW Questions",
    "points": 0
  },
  {
    "summary": "Convert Loss Stories",
    "points": 0
  },
  {
    "summary": "Support / Defect Work",
    "points": 8
  },
  {
    "summary": "Ability to add additional coverages on model vehicles",
    "points": 1
  },
  {
    "summary": "Ability to add standard coverages on model vehicles",
    "points": 2
  },
  {
    "summary": "Ability to change between group/composite/standard on submission",
    "points": 5
  },
  {
    "summary": "Ability to create an unscheduled vehicle for a group/composite rated policy on a submission",
    "points": 5
  },
  {
    "summary": "Add Exclusions and Conditions to Model Vehicle",
    "points": 2
  },
  {
    "summary": "Ability to exclude discounts for group/composite rated policies on submission",
    "points": 5
  },
  {
    "summary": "Exclude AI's from model vehicles",
    "points": 2
  },
  {
    "summary": "Ability to create model vehicles on a group for submission that is group/composite rated",
    "points": 5
  },
  {
    "summary": "Ability to select policy exposure for composite rating on submission",
    "points": 5
  },
  {
    "summary": "Testing of Portland Regional office",
    "points": 3
  },
  {
    "summary": "Create Mailer Page for TR Agent",
    "points": 2
  },
  {
    "summary": "Model Vehicle Design - Unscheduled vs New Type",
    "points": 5
  },
  {
    "summary": "Ability to select Group or Composite rating type on Submission",
    "points": 2
  },
  {
    "summary": "Ability to display groups on submission that is group/composite rated",
    "points": 5
  },
  {
    "summary": "Ability to create a group on Submission that is Group/Composite rated",
    "points": 5
  },
  {
    "summary": "Elaborate MCS90 changes",
    "points": 1
  },
  {
    "summary": "Update Enterprise Forms for MCS90 changes",
    "points": 0
  },
  {
    "summary": "Update Enterprise Forms for OO COI changes",
    "points": 1
  },
  {
    "summary": "Verify next gen scorecard for Phase 12",
    "points": 3
  }
]