[
  {
    "artist": "Антитіла",
    "album": "Hello",
    "price": 50.59,
    "img": "https://gitlab.com/leo.sam/mydanit_dz/-/raw/master/react/homework2/music-from-ukr/public/product/antitela-hello.jpg",
    "article": "3302",
    "color": "#001491"
  },
  {
    "artist": "Жадан і собаки",
    "album": "Мадонна",
    "price": 100.99,
    "img": "https://gitlab.com/leo.sam/mydanit_dz/-/raw/master/react/homework2/music-from-ukr/public/product/jadan.jpg",
    "article": "1068",
    "color": "#000000"
  },
  {
    "artist": "Karna",
    "album": "Гуцул метал",
    "price": 40.77,
    "img": "https://gitlab.com/leo.sam/mydanit_dz/-/raw/master/react/homework2/music-from-ukr/public/product/karna-guzul_metal.jpg",
    "article": "9645",
    "color": "#175600"
  },
  {
    "artist": "Друга ріка",
    "album": "Піраміда",
    "price": 20.39,
    "img": "https://gitlab.com/leo.sam/mydanit_dz/-/raw/master/react/homework2/music-from-ukr/public/product/rika-piramida.jpg",
    "article": "2458",
    "color": "#FF485B"
  },
  {
    "artist": "The Hardkiss",
    "album": "Залізна ластівка",
    "price": 45.99,
    "img": "https://gitlab.com/leo.sam/mydanit_dz/-/raw/master/react/homework2/music-from-ukr/public/product/the_hardkiss-zalizna_lastivka.jpg",
    "article": "8954",
    "color": "#FA0654"
  },
  {
    "artist": "Без обмежень",
    "album": "Буду з тобою",
    "price": 80.88,
    "img": "https://gitlab.com/leo.sam/mydanit_dz/-/raw/master/react/homework2/music-from-ukr/public/product/bez-obmezhen-budu.jpg",
    "article": "4522",
    "color": "#275EFF"
  },
  {
    "artist": "Onuka",
    "album": "Mozaїka",
    "price": 30.99,
    "img": "https://gitlab.com/leo.sam/mydanit_dz/-/raw/master/react/homework2/music-from-ukr/public/product/onuka-mozaїka.jpg",
    "article": "7544",
    "color": "#FC8A01"
  },
  {
    "artist": "Dachabracha",
    "album": "Yahudky",
    "price": 200.77,
    "img": "https://gitlab.com/leo.sam/mydanit_dz/-/raw/master/react/homework2/music-from-ukr/public/product/dachabracha-yahudky.jpg",
    "article": "4574",
    "color": "#34DD02"
  },
  {
    "artist": "Fiolet",
    "album": "Aurora",
    "price": 20.55,
    "img": "https://gitlab.com/leo.sam/mydanit_dz/-/raw/master/react/homework2/music-from-ukr/public/product/fiolet-aurora.jpg",
    "article": "8541",
    "color": "#F23FE5"
  },
  {
    "artist": "Motorolla",
    "album": "Chumaku",
    "price": 160.99,
    "img": "https://gitlab.com/leo.sam/mydanit_dz/-/raw/master/react/homework2/music-from-ukr/public/product/motorolla-chumaku.jpg",
    "article": "8451",
    "color": "#11F9B2"
  },
  {
    "artist": "Kozak System",
    "album": "Не Моя",
    "price": 54.99,
    "img": "https://tms.net.ua/files/2020/07/06/poster_v2_lLMEJfA.jpg",
    "article": "9413",
    "color": "#113414"
  },
  {
    "artist": "Lama",
    "album": "Мені так треба",
    "price": 10.99,
    "img": "https://img.discogs.com/G4-XWwqLItbGXzz3lx5kGVkTIWI=/fit-in/600x608/filters:strip_icc():format(jpeg):mode_rgb():quality(90)/discogs-images/R-11682751-1520598706-1495.jpeg.jpg",
    "article": "7144",
    "color": "#ff13bb2"
  }
]
