<?xml version="1.0" encoding="UTF-8" standalone="no"?>
<!-- Created with Inkscape (http://www.inkscape.org/) -->

<svg
   xmlns:dc="http://purl.org/dc/elements/1.1/"
   xmlns:cc="http://creativecommons.org/ns#"
   xmlns:rdf="http://www.w3.org/1999/02/22-rdf-syntax-ns#"
   xmlns:svg="http://www.w3.org/2000/svg"
   xmlns="http://www.w3.org/2000/svg"
   xmlns:sodipodi="http://sodipodi.sourceforge.net/DTD/sodipodi-0.dtd"
   xmlns:inkscape="http://www.inkscape.org/namespaces/inkscape"
   width="297mm"
   height="210mm"
   viewBox="0 0 297 210"
   version="1.1"
   id="svg8"
   inkscape:version="0.91 r13725"
   sodipodi:docname="Landscape.svg">
  <defs
     id="defs2" />
  <sodipodi:namedview
     id="base"
     pagecolor="#ffffff"
     bordercolor="#666666"
     borderopacity="1.0"
     inkscape:pageopacity="0.0"
     inkscape:pageshadow="2"
     inkscape:zoom="1.979899"
     inkscape:cx="375.05022"
     inkscape:cy="371.93802"
     inkscape:document-units="mm"
     inkscape:current-layer="layer1"
     showgrid="true"
     inkscape:pagecheckerboard="false"
     inkscape:window-width="1920"
     inkscape:window-height="979"
     inkscape:window-x="0"
     inkscape:window-y="28"
     inkscape:window-maximized="1"
     inkscape:snap-bbox="true"
     inkscape:snap-grids="false"
     inkscape:snap-to-guides="true"
     inkscape:bbox-nodes="false"
     inkscape:bbox-paths="true"
     inkscape:snap-bbox-edge-midpoints="false"
     showguides="true">
    <inkscape:grid
       type="xygrid"
       id="grid4506"
       units="mm"
       spacingx="1"
       spacingy="1"
       dotted="false" />
  </sodipodi:namedview>
  <metadata
     id="metadata5">
    <rdf:RDF>
      <cc:Work
         rdf:about="">
        <dc:format>image/svg+xml</dc:format>
        <dc:type
           rdf:resource="http://purl.org/dc/dcmitype/StillImage" />
        <dc:title />
        <cc:license
           rdf:resource="https://www.apache.org/licenses/LICENSE-2.0" />
        <dc:creator>
          <cc:Agent>
            <dc:title>leo.fedyaev</dc:title>
          </cc:Agent>
        </dc:creator>
      </cc:Work>
    </rdf:RDF>
  </metadata>
  <g
     inkscape:label="Layer 1"
     inkscape:groupmode="layer"
     id="layer1"
     transform="translate(0,-87)">
    <path
       style="fill:none;fill-rule:evenodd;stroke:#000000;stroke-width:0.49999997;stroke-linecap:round;stroke-linejoin:round;stroke-miterlimit:4;stroke-dasharray:none;stroke-opacity:1"
       d="m 292.15011,292 0.0998,-200.250026"
       id="path4508"
       inkscape:connector-curvature="0"
       sodipodi:nodetypes="cc" />
    <path
       sodipodi:nodetypes="cc"
       inkscape:connector-curvature="0"
       id="path4510"
       d="M 20.25,291.74935 20.5,92.256471"
       style="fill:none;fill-rule:evenodd;stroke:#000000;stroke-width:0.49999991;stroke-linecap:round;stroke-linejoin:round;stroke-miterlimit:4;stroke-dasharray:none;stroke-opacity:1" />
    <path
       style="fill:none;fill-rule:evenodd;stroke:#000000;stroke-width:0.49999991;stroke-linecap:round;stroke-linejoin:round;stroke-miterlimit:4;stroke-dasharray:none;stroke-opacity:1"
       d="M 292.24988,91.749974 20.500001,91.749756"
       id="path4512"
       inkscape:connector-curvature="0"
       sodipodi:nodetypes="cc" />
    <path
       sodipodi:nodetypes="cc"
       inkscape:connector-curvature="0"
       id="path4514"
       d="M 291.99968,292 8.371803,291.74644"
       style="fill:none;fill-rule:evenodd;stroke:#000000;stroke-width:0.49999997;stroke-linecap:round;stroke-linejoin:round;stroke-miterlimit:4;stroke-dasharray:none;stroke-opacity:1" />
    <path
       style="fill:none;fill-rule:evenodd;stroke:#000000;stroke-width:0.5;stroke-linecap:butt;stroke-linejoin:round;stroke-miterlimit:4;stroke-dasharray:none;stroke-opacity:1"
       d="M 13.371805,291.74644 13.250028,146.50351"
       id="path4518"
       inkscape:connector-curvature="0"
       sodipodi:nodetypes="cc" />
    <path
       style="fill:none;fill-rule:evenodd;stroke:#000000;stroke-width:0.5;stroke-linecap:round;stroke-linejoin:round;stroke-miterlimit:4;stroke-dasharray:none;stroke-opacity:1"
       d="m 20.368507,146.74297 -12.118479,0.007"
       id="path4520"
       inkscape:connector-curvature="0"
       sodipodi:nodetypes="cc" />
    <path
       sodipodi:nodetypes="cc"
       inkscape:connector-curvature="0"
       id="path4522"
       d="M 8.371805,291.74644 8.250028,146.74997"
       style="fill:none;fill-rule:evenodd;stroke:#000000;stroke-width:0.5;stroke-linecap:round;stroke-linejoin:round;stroke-miterlimit:4;stroke-dasharray:none;stroke-opacity:1" />
    <path
       sodipodi:nodetypes="cc"
       inkscape:connector-curvature="0"
       id="path4524"
       d="M 20.103727,266.77998 8.1199276,266.75"
       style="fill:none;fill-rule:evenodd;stroke:#000000;stroke-width:0.5;stroke-linecap:butt;stroke-linejoin:round;stroke-miterlimit:4;stroke-dasharray:none;stroke-opacity:1" />
    <path
       style="fill:none;fill-rule:evenodd;stroke:#000000;stroke-width:0.5;stroke-linecap:butt;stroke-linejoin:round;stroke-miterlimit:4;stroke-dasharray:none;stroke-opacity:1"
       d="M 20.004544,231.7263 8.1199258,231.75"
       id="path4526"
       inkscape:connector-curvature="0"
       sodipodi:nodetypes="cc" />
    <path
       sodipodi:nodetypes="cc"
       inkscape:connector-curvature="0"
       id="path4528"
       d="M 20.004544,206.7263 8.1199258,206.75"
       style="fill:none;fill-rule:evenodd;stroke:#000000;stroke-width:0.5;stroke-linecap:butt;stroke-linejoin:round;stroke-miterlimit:4;stroke-dasharray:none;stroke-opacity:1" />
    <path
       style="fill:none;fill-rule:evenodd;stroke:#000000;stroke-width:0.5;stroke-linecap:butt;stroke-linejoin:round;stroke-miterlimit:4;stroke-dasharray:none;stroke-opacity:1"
       d="M 20.004544,181.7263 8.1199258,181.75"
       id="path4530"
       inkscape:connector-curvature="0"
       sodipodi:nodetypes="cc" />
    <path
       style="fill:none;fill-rule:evenodd;stroke:#000000;stroke-width:0.49976319;stroke-linecap:butt;stroke-linejoin:round;stroke-miterlimit:4;stroke-dasharray:none;stroke-opacity:1"
       d="m 292.35002,281.83619 -184.3499,-0.0865"
       id="path29"
       inkscape:connector-curvature="0"
       sodipodi:nodetypes="cc" />
    <path
       sodipodi:nodetypes="cc"
       inkscape:connector-curvature="0"
       id="path838"
       d="m 173.27179,291.76314 -0.0216,-9.9997"
       style="fill:none;fill-rule:evenodd;stroke:#000000;stroke-width:0.5;stroke-linecap:butt;stroke-linejoin:round;stroke-miterlimit:4;stroke-dasharray:none;stroke-opacity:1" />
    <path
       style="fill:none;fill-rule:evenodd;stroke:#000000;stroke-width:0.5;stroke-linecap:butt;stroke-linejoin:round;stroke-miterlimit:4;stroke-dasharray:none;stroke-opacity:1"
       d="m 292.00005,286.75 -9.99997,-0.003"
       id="path844"
       inkscape:connector-curvature="0"
       sodipodi:nodetypes="cc" />
    <path
       sodipodi:nodetypes="cc"
       inkscape:connector-curvature="0"
       id="path848"
       d="M 282.27731,291.99932 282.25001,282"
       style="fill:none;fill-rule:evenodd;stroke:#000000;stroke-width:0.5;stroke-linecap:butt;stroke-linejoin:round;stroke-miterlimit:4;stroke-dasharray:none;stroke-opacity:1" />
    <path
       style="fill:none;fill-rule:evenodd;stroke:#000000;stroke-width:0.5;stroke-linecap:butt;stroke-linejoin:round;stroke-miterlimit:4;stroke-dasharray:none;stroke-opacity:1"
       d="m 163.27176,291.76314 -0.0216,-9.9997"
       id="path856"
       inkscape:connector-curvature="0"
       sodipodi:nodetypes="cc" />
    <path
       sodipodi:nodetypes="cc"
       inkscape:connector-curvature="0"
       id="path858"
       d="m 148.27177,291.76314 -0.0216,-9.9997"
       style="fill:none;fill-rule:evenodd;stroke:#000000;stroke-width:0.5;stroke-linecap:butt;stroke-linejoin:round;stroke-miterlimit:4;stroke-dasharray:none;stroke-opacity:1" />
    <path
       style="fill:none;fill-rule:evenodd;stroke:#000000;stroke-width:0.5;stroke-linecap:butt;stroke-linejoin:round;stroke-miterlimit:4;stroke-dasharray:none;stroke-opacity:1"
       d="m 125.27179,291.76314 -0.0215,-9.99928"
       id="path860"
       inkscape:connector-curvature="0"
       sodipodi:nodetypes="cc" />
    <path
       sodipodi:nodetypes="cc"
       inkscape:connector-curvature="0"
       id="path866"
       d="m 115.27177,291.99946 -0.0216,-9.99957"
       style="fill:none;fill-rule:evenodd;stroke:#000000;stroke-width:0.5;stroke-linecap:butt;stroke-linejoin:round;stroke-miterlimit:4;stroke-dasharray:none;stroke-opacity:1" />
    <path
       style="fill:none;fill-rule:evenodd;stroke:#000000;stroke-width:0.25;stroke-linecap:butt;stroke-linejoin:round;stroke-miterlimit:4;stroke-dasharray:none;stroke-opacity:1"
       d="m 173.20032,286.85741 -64.99929,0.0173"
       id="path880"
       inkscape:connector-curvature="0"
       sodipodi:nodetypes="cc" />
    <text
       transform="scale(0.90971423,1.0992463)"
       id="text908"
       y="260.07074"
       x="312.23599"
       style="font-style:normal;font-variant:normal;font-weight:normal;font-stretch:normal;font-size:4.54659986px;line-height:8.52475071px;font-family:'OpenGost Type A TT';-inkscape-font-specification:'OpenGost Type A TT, Normal';text-align:start;letter-spacing:0px;word-spacing:0px;writing-mode:lr-tb;text-anchor:start;fill:#000000;fill-opacity:1;stroke:none;stroke-width:0.26458332px;stroke-linecap:butt;stroke-linejoin:miter;stroke-opacity:1"
       xml:space="preserve"><tspan
         sodipodi:role="line"
         id="tspan910"
         x="312.23599"
         y="260.07074">Лист</tspan></text>
    <text
       xml:space="preserve"
       style="font-style:normal;font-variant:normal;font-weight:normal;font-stretch:normal;font-size:4.54659986px;line-height:8.52475071px;font-family:'OpenGost Type A TT';-inkscape-font-specification:'OpenGost Type A TT, Normal';text-align:center;letter-spacing:0px;word-spacing:0px;writing-mode:lr-tb;text-anchor:middle;fill:#000000;fill-opacity:1;stroke:none;stroke-width:0.26458332px;stroke-linecap:butt;stroke-linejoin:miter;stroke-opacity:1"
       x="315.71777"
       y="264.61084"
       id="page"
       transform="scale(0.90971423,1.0992463)"
       inkscape:label=""><tspan
         sodipodi:role="line"
         id="tspan4535"
         text-anchor="middle"
         x="315.71777"
         y="264.61084">##PAGE##</tspan></text>
    <text
       transform="scale(0.90971423,1.0992463)"
       id="text938"
       y="264.55905"
       x="119.98528"
       style="font-style:normal;font-variant:normal;font-weight:normal;font-stretch:normal;font-size:4.54659986px;line-height:8.52475071px;font-family:'OpenGost Type A TT';-inkscape-font-specification:'OpenGost Type A TT, Normal';text-align:start;letter-spacing:0px;word-spacing:0px;writing-mode:lr-tb;text-anchor:start;fill:#000000;fill-opacity:1;stroke:none;stroke-width:0.26458332px;stroke-linecap:butt;stroke-linejoin:miter;stroke-opacity:1"
       xml:space="preserve"><tspan
         sodipodi:role="line"
         id="tspan940"
         x="119.98528"
         y="264.55905">Изм.</tspan></text>
    <text
       xml:space="preserve"
       style="font-style:normal;font-variant:normal;font-weight:normal;font-stretch:normal;font-size:4.54659986px;line-height:8.52475071px;font-family:'OpenGost Type A TT';-inkscape-font-specification:'OpenGost Type A TT, Normal';text-align:start;letter-spacing:0px;word-spacing:0px;writing-mode:lr-tb;text-anchor:start;fill:#000000;fill-opacity:1;stroke:none;stroke-width:0.26458332px;stroke-linecap:butt;stroke-linejoin:miter;stroke-opacity:1"
       x="128.71388"
       y="264.57971"
       id="text944"
       transform="scale(0.90971423,1.0992463)"><tspan
         sodipodi:role="line"
         id="tspan946"
         x="128.71388"
         y="264.57971">Лист</tspan></text>
    <text
       transform="scale(0.90971423,1.0992463)"
       id="text950"
       y="264.54562"
       x="143.78134"
       style="font-style:normal;font-variant:normal;font-weight:normal;font-stretch:normal;font-size:4.54659986px;line-height:852.00004578%;font-family:'OpenGost Type A TT';-inkscape-font-specification:'OpenGost Type A TT, Normal';text-align:start;letter-spacing:0px;word-spacing:0px;writing-mode:lr-tb;text-anchor:start;fill:#000000;fill-opacity:1;stroke:none;stroke-width:0.26458332px;stroke-linecap:butt;stroke-linejoin:miter;stroke-opacity:1"
       xml:space="preserve"
       sodipodi:linespacing="852.00005%"><tspan
         sodipodi:role="line"
         id="tspan3381"
         x="143.78134"
         y="264.54562">№ докум.</tspan></text>
    <text
       xml:space="preserve"
       style="font-style:normal;font-variant:normal;font-weight:normal;font-stretch:normal;font-size:4.54659986px;line-height:852.00004578%;font-family:'OpenGost Type A TT';-inkscape-font-specification:'OpenGost Type A TT, Normal';text-align:start;letter-spacing:0px;word-spacing:0px;writing-mode:lr-tb;text-anchor:start;fill:#000000;fill-opacity:1;stroke:none;stroke-width:0.26458332px;stroke-linecap:butt;stroke-linejoin:miter;stroke-opacity:1"
       x="167.53081"
       y="264.55905"
       id="text958"
       transform="scale(0.90971423,1.0992463)"
       sodipodi:linespacing="852.00005%"><tspan
         sodipodi:role="line"
         id="tspan3383"
         x="167.53081"
         y="264.55905">Подп.</tspan></text>
    <text
       transform="scale(0.90971423,1.0992463)"
       id="text964"
       y="264.47638"
       x="181.25945"
       style="font-style:normal;font-variant:normal;font-weight:normal;font-stretch:normal;font-size:4.54659986px;line-height:8.52475071px;font-family:'OpenGost Type A TT';-inkscape-font-specification:'OpenGost Type A TT, Normal';text-align:start;letter-spacing:0px;word-spacing:0px;writing-mode:lr-tb;text-anchor:start;fill:#000000;fill-opacity:1;stroke:none;stroke-width:0.26458332px;stroke-linecap:butt;stroke-linejoin:miter;stroke-opacity:1"
       xml:space="preserve"><tspan
         sodipodi:role="line"
         id="tspan966"
         x="181.25945"
         y="264.47638">Дата</tspan></text>
    <text
       xml:space="preserve"
       style="font-style:normal;font-variant:normal;font-weight:normal;font-stretch:normal;font-size:6.26180553px;line-height:11.74098873px;font-family:'OpenGost Type A TT';-inkscape-font-specification:'OpenGost Type A TT, Normal';text-align:center;letter-spacing:0px;word-spacing:0px;writing-mode:lr-tb;text-anchor:middle;fill:#000000;fill-opacity:1;stroke:none;stroke-width:0.26458332px;stroke-linecap:butt;stroke-linejoin:miter;stroke-opacity:1"
       x="298.23105"
       y="221.01457"
       id="index"
       transform="scale(0.76369882,1.3094167)"
       inkscape:label=""><tspan
         sodipodi:role="line"
         id="tspan1028"
         text-anchor="middle"
         x="298.23105"
         y="221.01457">##INDEX##</tspan></text>
    <path
       style="fill:none;fill-rule:evenodd;stroke:#000000;stroke-width:0.5;stroke-linecap:butt;stroke-linejoin:round;stroke-miterlimit:4;stroke-dasharray:none;stroke-opacity:1"
       d="M 108.2716,291.99946 108.25,281.99989"
       id="path4531"
       inkscape:connector-curvature="0"
       sodipodi:nodetypes="cc" />
    <text
       xml:space="preserve"
       style="font-style:normal;font-variant:normal;font-weight:normal;font-stretch:normal;font-size:4.2971859px;line-height:100%;font-family:'OpenGost Type A TT';-inkscape-font-specification:'OpenGost Type A TT, Normal';text-align:start;letter-spacing:0px;word-spacing:0px;writing-mode:lr-tb;text-anchor:start;fill:#000000;fill-opacity:1;stroke:none;stroke-width:0.26458332px;stroke-linecap:butt;stroke-linejoin:miter;stroke-opacity:1"
       x="-333.46335"
       y="10.732476"
       id="text3467"
       transform="matrix(0,-0.85983244,1.1630173,0,0,0)"
       sodipodi:linespacing="100%"><tspan
         sodipodi:role="line"
         id="tspan3385"
         x="-333.46335"
         y="10.732476">Инв. № подл.</tspan></text>
    <text
       sodipodi:linespacing="100%"
       transform="matrix(0,-0.90971423,1.0992463,0,0,0)"
       id="text3477"
       y="11.334438"
       x="-283.46893"
       style="font-style:normal;font-variant:normal;font-weight:normal;font-stretch:normal;font-size:4.54659986px;line-height:100%;font-family:'OpenGost Type A TT';-inkscape-font-specification:'OpenGost Type A TT, Normal';text-align:start;letter-spacing:0px;word-spacing:0px;writing-mode:lr-tb;text-anchor:start;fill:#000000;fill-opacity:1;stroke:none;stroke-width:0.26458332px;stroke-linecap:butt;stroke-linejoin:miter;stroke-opacity:1"
       xml:space="preserve"><tspan
         sodipodi:role="line"
         id="tspan3387"
         x="-283.46893"
         y="11.334438">Подп. и дата</tspan></text>
    <text
       xml:space="preserve"
       style="font-style:normal;font-variant:normal;font-weight:normal;font-stretch:normal;font-size:4.54659986px;line-height:100%;font-family:'OpenGost Type A TT';-inkscape-font-specification:'OpenGost Type A TT, Normal';text-align:start;letter-spacing:0px;word-spacing:0px;writing-mode:lr-tb;text-anchor:start;fill:#000000;fill-opacity:1;stroke:none;stroke-width:0.26458332px;stroke-linecap:butt;stroke-linejoin:miter;stroke-opacity:1"
       x="-250.15128"
       y="11.419941"
       id="text3487"
       transform="matrix(0,-0.90971423,1.0992463,0,0,0)"
       sodipodi:linespacing="100%"><tspan
         sodipodi:role="line"
         id="tspan3389"
         x="-250.15128"
         y="11.419941">Взам. инв. №</tspan></text>
    <text
       sodipodi:linespacing="100%"
       transform="matrix(0,-0.87503993,1.142805,0,0,0)"
       id="text3493"
       y="10.949982"
       x="-230.7394"
       style="font-style:normal;font-variant:normal;font-weight:normal;font-stretch:normal;font-size:4.37338638px;line-height:100%;font-family:'OpenGost Type A TT';-inkscape-font-specification:'OpenGost Type A TT, Normal';text-align:start;letter-spacing:0px;word-spacing:0px;writing-mode:lr-tb;text-anchor:start;fill:#000000;fill-opacity:1;stroke:none;stroke-width:0.26458332px;stroke-linecap:butt;stroke-linejoin:miter;stroke-opacity:1"
       xml:space="preserve"><tspan
         sodipodi:role="line"
         id="tspan3391"
         x="-230.7394"
         y="10.949982">Инв. № дубл.</tspan></text>
    <text
       xml:space="preserve"
       style="font-style:normal;font-variant:normal;font-weight:normal;font-stretch:normal;font-size:4.54659986px;line-height:100%;font-family:'OpenGost Type A TT';-inkscape-font-specification:'OpenGost Type A TT, Normal';text-align:start;letter-spacing:0px;word-spacing:0px;writing-mode:lr-tb;text-anchor:start;fill:#000000;fill-opacity:1;stroke:none;stroke-width:0.26458332px;stroke-linecap:butt;stroke-linejoin:miter;stroke-opacity:1"
       x="-190.0228"
       y="11.334438"
       id="text3503"
       transform="matrix(0,-0.90971423,1.0992463,0,0,0)"
       sodipodi:linespacing="100%"><tspan
         sodipodi:role="line"
         id="tspan3393"
         x="-190.0228"
         y="11.334438">Подп. и дата</tspan></text>
  </g>
</svg>
