DEBUG: Test Passed. Root folder has objects and the count is 3
DEBUG: Test Passed. Status of the object image212.png is, CheckedOut:False
DEBUG: Test Passed. image212.png is available in the external repository and the DeletedStatus is False
DEBUG: Test Passed: Promoted Object image212.png has been deleted from repository.
DEBUG: Test Passed: Object image211.png has been deleted from repository. No object with the name image211.png exists.
DEBUG: Test Passed.Demoting the promoted object is successfull. Object image213.png is of type Internal:False
DEBUG: Test Passed. Check in operation is successfull and the status of object image213.png is, CheckedOut:False
DEBUG: Test Passed. Staus of the object image213.png after undo checkout operation is CheckedOut:False
DEBUG: Test Passed. Promoting the unmanaged object is successfull. Object File8.txt is of type Internal:True
DEBUG: Test Passed. Promoting the unmanaged object is successfull. Object File8.docx is of type Internal:True
DEBUG: Test Passed. Downloading the object image213.png is successful.
DEBUG: Test Passed. Properties of the object image213.png is not empty.
DEBUG: Test Passed. Renaming the object is successful and the new named object is TestObject581
DEBUG: Test Passed:  External object TestObject581.png is not available in deleted search view.
DEBUG: Test Passed. Sub folder has objects and the count is 36
DEBUG: Test Passed. Object is checked out successfully and the status of object image214.png is CheckedOut:True
DEBUG: Test Passed.The permission of external object is not changed.
DEBUG: Test Passed.The permission of external object is not changed.
DEBUG: Test Passed. Object is not checked out by read only user and the Check Out status of object File1.docx is False
DEBUG: Test Passed. Object is not checked out by read only user and the Check Out status of object File1.docx is False
DEBUG: Test Passed: Adding the unmanaged object image214.png thorws expected error Not found.
DEBUG: Test Passed. Properties of the object is not empty
DEBUG: Test Passed. Properties of the object is not empty
DEBUG: Test Passed: Adding & removing promoted object File8.docx from favorite is successfull.
DEBUG: Test Passed. Multiple objects were checked out at same time.
DEBUG: Test Passed. Multiple objects were checked out at same time.
DEBUG: Test Passed. Cannot check out the object which was checked out by another user. Checked Out to BillR
DEBUG: Test Passed. Multiple objects were checked out at same time.
DEBUG: Test Passed. Multiple objects were checked out at same time.
DEBUG: Test Passed. Repository name in metadata of external object is OneDrive for Business
DEBUG: Test Passed. Repository name in metadata of external object is OneDrive for Business
DEBUG: Test Passed: Multiple proerties is added to the metadatacard of promoted object.
DEBUG: Test Passed: Property is added to the metadatacard of promoted object.
DEBUG: Test Passed: Properties cannot be added to metadata of unmamaged object.
DEBUG: Test Passed: Unmanaged SFD object cannot be converted to MFD document
DEBUG: Test Passed: Multiple objects can be demoted at once.
DEBUG: Test Passed: Demoting the object Sample1 - Copy.pptx with standard user is not possible.
DEBUG: Test Passed: Demoting cannot be done for promoted object when it is in checked out state. Check in the object first to perform this operation.

CoVaultExternalObjectOperations.cpp, 295, Check in the object first to perform this operation. (0x8004095D)
ServerVaultExternalObjectOperationsHelper.cpp, 103, Check in the object first to perform this operation. (0x8004095D)
LatestRPC.generated.cpp, 31055, Check in the object first to perform this operation. (0x8004095D)
RPCDocumentOperations.cpp, 13948, Check in the object first to perform this operation. (0x8004095D)
RPCDocumentOperations.cpp, 10173, Check in the object first to perform this operation. (0x8004095D)
MCallInLoop.h, 449, Check in the object first to perform this operation. (0x8004095D)
RPCDocumentOperationsHelper.cpp, 5627, Check in the object first to perform this operation. (0x8004095D)
RPCDocumentOperationsHelper.cpp, 43932, Check in the object first to perform this operation. (0x8004095D)
RPCDocumentOperationsHelper.cpp, 13990, Check in the object first to perform this operation. (0x8004095D)
(M-Files 19.2.7344.0)

(0052)
DEBUG: Test Passed: Multiple objects can be destroyed from external repository.
DEBUG: Test Passed: Comments cannot be added to the unmanaged object.
DEBUG: Test Passed: Promoted Object Sample1 - Copy.txt has been destroyed from repository. No object with the name Sample1 - Copy.txt exists.
DEBUG: Test Passed: Unmanaged Object Sample1.pptx has been destroyed from repository. No object with the name Sample1.pptx exists.
DEBUG: Test Passed: Destroying unmanaged object Sample1.xlsx with standard user is not possible.
DEBUG: Test Passed: Editing the object which was promoted by another user is successful.
DEBUG: Test Passed: External object cannot be marked for archiving.
DEBUG: Test Passed: External object cannot be marked for archiving.
DEBUG: Test Passed: Promoted object can be set for offline availability.
DEBUG: Test Passed: Unmamaged object cannot be set for offline availability.
DEBUG: Test Passed: User with read only user cannot promote the unmanaged object.Access denied. Your license type does not allow this operation.

CoVaultExternalObjectOperations.cpp, 185, Access denied. Your license type does not allow this operation. (0x8004080B)
ServerVaultExternalObjectOperationsHelper.cpp, 51, Access denied. Your license type does not allow this operation. (0x8004080B)
LatestRPC.generated.cpp, 30055, Access denied. Your license type does not allow this operation. (0x8004080B)
RPCDocumentOperations.cpp, 13914, Access denied. Your license type does not allow this operation. (0x8004080B)
RPCDocumentOperations.cpp, 9904, Access denied. Your license type does not allow this operation. (0x8004080B)
SessionManager.cpp, 1244, Access denied. Your license type does not allow this operation. (0x8004080B)
MFSession.cpp, 1062, Access denied. Your license type does not allow this operation. (0x8004080B)
MFSession.cpp, 1093, Access denied. Your license type does not allow this operation. (0x8004080B)
(M-Files 19.2.7344.0)

(0063)
DEBUG: Test Passed: Rollback operation cannot be performed for external objects.
DEBUG: Test Passed: Destroying promoted object Sample2.pptx with standard user is not possible.
DEBUG: Test Passed: Comment can be added to the promoted object.
