﻿{
    "declaration": {
        "enabled": true,
        "displayName": "Amazon S3",
        "authenticationType": "Anonymous",
        "permissionsOptions": {
            "enforceAcls": true,
            "naclUsage": "Always",
            "nacl": "{A470B682-2B52-48EF-B3A8-1A4B3F2B6B35}"
        },
        "associationOptions": {
            "propertyBasedAssociationProperties": [],
            "loginBasedUserAssociation": true,
            "loginBasedGroupAssociation": 0,
            "replicateUserGroups": true
        },
        "mappingOptions": {
            "objectTypes": [
                {
                    "objectType": "{53F0C8FD-0BF0-47C4-8FA6-4C2D0DADB650}"
                }
            ],
            "commonProperties": []
        },
        "searchIndex": {
            "metadataIndexingOptions": {
                "enabled": true,
                "folderCrawlerOptions": {
                    "refreshPeriodInHours": 23,
                    "newObjectCheckPeriodInHours": 71,
                    "indexObjectDataAssociatedWithFolders": true
                },
                "notifyServerAboutChangesInIndexing": true
            },
            "filedataIndexingOptions": {
                "enabled": true,
                "folderCrawlerOptions": {
                    "refreshPeriodInHours": 23,
                    "newObjectCheckPeriodInHours": 71,
                    "indexObjectDataAssociatedWithFolders": true
                },
                "notifyServerAboutChangesInIndexing": false
            },
            "indexObjectModifications": true,
            "verifyVersionVisibilityToUserInSearches": false,
            "errorLimitInOneBatch": 20,
            "indexAcls": true
        },
        "debugOptions": {
            "trackFiles": false,
            "fastFolderCrawlerRefresh": false,
            "showErrorsInsteadOfIncompleteMetadata": false
        },
        "removeInvalidCredentials": true
    },
    "customConfiguration": {
        "serverName": "https://s3.amazonaws.com",
        "region": "us-east-1",
        "useServerSideEncryption": false,
        "storageClass": "STANDARD",
        "accessKeyId": "AKIAIOJBWETHFCWDJXKA",
        "secretAccessKey": "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",
        "bucket": "mfilestest"
    }
}