DEBUG: Test Passed. Root folder has objects and the count is 3
DEBUG: Test Passed. Status of the object Sample1 - Copy.txt is, CheckedOut:False
DEBUG: Test Passed. Sample1 - Copy.txt is available in the external repository and the DeletedStatus is False
DEBUG: Test Passed: Promoted Object Sample1 - Copy.txt has been deleted from repository.
DEBUG: Test Passed: Object Sample1 - Copy.pptx has been deleted from repository.
DEBUG: Test Passed.Demoting the promoted object is successfull. Object Sample1 - Copy.xlsx is of type Internal:False
DEBUG: Test Passed. Check in operation is successfull and the status of object Sample1 - Copy.xlsx is, CheckedOut:False
DEBUG: Test Passed. Staus of the object Sample1 - Copy.xlsx after undo checkout operation is CheckedOut:False
DEBUG: Test Passed. Promoting the unmanaged object is successfull. Object File8.txt is of type Internal:True
DEBUG: Test Passed. Promoting the unmanaged object is successfull. Object File8.docx is of type Internal:True
DEBUG: Test Passed. Downloading the object Sample1 - Copy.xlsx is successful.
DEBUG: Test Passed. Properties of the object Sample1 - Copy.xlsx is not empty.
DEBUG: Test Passed. Renaming the object is successful and the new named object is TestObject883
DEBUG: Test Passed:  External object TestObject883.xlsx is not available in deleted search view.
DEBUG: Test Passed. Sub folder has objects and the count is 36
DEBUG: Test Passed. Object is checked out successfully and the status of object Sample1.pptx is CheckedOut:True
DEBUG: Test Passed.The permission of external object is not changed.
DEBUG: Test Passed.The permission of external object is not changed.
DEBUG: Test Passed. Object is not checked out by read only user and the Check Out status of object File1.docx is False
DEBUG: Test Passed. Object is not checked out by read only user and the Check Out status of object File1.docx is False
DEBUG: Test Passed: Adding the unmanaged object Sample1.pptx thorws expected error Not found.
DEBUG: Test Passed. Properties of the object is not empty
DEBUG: Test Passed. Properties of the object is not empty
DEBUG: Test Passed: Adding & removing promoted object File8.docx from favorite is successfull.
DEBUG: Test Passed. Multiple objects were checked out at same time.
DEBUG: Test Passed. Multiple objects were checked out at same time.
DEBUG: Test Passed. Cannot check out the object which was checked out by another user. Checked Out to BillR
DEBUG: Test Passed. Multiple objects were checked out at same time.
DEBUG: Test Passed. Multiple objects were checked out at same time.
DEBUG: Test Passed. Repository name in metadata of external object is OneDrive for Business
DEBUG: Test Passed. Repository name in metadata of external object is OneDrive for Business
DEBUG: Test Passed: Multiple proerties is added to the metadatacard of promoted object.
DEBUG: Test Passed: Property is added to the metadatacard of promoted object.
DEBUG: Test Passed: Properties cannot be added to metadata of unmamaged object.
DEBUG: Test Passed: Unmanaged SFD object cannot be converted to MFD document
DEBUG: Test Passed: Multiple objects can be demoted at once.
DEBUG: Test Passed: Demoting the object Sample2.txt with standard user is not possible.
DEBUG: Test Passed: Demoting cannot be done for promoted object when it is in checked out state.
DEBUG: Test Passed: Multiple objects can be destroyed from external repository.
DEBUG: Test Passed: Comments cannot be added to the unmanaged object.
DEBUG: Test Passed: Promoted Object Sample3 - Copy.pptx has been destroyed from repository.
DEBUG: Test Passed: Unmanaged Object Sample3 - Copy.txt has been destroyed from repository.
DEBUG: Test Passed: Destroying unmanaged object Sample3 - Copy.xlsx with standard user is not possible.
DEBUG: Test Passed: Editing the object which was promoted by another user is successful.
DEBUG: Test Passed: External object cannot be marked for archiving.
DEBUG: Test Passed: External object cannot be marked for archiving.
DEBUG: Test Passed: Promoted object can be set for offline availability.
DEBUG: Test Passed: Unmamaged object cannot be set for offline availability.
DEBUG: Test Passed: User with read only user cannot promote the unmanaged object.Access denied. Your license type does not allow this operation.

CoVaultExternalObjectOperations.cpp, 185, Access denied. Your license type does not allow this operation. (0x8004080B)
ServerVaultExternalObjectOperationsHelper.cpp, 51, Access denied. Your license type does not allow this operation. (0x8004080B)
LatestRPC.generated.cpp, 30055, Access denied. Your license type does not allow this operation. (0x8004080B)
RPCDocumentOperations.cpp, 13783, Access denied. Your license type does not allow this operation. (0x8004080B)
RPCDocumentOperations.cpp, 9904, Access denied. Your license type does not allow this operation. (0x8004080B)
SessionManager.cpp, 1242, Access denied. Your license type does not allow this operation. (0x8004080B)
MFSession.cpp, 1060, Access denied. Your license type does not allow this operation. (0x8004080B)
MFSession.cpp, 1091, Access denied. Your license type does not allow this operation. (0x8004080B)
(M-Files 19.1.7282.0)

(0063)
DEBUG: Test Passed: Rollback operation cannot be performed for external objects.
DEBUG: Test Passed: Destroying promoted object Sample4 - Copy.pptx with standard user is not possible.
DEBUG: Test Passed: Comment can be added to the promoted object.
