﻿{
    "declaration": {
        "enabled": true,
        "displayName": "test",
        "commonAcl": "{A470B682-2B52-48EF-B3A8-1A4B3F2B6B35}",
        "enforceAcls": false,
        "commonProperties": [],
        "objectTypes": [
            {
                "objectType": "{53F0C8FD-0BF0-47C4-8FA6-4C2D0DADB650}",
                "externalType": "Document",
                "properties": []
            }
        ],
        "searchIndex": {
            "reactToChangesInObjects": true,
            "enforceVersionVisibilityToUserInSearches": false,
            "enabledForFiles": true,
            "folderCrawlerForFiles": {
                "refreshPeriodInHours": 23,
                "newObjectCheckPeriodInHours": 71,
                "indexObjectDataAssociatedWithFolders": true
            },
            "enabledForMetadata": true,
            "folderCrawlerForMetadata": {
                "refreshPeriodInHours": 23,
                "newObjectCheckPeriodInHours": 71,
                "indexObjectDataAssociatedWithFolders": true
            },
            "errorLimitInOneBatch": 20,
            "indexAcls": false
        },
        "debugOptions": {
            "trackFiles": false,
            "fastFolderCrawlerRefresh": true
        },
        "authenticationType": "UserSpecific",
        "fixedProperties": [],
        "mappingOptions": {
            "objectTypes": [
                {
                    "objectType": "{53F0C8FD-0BF0-47C4-8FA6-4C2D0DADB650}",
                    "externalType": "Document",
                    "properties": []
                }
            ],
            "commonProperties": []
        },
        "associationOptions": {
            "propertyBasedAssociationProperties": [],
            "loginBasedUserAssociation": true,
            "loginBasedGroupAssociation": "Automatic",
            "replicateUserGroups": true
        },
        "permissionsOptions": {
            "naclUsage": "AsFallback",
            "nacl": "{A470B682-2B52-48EF-B3A8-1A4B3F2B6B35}"
        }
    },
    "customConfiguration": {
        "Location": "https://intopalooy.sharepoint.com/sites/fabrikam-inc",
        "Enable OAuth": true,
        "OAuth Authorization": {
            "Client ID": "26a4718c-1ca5-45f5-8178-8d820c8718a7",
            "Client Secret": "pTAW7W2+1Na8dUw3gjQWkkFfS26AvjPdHDYpUT4eFv4=",
            "Enable Logging": "true",
            "Site Realm": "905514d7-1aed-468a-bd59-f274bcb7bda3",
            "Redirect URI": "https://localhost/authentication/MFiles.AuthenticationProviders.OAuth/repositorylogin"
        },
        "Content Filtering": {
            "Show Site Assets": false,
            "Show Site Pages": false,
            "Folders not to Show": []
        },
        "Advanced Settings": {
            "Max Memory In Megabytes": 500
        }
    }
}
