DEBUG: Test Passed. Root folder has objects and the count is 9
DEBUG: Test Passed. Status of the object Sample7.pptx is, CheckedOut:False
DEBUG: Test Passed.File Converted to PDF. EscapedTitleWithID:Sample7 (ID 1).pdf
DEBUG: Test Passed. TestDocument14 - Copy.docx is available in the external repository and the DeletedStatus is False
DEBUG: Test Passed.Demoting the promoted object is successfull. Object TestDocument14 - Copy.docx is of type Internal:False
DEBUG: Test Passed. Staus of the object TestDocument14 - Copy.docx after undo checkout operation is CheckedOut:False
DEBUG: Test Passed. Object is checked out successfully and the status of object TestDocument14 - Copy.docx is CheckedOut:True
DEBUG: Test Passed: Object TestDocument14 - Copy.docx has been deleted from repository.
DEBUG: Test Passed. Check in operation is successfull and the status of object image208.png is, CheckedOut:False
DEBUG: Test Passed. Downloading the object image208.png is successful.
DEBUG: Test Passed. Properties of the object image208.png is not empty.
DEBUG: Test Passed. Renaming the object is successful and the new named object is TestObject206
DEBUG: Test Passed:  External object TestObject206.png is not available in deleted search view.
DEBUG: Test Passed. Sub folder has objects and the count is 35
DEBUG: Test Passed. Promoting the unmanaged object is successfull. Object File8.txt is of type Internal:True
DEBUG: Test Passed. Promoting the unmanaged object is successfull. Object File8.docx is of type Internal:True
DEBUG: Test Passed. Renaming the object same as another file fails and the name is stil File6
DEBUG: Test Passed. Renaming the object same as another file fails and the name is stil File6
DEBUG: Test Passed.The permission of external object is not changed.
DEBUG: Test Passed.The permission of external object is not changed.
DEBUG: Test Passed. Object is not checked out by read only user and the Check Out status of object File12.txt is False
DEBUG: Test Passed. Object is not checked out by read only user and the Check Out status of object File12.txt is False
DEBUG: Test Passed: Adding the unmanaged object image81.png thorws expected error Not found.
DEBUG: Test Passed. Properties of the object is not empty
DEBUG: Test Passed. Properties of the object is not empty
DEBUG: Test Passed: Adding & removing promoted object File8.docx from favorite is successfull.
DEBUG: Test Passed. Multiple objects were checked out at same time.
DEBUG: Test Passed. Multiple objects were checked out at same time.
DEBUG: Test Passed. Cannot check out the object which was checked out by another user. Checked Out to TestSonS
DEBUG: Test Passed. Multiple objects were checked out at same time.
DEBUG: Test Passed. Multiple objects were checked out at same time.
DEBUG: Test Passed. Repository name in metadata of external object is test
DEBUG: Test Passed. Repository name in metadata of external object is test
DEBUG: Test Passed: Multiple proerties is added to the metadatacard of promoted object.
DEBUG: Test Passed: Property is added to the metadatacard of promoted object.
DEBUG: Test Passed: Properties cannot be added to metadata of unmamaged object.
DEBUG: Test Passed: Unmanaged SFD object cannot be converted to MFD document
DEBUG: Test Passed: Multiple objects can be demoted at once.
DEBUG: Test Passed: Demoting cannot be done for promoted object when it is in checked out state.
DEBUG: Test Passed: Multiple objects can be destroyed from external repository.
DEBUG: Test Passed: Promoted Object Sample20.pptx has been destroyed from repository.
DEBUG: Test Passed: Unmanaged Object Sample18 - Copy.pptx has been destroyed from repository.
DEBUG: Test Passed: External object cannot be marked for archiving.
DEBUG: Test Passed: External object cannot be marked for archiving.
DEBUG: Test Passed: Promoted object can be set for offline availability.
DEBUG: Test Passed: Unmamaged object cannot be set for offline availability.
DEBUG: Test Passed: User with read only user cannot promote the unmanaged object.The action could not be completed because you could not be authenticated for accessing the external repository.
The operation was prevented because M-Files Server required input from the M-Files client, but the installed version of the client software does not have a communication channel from the server to the client.

CoVaultObjectOperations.cpp, 2205, The action could not be completed because you could not be authenticated for accessing the external repository. (0x80040959)
ServerVaultObjectOperationsHelper.cpp, 1204, The action could not be completed because you could not be authenticated for accessing the external repository. (0x80040959)
LatestRPC.generated.cpp, 25209, The action could not be completed because you could not be authenticated for accessing the external repository. (0x80040959)
RPCDocumentOperations.cpp, 11356, The action could not be completed because you could not be authenticated for accessing the external repository. (0x80040959)
RPCDocumentOperations.cpp, 6583, The action could not be completed because you could not be authenticated for accessing the external repository. (0x80040959)
ExternalRepositoryHelper.cpp, 5159, The action could not be completed because you could not be authenticated for accessing the external repository. (0x80040959)
ExternalRepositoryHelper.cpp, 5278, The action could not be completed because you could not be authenticated for accessing the external repository. (0x80040959)
ExternalRepositoryHelper.cpp, 770, The action could not be completed because you could not be authenticated for accessing the external repository. (0x80040959)
CoContentProviderHost.cpp, 215, The action could not be completed because you could not be authenticated for accessing the external repository. (0x80040959)
ManagedError.cpp, 129, The action could not be completed because you could not be authenticated for accessing the external repository. (0x80040959)
MFCLRBridgeV45: [CManagedError* CContentProviderHost.GetObjectInfo(CContentProviderHost*, CManagedError*, CMF_ExtensionCallInformation*, UInt32, CMF_ObjVer*, RPCServerArray<CMF_ObjectVersionEx>*)], IL:21, The action could not be completed because you could not be authenticated for accessing the external repository. (0x80040959)
MFCLRBridgeV45: [System.Collections.Generic.IEnumerable`1[MFiles.Common.Types.ObjectVersionEx] GetObjectInfo(MFiles.ExternalConnectorHost.CallContext, MFiles.Common.Types.ObjVerCollection)], IL:73, The action could not be completed because you could not be authenticated for accessing the external repository. (0x80040959)
MFCLRBridgeV45: [System.Collections.Generic.IEnumerable`1[TMFilesResult] ForObjectIdentifiersBySystem[TMFilesId,TConnectorIdentity,TConnectorResult,TMFilesResult](MFiles.ExternalConnectorHost.CallContext, System.Collections.Generic.IEnumerable`1[TMFilesId], MFiles.Common.Types.Acl.ObjectAccess, MFiles.ExternalConnectorHost.RepositoryConnectorHosting.LocationRequired, MFiles.ExternalConnectorHost.RepositoryConnectorHosting.DenyUserInteraction, MFiles.ExternalConnectorHost.RepositoryConnectorHosting.OperationContextForEvents, System.Func`3[System.Collections.Generic.IReadOnlyCollection`1[TConnectorIdentity],MFiles.ExternalConnectorHost.RepositoryConnectorHosting.RepositoryConnectorContext,System.Collections.Generic.IEnumerable`1[TConnectorResult]], System.Func`3[System.Collections.Generic.IEnumerable`1[TConnectorResult],MFiles.ExternalConnectorHost.RepositoryConnectorHosting.RepositoryConnectorContext,System.Collections.Generic.IEnumerable`1[TMFilesResult]], System.Func`2[System.Collections.Generic.IEnumerable`1[TMFilesId],System.Collections.Generic.IEnumerable`1[TMFilesResult]])], IL:24, The action could not be completed because you could not be authenticated for accessing the external repository. (0x80040959)
MFCLRBridgeV45: [Void ProcessObjects[TMFilesId,TConnectorIdentity,TConnectorResult,TMFilesResult](MFiles.ExternalConnectorHost.CallContext, MFiles.ExternalConnectorHost.RepositoryConnectorHosting.OperationContextForEvents, MFiles.ExternalConnectorHost.RepositoryConnectorHosting.LocationRequired, MFiles.ExternalConnectorHost.RepositoryConnectorHosting.DenyUserInteraction, System.Func`3[System.Collections.Generic.IReadOnlyCollection`1[TConnectorIdentity],MFiles.ExternalConnectorHost.RepositoryConnectorHosting.RepositoryConnectorContext,System.Collections.Generic.IEnumerable`1[TConnectorResult]], System.Func`3[System.Collections.Generic.IEnumerable`1[TConnectorResult],MFiles.ExternalConnectorHost.RepositoryConnectorHosting.RepositoryConnectorContext,System.Collections.Generic.IEnumerable`1[TMFilesResult]], MFiles.ExternalConnectorHost.RepositoryConnectorHosting.SystemObjectSplitter`2[TMFilesId,TMFilesResult], MFiles.Common.Types.Acl.ObjectAccess, System.Func`2[System.Collections.Generic.IEnumerable`1[TMFilesId],System.Collections.Generic.IEnumerable`1[TMFilesResult]])], IL:241, The action could not be completed because you could not be authenticated for accessing the external repository. (0x80040959)
MFCLRBridgeV45: [TResult ForSystem[TResult](MFiles.ExternalConnectorHost.CallContext, System.String, MFiles.Common.Types.ExtensionAuthenticationResponse, MFiles.ExternalConnectorHost.RepositoryConnectorHosting.DenyUserInteraction, System.Func`2[MFiles.ExternalConnectorHost.RepositoryConnectorHosting.RepositoryConnectorContext,TResult])], IL:0, The action could not be completed because you could not be authenticated for accessing the external repository. (0x80040959)
MFCLRBridgeV45: [TResult ForSystem[TResult](MFiles.ExternalConnectorHost.CallContext, System.String, MFiles.Common.Types.ExtensionAuthenticationResponse, MFiles.ExternalConnectorHost.RepositoryConnectorHosting.ExplicitLogin, MFiles.ExternalConnectorHost.RepositoryConnectorHosting.DenyUserInteraction, System.Func`2[MFiles.ExternalConnectorHost.RepositoryConnectorHosting.RepositoryConnectorContext,TResult])], IL:174, The action could not be completed because you could not be authenticated for accessing the external repository. (0x80040959)
MFCLRBridgeV45: [MFiles.ExternalConnectorHost.RepositoryConnectorHosting.RepositoryConnectorContext CreateContext(MFiles.ExternalConnectorHost.RepositoryConnectorHosting.EffectiveUser, MFiles.ExternalConnectorHost.CallContext, MFiles.ExternalConnectorHost.RepositoryConnectorHosting.ConnectionContext, MFiles.ExternalConnectorHost.RepositoryConnectorHosting.SessionCache.RepositorySessionCache, MFiles.ExternalConnectorHost.IServerVaultDataAccess, MFiles.ExternalConnectorHost.INativeConverter, MFiles.Common.Types.ExtensionAuthenticationResponse, Boolean, Boolean, MFiles.ExternalConnectorHost.RepositoryConnectorHosting.ExplicitLogin, MFiles.ExternalConnectorHost.RepositoryConnectorHosting.DenyUserInteraction)], IL:0, The action could not be completed because you could not be authenticated for accessing the external repository. (0x80040959)
MFCLRBridgeV45: [MFiles.ExternalConnectorHost.RepositoryConnectorHosting.SessionCache.CacheableSession GetSession(MFiles.ExternalConnectorHost.RepositoryConnectorHosting.EffectiveUser, MFiles.ExternalConnectorHost.CallContext, MFiles.ExternalConnectorHost.RepositoryConnectorHosting.ConnectionContext, MFiles.Common.Types.ExtensionAuthenticationResponse, Boolean, Boolean, MFiles.ExternalConnectorHost.RepositoryConnectorHosting.ExplicitLogin, MFiles.ExternalConnectorHost.RepositoryConnectorHosting.DenyUserInteraction)], IL:53, The action could not be completed because you could not be authenticated for accessing the external repository. (0x80040959)
MFCLRBridgeV45: [MFiles.ExternalConnectorHost.RepositoryConnectorHosting.AuthenticationHelperResult`1[TResult] ForUser[TResult](MFiles.ExternalConnectorHost.RepositoryConnectorHosting.EffectiveUser, MFiles.ExternalConnectorHost.CallContext, System.String, MFiles.Common.Types.ExtensionAuthenticationResponse, Boolean, Boolean, MFiles.ExternalConnectorHost.RepositoryConnectorHosting.ExplicitLogin, MFiles.ExternalConnectorHost.RepositoryConnectorHosting.DenyUserInteraction, NullResult, OnError, MFiles.ExternalConnectorHost.ApplicationHosting.CrossDomain.RemoteHandle`1[MFiles.Extensibility.ExternalRepositories.IRepositoryConnection], MFiles.ExternalConnectorHost.RepositoryConnectorHosting.RepositoryConnectorHost, System.Func`2[MFiles.Extensibility.ExternalRepositories.RepositorySessionInformation,TResult])], IL:178, The action could not be completed because you could not be authenticated for accessing the external repository. (0x80040959)
MFCLRBridgeV45: [MFiles.Common.Types.ExtensionAuthenticationResponse PerformAuthenticationFromUser(MFiles.ExternalConnectorHost.CallContext, MFiles.ExternalConnectorHost.RepositoryConnectorHosting.EffectiveUser, System.String, MFiles.Common.Types.PluginInfoCollection, MFiles.ExternalConnectorHost.RepositoryConnectorHosting.ExplicitLogin, MFiles.ExternalConnectorHost.RepositoryConnectorHosting.RepositoryConnectorHost, MFiles.ExternalConnectorHost.RepositoryConnectorHosting.DenyUserInteraction ByRef)], IL:161, The action could not be completed because you could not be authenticated for accessing the external repository. (0x80040959)
MFCLRBridgeV45: [MFiles.Common.Types.ExtensionAuthenticationResponse GetAuthenticationData(System.String, System.String, MFiles.Common.Types.PluginInfoCollection, MFiles.ExternalConnectorHost.RepositoryConnectorHosting.ExplicitLogin, MFiles.ExternalConnectorHost.RepositoryConnectorHosting.DenyUserInteraction ByRef)], IL:0, The action could not be completed because you could not be authenticated for accessing the external repository. (0x80040959)
MFCLRBridgeV45: [MFiles.Common.Types.ExtensionAuthenticationResponse GetExtensionAuthenticationFromUser(MFiles.Common.Types.CallInformation, System.String, System.String, MFiles.Common.Types.PluginInfoCollection, Boolean, Boolean ByRef)], IL:183, The action could not be completed because you could not be authenticated for accessing the external repository. (0x80040959)
MFCLRBridgeV45: [Void CManagedError.ThrowManagedExceptionOnCOMError(Int32)], IL:115, The action could not be completed because you could not be authenticated for accessing the external repository. (0x80040959)
CoServerVaultDataAccess.cpp, 928, The action could not be completed because you could not be authenticated for accessing the external repository. (0x80040959)
CoServerVaultDataAccess.cpp, 928, The operation was prevented because M-Files Server required input from the M-Files client, but the installed version of the client software does not have a communication channel from the server to the client. (0x80040932)
(M-Files 19.1.7241.0)

(0321)
DEBUG: Test Passed: Special characters #%*:<>?/ should not a part of object title The file or folder name "/sites/fabrikam-inc/Shared Documents/TestConnector/SubFolder1/Sample23#%25*:>?/.pptx" contains invalid characters. Please use a different name. Common invalid characters include the following: # % * : < > ? /  |
The file or folder name "/sites/fabrikam-inc/Shared Documents/TestConnector/SubFolder1/Sample23#%25*:>?/.pptx" contains invalid characters. Please use a different name. Common invalid characters include the following: # % * : < > ? /  |

CoVaultObjectOperations.cpp, 604, The file or folder name "/sites/fabrikam-inc/Shared Documents/TestConnector/SubFolder1/Sample23#%25*:>?/.pptx" contains invalid characters. Please use a different name. Common invalid characters include the following: # % * : < > ? /  | (0x80131600)
ServerVaultObjectOperationsHelper.cpp, 65, The file or folder name "/sites/fabrikam-inc/Shared Documents/TestConnector/SubFolder1/Sample23#%25*:>?/.pptx" contains invalid characters. Please use a different name. Common invalid characters include the following: # % * : < > ? /  | (0x80131600)
RPCObjectOperationsHelper.cpp, 283, The file or folder name "/sites/fabrikam-inc/Shared Documents/TestConnector/SubFolder1/Sample23#%25*:>?/.pptx" contains invalid characters. Please use a different name. Common invalid characters include the following: # % * : < > ? /  | (0x80131600)
LatestRPC.generated.cpp, 18689, The file or folder name "/sites/fabrikam-inc/Shared Documents/TestConnector/SubFolder1/Sample23#%25*:>?/.pptx" contains invalid characters. Please use a different name. Common invalid characters include the following: # % * : < > ? /  | (0x80131600)
RPCDocumentOperations.cpp, 10793, The file or folder name "/sites/fabrikam-inc/Shared Documents/TestConnector/SubFolder1/Sample23#%25*:>?/.pptx" contains invalid characters. Please use a different name. Common invalid characters include the following: # % * : < > ? /  | (0x80131600)
RPCDocumentOperations.cpp, 5734, The file or folder name "/sites/fabrikam-inc/Shared Documents/TestConnector/SubFolder1/Sample23#%25*:>?/.pptx" contains invalid characters. Please use a different name. Common invalid characters include the following: # % * : < > ? /  | (0x80131600)
MCallInLoop.h, 358, The file or folder name "/sites/fabrikam-inc/Shared Documents/TestConnector/SubFolder1/Sample23#%25*:>?/.pptx" contains invalid characters. Please use a different name. Common invalid characters include the following: # % * : < > ? /  | (0x80131600)
RPCDocumentOperationsHelper.cpp, 4195, The file or folder name "/sites/fabrikam-inc/Shared Documents/TestConnector/SubFolder1/Sample23#%25*:>?/.pptx" contains invalid characters. Please use a different name. Common invalid characters include the following: # % * : < > ? /  | (0x80131600)
VaultDBSession.cpp, 129, The file or folder name "/sites/fabrikam-inc/Shared Documents/TestConnector/SubFolder1/Sample23#%25*:>?/.pptx" contains invalid characters. Please use a different name. Common invalid characters include the following: # % * : < > ? /  | (0x80131600)
DBSession.cpp, 705, The file or folder name "/sites/fabrikam-inc/Shared Documents/TestConnector/SubFolder1/Sample23#%25*:>?/.pptx" contains invalid characters. Please use a different name. Common invalid characters include the following: # % * : < > ? /  | (0x80131600)
CachedDBSession.cpp, 1204, The file or folder name "/sites/fabrikam-inc/Shared Documents/TestConnector/SubFolder1/Sample23#%25*:>?/.pptx" contains invalid characters. Please use a different name. Common invalid characters include the following: # % * : < > ? /  | (0x80131600)
TransactionActions.cpp, 147, The file or folder name "/sites/fabrikam-inc/Shared Documents/TestConnector/SubFolder1/Sample23#%25*:>?/.pptx" contains invalid characters. Please use a different name. Common invalid characters include the following: # % * : < > ? /  | (0x80131600)
TransactionActions.cpp, 335, The file or folder name "/sites/fabrikam-inc/Shared Documents/TestConnector/SubFolder1/Sample23#%25*:>?/.pptx" contains invalid characters. Please use a different name. Common invalid characters include the following: # % * : < > ? /  | (0x80131600)
VaultAction_ExternalRepositoryOperations.cpp, 2095, The file or folder name "/sites/fabrikam-inc/Shared Documents/TestConnector/SubFolder1/Sample23#%25*:>?/.pptx" contains invalid characters. Please use a different name. Common invalid characters include the following: # % * : < > ? /  | (0x80131600)
VaultAction_ExternalRepositoryOperations.cpp, 685, The file or folder name "/sites/fabrikam-inc/Shared Documents/TestConnector/SubFolder1/Sample23#%25*:>?/.pptx" contains invalid characters. Please use a different name. Common invalid characters include the following: # % * : < > ? /  | (0x80131600)
VaultAction_ExternalRepositoryOperations.cpp, 1637, The file or folder name "/sites/fabrikam-inc/Shared Documents/TestConnector/SubFolder1/Sample23#%25*:>?/.pptx" contains invalid characters. Please use a different name. Common invalid characters include the following: # % * : < > ? /  | (0x80131600)
VaultAction_ExternalRepositoryOperations.cpp, 2664, The file or folder name "/sites/fabrikam-inc/Shared Documents/TestConnector/SubFolder1/Sample23#%25*:>?/.pptx" contains invalid characters. Please use a different name. Common invalid characters include the following: # % * : < > ? /  | (0x80131600)
ExternalRepositoryHelper.cpp, 1899, The file or folder name "/sites/fabrikam-inc/Shared Documents/TestConnector/SubFolder1/Sample23#%25*:>?/.pptx" contains invalid characters. Please use a different name. Common invalid characters include the following: # % * : < > ? /  | (0x80131600)
CoContentProviderHost.cpp, 487, The file or folder name "/sites/fabrikam-inc/Shared Documents/TestConnector/SubFolder1/Sample23#%25*:>?/.pptx" contains invalid characters. Please use a different name. Common invalid characters include the following: # % * : < > ? /  | (0x80131600)
ManagedError.cpp, 129, The file or folder name "/sites/fabrikam-inc/Shared Documents/TestConnector/SubFolder1/Sample23#%25*:>?/.pptx" contains invalid characters. Please use a different name. Common invalid characters include the following: # % * : < > ? /  | (0x80131600)
Mfiles.SharePoint.Connector.Online: [CManagedError* CContentProviderHost.RenameObject(CContentProviderHost*, CManagedError*, CMF_ExtensionCallInformation*, CMF_ObjVer*, CMF_String*, CMF_ObjVer*)], IL:29, The file or folder name "/sites/fabrikam-inc/Shared Documents/TestConnector/SubFolder1/Sample23#%25*:>?/.pptx" contains invalid characters. Please use a different name. Common invalid characters include the following: # % * : < > ? /  | (0x80131600)
Mfiles.SharePoint.Connector.Online: [MFiles.Common.Types.ObjVer RenameObject(MFiles.ExternalConnectorHost.CallContext, MFiles.Common.Types.ObjVer, System.String)], IL:78, The file or folder name "/sites/fabrikam-inc/Shared Documents/TestConnector/SubFolder1/Sample23#%25*:>?/.pptx" contains invalid characters. Please use a different name. Common invalid characters include the following: # % * : < > ? /  | (0x80131600)
Mfiles.SharePoint.Connector.Online: [TResult ForSystem[TResult](MFiles.ExternalConnectorHost.CallContext, System.String, MFiles.Common.Types.ExtensionAuthenticationResponse, MFiles.ExternalConnectorHost.RepositoryConnectorHosting.DenyUserInteraction, System.Func`2[MFiles.ExternalConnectorHost.RepositoryConnectorHosting.RepositoryConnectorContext,TResult])], IL:0, The file or folder name "/sites/fabrikam-inc/Shared Documents/TestConnector/SubFolder1/Sample23#%25*:>?/.pptx" contains invalid characters. Please use a different name. Common invalid characters include the following: # % * : < > ? /  | (0x80131600)
Mfiles.SharePoint.Connector.Online: [TResult ForSystem[TResult](MFiles.ExternalConnectorHost.CallContext, System.String, MFiles.Common.Types.ExtensionAuthenticationResponse, MFiles.ExternalConnectorHost.RepositoryConnectorHosting.ExplicitLogin, MFiles.ExternalConnectorHost.RepositoryConnectorHosting.DenyUserInteraction, System.Func`2[MFiles.ExternalConnectorHost.RepositoryConnectorHosting.RepositoryConnectorContext,TResult])], IL:161, The file or folder name "/sites/fabrikam-inc/Shared Documents/TestConnector/SubFolder1/Sample23#%25*:>?/.pptx" contains invalid characters. Please use a different name. Common invalid characters include the following: # % * : < > ? /  | (0x80131600)
Mfiles.SharePoint.Connector.Online: [TMFilesResult <ForObject>b__0(MFiles.ExternalConnectorHost.RepositoryConnectorHosting.RepositoryConnectorContext)], IL:55, The file or folder name "/sites/fabrikam-inc/Shared Documents/TestConnector/SubFolder1/Sample23#%25*:>?/.pptx" contains invalid characters. Please use a different name. Common invalid characters include the following: # % * : < > ? /  | (0x80131600)
Mfiles.SharePoint.Connector.Online: [MFiles.ExternalConnectorHost.RepositoryConnectorHosting.ConnectorCallResult <RenameObject>b__0(MFiles.ExternalConnectorHost.RepositoryConnectorHosting.RepositoryConnectorContext)], IL:0, The file or folder name "/sites/fabrikam-inc/Shared Documents/TestConnector/SubFolder1/Sample23#%25*:>?/.pptx" contains invalid characters. Please use a different name. Common invalid characters include the following: # % * : < > ? /  | (0x80131600)
Mfiles.SharePoint.Connector.Online: [MFiles.Extensibility.ExternalRepositories.ObjectVersionData RenameObject(MFiles.Extensibility.ExternalRepositories.ObjectVersionIdentity, System.String, MFiles.Extensibility.ExternalRepositories.ObjectVersionDataRequest)], IL:-1, The file or folder name "/sites/fabrikam-inc/Shared Documents/TestConnector/SubFolder1/Sample23#%25*:>?/.pptx" contains invalid characters. Please use a different name. Common invalid characters include the following: # % * : < > ? /  | (0x80131600)
Mfiles.SharePoint.Connector.Online: [Void PrivateInvoke(System.Runtime.Remoting.Proxies.MessageData ByRef, Int32)], IL:442, The file or folder name "/sites/fabrikam-inc/Shared Documents/TestConnector/SubFolder1/Sample23#%25*:>?/.pptx" contains invalid characters. Please use a different name. Common invalid characters include the following: # % * : < > ? /  | (0x80131600)
Mfiles.SharePoint.Connector.Online: [Void HandleReturnMessage(System.Runtime.Remoting.Messaging.IMessage, System.Runtime.Remoting.Messaging.IMessage)], IL:39, The file or folder name "/sites/fabrikam-inc/Shared Documents/TestConnector/SubFolder1/Sample23#%25*:>?/.pptx" contains invalid characters. Please use a different name. Common invalid characters include the following: # % * : < > ? /  | (0x80131600)
[System.Runtime.Remoting.Channels.CrossAppDomainSink.DoTransitionDispatchCallback(System.Object[] args) in :il 0], , The file or folder name "/sites/fabrikam-inc/Shared Documents/TestConnector/SubFolder1/Sample23#%25*:>?/.pptx" contains invalid characters. Please use a different name. Common invalid characters include the following: # % * : < > ? /  | (0x80131500)
[System.Runtime.Remoting.Channels.CrossAppDomainSink.DoDispatch(Byte[] reqStmBuff, System.Runtime.Remoting.Messaging.SmuggledMethodCallMessage smuggledMcm, System.Runtime.Remoting.Messaging.SmuggledMethodReturnMessage& smuggledMrm) in :il 0], , The file or folder name "/sites/fabrikam-inc/Shared Documents/TestConnector/SubFolder1/Sample23#%25*:>?/.pptx" contains invalid characters. Please use a different name. Common invalid characters include the following: # % * : < > ? /  | (0x80131500)
[System.Runtime.Remoting.Channels.ChannelServices.SyncDispatchMessage(System.Runtime.Remoting.Messaging.IMessage msg) in :il 0], , The file or folder name "/sites/fabrikam-inc/Shared Documents/TestConnector/SubFolder1/Sample23#%25*:>?/.pptx" contains invalid characters. Please use a different name. Common invalid characters include the following: # % * : < > ? /  | (0x80131500)
[System.Runtime.Remoting.Channels.CrossContextChannel.SyncProcessMessage(System.Runtime.Remoting.Messaging.IMessage reqMsg) in :il 0], , The file or folder name "/sites/fabrikam-inc/Shared Documents/TestConnector/SubFolder1/Sample23#%25*:>?/.pptx" contains invalid characters. Please use a different name. Common invalid characters include the following: # % * : < > ? /  | (0x80131500)
[System.Threading.Thread.InternalCrossContextCallback(System.Runtime.Remoting.Contexts.Context ctx, IntPtr ctxID, Int32 appDomainID, System.Threading.InternalCrossContextDelegate ftnToCall, System.Object[] args) in :il 0], , The file or folder name "/sites/fabrikam-inc/Shared Documents/TestConnector/SubFolder1/Sample23#%25*:>?/.pptx" contains invalid characters. Please use a different name. Common invalid characters include the following: # % * : < > ? /  | (0x80131500)
[System.Runtime.Remoting.Channels.CrossContextChannel.SyncProcessMessageCallback(System.Object[] args) in :il 0], , The file or folder name "/sites/fabrikam-inc/Shared Documents/TestConnector/SubFolder1/Sample23#%25*:>?/.pptx" contains invalid characters. Please use a different name. Common invalid characters include the following: # % * : < > ? /  | (0x80131500)
[System.Runtime.Remoting.Messaging.ServerContextTerminatorSink.SyncProcessMessage(System.Runtime.Remoting.Messaging.IMessage reqMsg) in :il 0], , The file or folder name "/sites/fabrikam-inc/Shared Documents/TestConnector/SubFolder1/Sample23#%25*:>?/.pptx" contains invalid characters. Please use a different name. Common invalid characters include the following: # % * : < > ? /  | (0x80131500)
[System.Runtime.Remoting.Messaging.ServerObjectTerminatorSink.SyncProcessMessage(System.Runtime.Remoting.Messaging.IMessage reqMsg) in :il 0], , The file or folder name "/sites/fabrikam-inc/Shared Documents/TestConnector/SubFolder1/Sample23#%25*:>?/.pptx" contains invalid characters. Please use a different name. Common invalid characters include the following: # % * : < > ? /  | (0x80131500)
[System.Runtime.Remoting.Messaging.StackBuilderSink.SyncProcessMessage(System.Runtime.Remoting.Messaging.IMessage msg) in :il 0], , The file or folder name "/sites/fabrikam-inc/Shared Documents/TestConnector/SubFolder1/Sample23#%25*:>?/.pptx" contains invalid characters. Please use a different name. Common invalid characters include the following: # % * : < > ? /  | (0x80131500)
[System.Runtime.Remoting.Messaging.StackBuilderSink._PrivateProcessMessage(IntPtr md, System.Object[] args, System.Object server, System.Object[]& outArgs) in :il 0], , The file or folder name "/sites/fabrikam-inc/Shared Documents/TestConnector/SubFolder1/Sample23#%25*:>?/.pptx" contains invalid characters. Please use a different name. Common invalid characters include the following: # % * : < > ? /  | (0x80131500)
[Mfiles.SharePoint.Connector.Core.RepositorySession.RenameObject(MFiles.Extensibility.ExternalRepositories.ObjectVersionIdentity identity, System.String newName, MFiles.Extensibility.ExternalRepositories.ObjectVersionDataRequest request) in RepositorySession.cs:line 637], , The file or folder name "/sites/fabrikam-inc/Shared Documents/TestConnector/SubFolder1/Sample23#%25*:>?/.pptx" contains invalid characters. Please use a different name. Common invalid characters include the following: # % * : < > ? /  | (0x80131500)
[Mfiles.SharePoint.Connector.Core.RepositorySession.RenameFile(MFiles.Extensibility.ExternalRepositories.ObjectVersionIdentity objectId, MFiles.Extensibility.ExternalRepositories.FileVersionIdentity fileId, System.String newName, System.String newExtension, MFiles.Extensibility.ExternalRepositories.ObjectVersionDataRequest request) in RepositorySession.cs:line 599], , The file or folder name "/sites/fabrikam-inc/Shared Documents/TestConnector/SubFolder1/Sample23#%25*:>?/.pptx" contains invalid characters. Please use a different name. Common invalid characters include the following: # % * : < > ? /  | (0x80131500)
[Mfiles.SharePoint.Connector.Core.ConnectorOperations.CoreOperationContext.RenameItem(MFiles.Extensibility.ExternalRepositories.ObjectVersionIdentity identity, System.String newName, System.String newExtension) in CoreOperationContext.cs:line 638], , The file or folder name "/sites/fabrikam-inc/Shared Documents/TestConnector/SubFolder1/Sample23#%25*:>?/.pptx" contains invalid characters. Please use a different name. Common invalid characters include the following: # % * : < > ? /  | (0x80131500)
(M-Files 19.1.7241.0)

(0474)
DEBUG: Test Passed: Rollback operation cannot be performed for external objects.
DEBUG: Test Passed: Comments cannot be added to the unmanaged object.
DEBUG: Test Passed: Comment can be added to the promoted object.
