DEBUG: Test Passed. Root folder has objects and the count is 55
DEBUG: Test Passed. Status of the object Performance376.txt is, CheckedOut:False
DEBUG: Test Passed.File Converted to PDF. EscapedTitleWithID:Performance376 (ID 1).pdf
DEBUG: Test Passed. Performance39.xlsx is available in the external repository and the DeletedStatus is False
DEBUG: Test Passed: Promoted Object Performance39.xlsx has been deleted from repository.
DEBUG: Test Passed: Object Performance42.docx has been deleted from repository. No object with the name Performance42.docx exists.
DEBUG: Test Passed.Demoting the promoted object is successfull. Object Performance457.txt is of type Internal:False
DEBUG: Test Passed. Check in operation is successfull and the status of object Performance457.txt is, CheckedOut:False
DEBUG: Test Passed. Staus of the object Performance457.txt after undo checkout operation is CheckedOut:False
DEBUG: Test Passed. Promoting the unmanaged object is successfull. Object File8.txt is of type Internal:True
DEBUG: Test Passed. Promoting the unmanaged object is successfull. Object File8.docx is of type Internal:True
DEBUG: Test Passed. Downloading the object Performance457.txt is successful.
DEBUG: Test Passed. Properties of the object Performance457.txt is not empty.
DEBUG: Test Passed. Renaming the object is successful and the new named object is TestObject507
DEBUG: Test Passed:  External object Performance634.docx is not available in deleted search view.
DEBUG: Test Passed. Sub folder has objects and the count is 35
DEBUG: Test Passed. Object is checked out successfully and the status of object Performance673.txt is CheckedOut:True
DEBUG: Test Passed.The permission of external object is not changed.
DEBUG: Test Passed.The permission of external object is not changed.
DEBUG: Test Passed. Renaming the object same as another file fails and the name is stil File6
DEBUG: Test Passed. Renaming the object same as another file fails and the name is stil File6
DEBUG: Test Passed. Object is not checked out by read only user and the Check Out status of object File1.docx is False
DEBUG: Test Passed. Object is not checked out by read only user and the Check Out status of object File1.docx is False
DEBUG: Test Passed: Adding the unmanaged object Performance673.txt thorws expected error Not found.
DEBUG: Test Passed. Properties of the object is not empty
DEBUG: Test Passed. Properties of the object is not empty
DEBUG: Test Passed: Adding & removing promoted object File8.docx from favorite is successfull.
DEBUG: Test Passed. Multiple objects were checked out at same time.
DEBUG: Test Passed. Multiple objects were checked out at same time.
DEBUG: Test Passed. Cannot check out the object which was checked out by another user. Checked Out to BillR
DEBUG: Test Passed. Multiple objects were checked out at same time.
DEBUG: Test Passed. Multiple objects were checked out at same time.
DEBUG: Test Passed. Repository name in metadata of external object is Amazon S3
DEBUG: Test Passed. Repository name in metadata of external object is Amazon S3
DEBUG: Test Passed: Multiple proerties is added to the metadatacard of promoted object.
DEBUG: Test Passed: Property is added to the metadatacard of promoted object.
DEBUG: Test Passed: Properties cannot be added to metadata of unmamaged object.
DEBUG: Test Passed: Unmanaged SFD object cannot be converted to MFD document
DEBUG: Test Passed: Multiple objects can be demoted at once.
DEBUG: Test Passed: Demoting the object Sample9.pptx with standard user is not possible.
DEBUG: Test Passed: Demoting cannot be done for promoted object when it is in checked out state. Check in the object first to perform this operation.

CoVaultExternalObjectOperations.cpp, 295, Check in the object first to perform this operation. (0x8004095D)
ServerVaultExternalObjectOperationsHelper.cpp, 103, Check in the object first to perform this operation. (0x8004095D)
LatestRPC.generated.cpp, 31055, Check in the object first to perform this operation. (0x8004095D)
RPCDocumentOperations.cpp, 13948, Check in the object first to perform this operation. (0x8004095D)
RPCDocumentOperations.cpp, 10173, Check in the object first to perform this operation. (0x8004095D)
MCallInLoop.h, 449, Check in the object first to perform this operation. (0x8004095D)
RPCDocumentOperationsHelper.cpp, 5627, Check in the object first to perform this operation. (0x8004095D)
RPCDocumentOperationsHelper.cpp, 43933, Check in the object first to perform this operation. (0x8004095D)
RPCDocumentOperationsHelper.cpp, 13990, Check in the object first to perform this operation. (0x8004095D)
(M-Files 19.2.7353.0)

(0052)
DEBUG: Test Passed: Multiple objects can be destroyed from external repository.
DEBUG: Test Passed: Promoted Object TestDocument10 - Copy.docx has been destroyed from repository. No object with the name TestDocument10 - Copy.docx exists.
DEBUG: Test Passed: Destroying promoted object TestDocument12.docx with standard user is not possible.
DEBUG: Test Passed: Unmanaged Object TestDocument13 - Copy.docx has been destroyed from repository. No object with the name TestDocument13 - Copy.docx exists.
DEBUG: Test Passed: Destroying unmanaged object TestDocument13.docx with standard user is not possible.
DEBUG: Test Passed: Editing the object which was promoted by another user is successful.
DEBUG: Test Passed: External object cannot be marked for archiving.
DEBUG: Test Passed: External object cannot be marked for archiving.
DEBUG: Test Passed: Promoted object can be set for offline availability.
DEBUG: Test Passed: Unmamaged object cannot be set for offline availability.
DEBUG: Test Passed: User with read only user cannot promote the unmanaged object.Access denied. Your license type does not allow this operation.

CoVaultExternalObjectOperations.cpp, 185, Access denied. Your license type does not allow this operation. (0x8004080B)
ServerVaultExternalObjectOperationsHelper.cpp, 51, Access denied. Your license type does not allow this operation. (0x8004080B)
LatestRPC.generated.cpp, 30055, Access denied. Your license type does not allow this operation. (0x8004080B)
RPCDocumentOperations.cpp, 13914, Access denied. Your license type does not allow this operation. (0x8004080B)
RPCDocumentOperations.cpp, 9904, Access denied. Your license type does not allow this operation. (0x8004080B)
SessionManager.cpp, 1244, Access denied. Your license type does not allow this operation. (0x8004080B)
MFSession.cpp, 1062, Access denied. Your license type does not allow this operation. (0x8004080B)
MFSession.cpp, 1093, Access denied. Your license type does not allow this operation. (0x8004080B)
(M-Files 19.2.7353.0)

(0063)
DEBUG: Test Passed: Special characters #%*:<>?/ should not a part of object title The character "/" is not allowed.
The character "/" is not allowed.

CoVaultObjectOperations.cpp, 604, The character "/" is not allowed. (0x80131600)
ServerVaultObjectOperationsHelper.cpp, 65, The character "/" is not allowed. (0x80131600)
RPCObjectOperationsHelper.cpp, 283, The character "/" is not allowed. (0x80131600)
LatestRPC.generated.cpp, 18689, The character "/" is not allowed. (0x80131600)
RPCDocumentOperations.cpp, 10924, The character "/" is not allowed. (0x80131600)
RPCDocumentOperations.cpp, 5734, The character "/" is not allowed. (0x80131600)
MCallInLoop.h, 449, The character "/" is not allowed. (0x80131600)
RPCDocumentOperationsHelper.cpp, 4214, The character "/" is not allowed. (0x80131600)
VaultDBSession.cpp, 129, The character "/" is not allowed. (0x80131600)
DBSession.cpp, 705, The character "/" is not allowed. (0x80131600)
CachedDBSession.cpp, 1204, The character "/" is not allowed. (0x80131600)
TransactionActions.cpp, 147, The character "/" is not allowed. (0x80131600)
TransactionActions.cpp, 335, The character "/" is not allowed. (0x80131600)
VaultAction_ExternalRepositoryOperations.cpp, 2095, The character "/" is not allowed. (0x80131600)
VaultAction_ExternalRepositoryOperations.cpp, 685, The character "/" is not allowed. (0x80131600)
VaultAction_ExternalRepositoryOperations.cpp, 1637, The character "/" is not allowed. (0x80131600)
VaultAction_ExternalRepositoryOperations.cpp, 2664, The character "/" is not allowed. (0x80131600)
ExternalRepositoryHelper.cpp, 1900, The character "/" is not allowed. (0x80131600)
CoContentProviderHost.cpp, 487, The character "/" is not allowed. (0x80131600)
ManagedError.cpp, 129, The character "/" is not allowed. (0x80131600)
ConnectorPackageA1: [CManagedError* CContentProviderHost.RenameObject(CContentProviderHost*, CManagedError*, CMF_ExtensionCallInformation*, CMF_ObjVer*, CMF_String*, CMF_ObjVer*)], IL:29, The character "/" is not allowed. (0x80131600)
ConnectorPackageA1: [MFiles.Common.Types.ObjVer RenameObject(MFiles.ExternalConnectorHost.CallContext, MFiles.Common.Types.ObjVer, System.String)], IL:78, The character "/" is not allowed. (0x80131600)
ConnectorPackageA1: [TResult ForSystem[TResult](MFiles.ExternalConnectorHost.CallContext, System.String, MFiles.Common.Types.ExtensionAuthenticationResponse, MFiles.ExternalConnectorHost.RepositoryConnectorHosting.DenyUserInteraction, System.Func`2[MFiles.ExternalConnectorHost.RepositoryConnectorHosting.RepositoryConnectorContext,TResult])], IL:0, The character "/" is not allowed. (0x80131600)
ConnectorPackageA1: [TResult ForSystem[TResult](MFiles.ExternalConnectorHost.CallContext, System.String, MFiles.Common.Types.ExtensionAuthenticationResponse, MFiles.ExternalConnectorHost.RepositoryConnectorHosting.ExplicitLogin, MFiles.ExternalConnectorHost.RepositoryConnectorHosting.DenyUserInteraction, System.Func`2[MFiles.ExternalConnectorHost.RepositoryConnectorHosting.RepositoryConnectorContext,TResult])], IL:161, The character "/" is not allowed. (0x80131600)
ConnectorPackageA1: [TMFilesResult <ForObject>b__0(MFiles.ExternalConnectorHost.RepositoryConnectorHosting.RepositoryConnectorContext)], IL:55, The character "/" is not allowed. (0x80131600)
ConnectorPackageA1: [MFiles.ExternalConnectorHost.RepositoryConnectorHosting.ConnectorCallResult <RenameObject>b__0(MFiles.ExternalConnectorHost.RepositoryConnectorHosting.RepositoryConnectorContext)], IL:0, The character "/" is not allowed. (0x80131600)
ConnectorPackageA1: [MFiles.Extensibility.ExternalRepositories.ObjectVersionData RenameObject(MFiles.Extensibility.ExternalRepositories.ObjectVersionIdentity, System.String, MFiles.Extensibility.ExternalRepositories.ObjectVersionDataRequest)], IL:-1, The character "/" is not allowed. (0x80131600)
ConnectorPackageA1: [Void PrivateInvoke(System.Runtime.Remoting.Proxies.MessageData ByRef, Int32)], IL:442, The character "/" is not allowed. (0x80131600)
ConnectorPackageA1: [Void HandleReturnMessage(System.Runtime.Remoting.Messaging.IMessage, System.Runtime.Remoting.Messaging.IMessage)], IL:39, The character "/" is not allowed. (0x80131600)
[System.Runtime.Remoting.Channels.CrossAppDomainSink.DoTransitionDispatchCallback(System.Object[] args) in :il 0], , The character "/" is not allowed. (0x80131500)
[System.Runtime.Remoting.Channels.CrossAppDomainSink.DoDispatch(Byte[] reqStmBuff, System.Runtime.Remoting.Messaging.SmuggledMethodCallMessage smuggledMcm, System.Runtime.Remoting.Messaging.SmuggledMethodReturnMessage& smuggledMrm) in :il 0], , The character "/" is not allowed. (0x80131500)
[System.Runtime.Remoting.Channels.ChannelServices.SyncDispatchMessage(System.Runtime.Remoting.Messaging.IMessage msg) in :il 0], , The character "/" is not allowed. (0x80131500)
[System.Runtime.Remoting.Channels.CrossContextChannel.SyncProcessMessage(System.Runtime.Remoting.Messaging.IMessage reqMsg) in :il 0], , The character "/" is not allowed. (0x80131500)
[System.Threading.Thread.InternalCrossContextCallback(System.Runtime.Remoting.Contexts.Context ctx, IntPtr ctxID, Int32 appDomainID, System.Threading.InternalCrossContextDelegate ftnToCall, System.Object[] args) in :il 0], , The character "/" is not allowed. (0x80131500)
[System.Runtime.Remoting.Channels.CrossContextChannel.SyncProcessMessageCallback(System.Object[] args) in :il 0], , The character "/" is not allowed. (0x80131500)
[System.Runtime.Remoting.Messaging.ServerContextTerminatorSink.SyncProcessMessage(System.Runtime.Remoting.Messaging.IMessage reqMsg) in :il 0], , The character "/" is not allowed. (0x80131500)
[System.Runtime.Remoting.Messaging.ServerObjectTerminatorSink.SyncProcessMessage(System.Runtime.Remoting.Messaging.IMessage reqMsg) in :il 0], , The character "/" is not allowed. (0x80131500)
[System.Runtime.Remoting.Messaging.StackBuilderSink.SyncProcessMessage(System.Runtime.Remoting.Messaging.IMessage msg) in :il 0], , The character "/" is not allowed. (0x80131500)
[System.Runtime.Remoting.Messaging.StackBuilderSink._PrivateProcessMessage(IntPtr md, System.Object[] args, System.Object server, System.Object[]& outArgs) in :il 0], , The character "/" is not allowed. (0x80131500)
(M-Files 19.2.7353.0)

(0068)
DEBUG: Test Passed: Rollback operation cannot be performed for external objects.
DEBUG: Test Passed: Comments cannot be added to the unmanaged object.
DEBUG: Test Passed: Comment can be added to the promoted object.
