{
	"Test Users": {
		"Admin User":{
			"M-Files Credentials": {
				"Username": "TestNfA",
				"Password": "test"
			},
			"External Credentials":{
				"Username": "leo.danny",
				"Password": "aspire@123"
			}
		},
		"User 1":{
			"M-Files Credentials": {
				"Username": "TestNfA",
				"Password": "test"
			},
			"External Credentials":{
				"Username": "leo.danny",
				"Password": "aspire@123"
			}
		},
		"User 2":{
			"M-Files Credentials": {
				"Username": "TestNfS",
				"Password": "test"
			},
			"External Credentials":{
				"Username": "leo.danny",
				"Password": "aspire@123"
			}
		}
	},
	"External Repository Configuration":{
		
	},
	"Server Configuration":{
		"Server Network Address": "localhost",
		"Server Endpoint": "2266"
	},
	"Reports":{
		"SQL Server": "",
		"SQL Username": "",
		"SQL Password": ""
	},		
	"Connector Installation":{
		"Vault Name": "NetworkFolderTestVault18.10.6851.0",
		"Application Guid": "92a4e281-2e35-492b-8342-b8a713393a8f",
		"Connector Service Guid": "1eb122345a974e7c80b2c312696588e2",
		"Connector Path": "C:\ConfigurationFiles\NetworkFolder_18.10.6851.0\M-Files_Network_Folder_Connector_18_10_6851_0.mfappx",
		"Connector Installation Required": "Yes",
		"Connector Configuration Path": "C:\ConfigurationFiles\NetworkFolder\Configuration_NetworkFolder.json",
		"Connector License Path": "C:\ConfigurationFiles\NetworkFolder\Rnd.TestServer.NetworkFolderConnector.2018.lic",
		"Connector Configuration Required": "Yes",
		"Connector Name": "Network Folder",
		"Connector Authentication Required": "Yes",
		"Vault Restore Required": "No",
		"Create New Vault": "Yes",
		"Vault Folder Path": "C:\Program Files\M-Files\Server Vaults",
		"Vault Backup File Path": "C:\ConfigurationFiles\NetworkFolder\NetworkFolder.mfb"
	}
}