DEBUG: Test Passed. Root folder has objects and the count is 1
DEBUG: Test Passed. Status of the object Sample1.txt is, CheckedOut:False
DEBUG: Test Passed.File Converted to PDF. EscapedTitleWithID:Sample1 (ID 1).pdf
DEBUG: Test Passed. Sample10.txt is available in the external repository and the DeletedStatus is False
DEBUG: Test Passed: Promoted Object Sample10.txt has been deleted from repository.
DEBUG: Test Passed: Object Sample11.txt has been deleted from repository. No object with the name Sample11.txt exists.
DEBUG: Test Passed.Demoting the promoted object is successfull. Object Sample12.txt is of type Internal:False
DEBUG: Test Passed. Check in operation is successfull and the status of object Sample12.txt is, CheckedOut:False
DEBUG: Test Passed. Object is checked out successfully and the status of object Sample12.txt is CheckedOut:True
DEBUG: Test Passed. Staus of the object Sample12.txt after undo checkout operation is CheckedOut:False
DEBUG: Test Passed. Downloading the object Sample12.txt is successful.
DEBUG: Test Passed. Properties of the object Sample12.txt is not empty.
DEBUG: Test Passed. Renaming the object is successful and the new named object is TestObject370
DEBUG: Test Passed:  External object Sample13.txt is not available in deleted search view.
DEBUG: Test Passed. Sub folder has objects and the count is 35
DEBUG: Test Passed. Promoting the unmanaged object is successfull. Object File8.txt is of type Internal:True
DEBUG: Test Passed. Promoting the unmanaged object is successfull. Object File8.docx is of type Internal:True
DEBUG: Test Passed. Renaming the object same as another file fails and the name is stil File6
DEBUG: Test Passed. Renaming the object same as another file fails and the name is stil File6
DEBUG: Test Passed.The permission of external object is not changed.
DEBUG: Test Passed.The permission of external object is not changed.
DEBUG: Test Passed. Object is not checked out by read only user and the Check Out status of object File1.docx is False
DEBUG: Test Passed. Object is not checked out by read only user and the Check Out status of object File1.docx is False
DEBUG: Test Passed: Adding the unmanaged object Sample14.txt thorws expected error Not found.
DEBUG: Test Passed: Search with metadata operation succeds for managed objects File8.txt
DEBUG: Test Passed: Search with metadata operation succeds for managed objects File8.docx
DEBUG: Test Passed: Search with filecontents operation succeds for managed object File8.txt
DEBUG: Test Passed: Search with filecontents operation succeds for managed object File8.docx
DEBUG: Test Passed: Search with filecontents operation succeds for unmanaged objects File9.txt
DEBUG: Test Passed: Search with filecontents operation succeds for unmanaged objects File9.docx
DEBUG: Test Passed: Search with metadata operation succeds for unmanaged object File9.txt
DEBUG: Test Passed: Search with metadata operation succeds for unmanaged object File9.docx
DEBUG: Test Passed. Properties of the object is not empty
DEBUG: Test Passed. Properties of the object is not empty
DEBUG: Test Passed: Adding & removing promoted object File8.docx from favorite is successfull.
DEBUG: Test Passed. Multiple objects were checked out at same time.
DEBUG: Test Passed. Multiple objects were checked out at same time.
DEBUG: Test Passed. Cannot check out the object which was checked out by another user. Checked Out to TestNfS
DEBUG: Test Passed. Multiple objects were checked out at same time.
DEBUG: Test Passed. Multiple objects were checked out at same time.
DEBUG: Test Passed. Repository name in metadata of external object is New Connection
DEBUG: Test Passed. Repository name in metadata of external object is New Connection
DEBUG: Test Passed: Multiple proerties is added to the metadatacard of promoted object.
DEBUG: Test Passed: Property is added to the metadatacard of promoted object.
DEBUG: Test Passed: Properties cannot be added to metadata of unmamaged object.
DEBUG: Test Passed: Unmanaged SFD object cannot be converted to MFD document
DEBUG: Test Passed: Multiple objects can be demoted at once.
DEBUG: Test Passed: Demoting the object Sample6.txt with standard user is not possible.
DEBUG: Test Passed: Demoting cannot be done for promoted object when it is in checked out state. Check in the object first to perform this operation.

CoVaultExternalObjectOperations.cpp, 295, Check in the object first to perform this operation. (0x8004095D)
ServerVaultExternalObjectOperationsHelper.cpp, 103, Check in the object first to perform this operation. (0x8004095D)
LatestRPC.generated.cpp, 31055, Check in the object first to perform this operation. (0x8004095D)
RPCDocumentOperations.cpp, 13948, Check in the object first to perform this operation. (0x8004095D)
RPCDocumentOperations.cpp, 10173, Check in the object first to perform this operation. (0x8004095D)
MCallInLoop.h, 449, Check in the object first to perform this operation. (0x8004095D)
RPCDocumentOperationsHelper.cpp, 5627, Check in the object first to perform this operation. (0x8004095D)
RPCDocumentOperationsHelper.cpp, 43932, Check in the object first to perform this operation. (0x8004095D)
RPCDocumentOperationsHelper.cpp, 13990, Check in the object first to perform this operation. (0x8004095D)
(M-Files 19.2.7341.0)

(0052)
DEBUG: Test Passed: Multiple objects can be destroyed from external repository.
DEBUG: Test Passed: Promoted Object Sample8.txt has been destroyed from repository. No object with the name Sample8.txt exists.
DEBUG: Test Passed: Destroying promoted object Sample9.txt with standard user is not possible.
DEBUG: Test Passed: Unmanaged Object TestDocument1.docx has been destroyed from repository. No object with the name TestDocument1.docx exists.
DEBUG: Test Passed: Destroying unmanaged object TestDocument10.docx with standard user is not possible.
DEBUG: Test Passed: Editing the object which was promoted by another user is successful.
DEBUG: Test Passed: External object cannot be marked for archiving.
DEBUG: Test Passed: External object cannot be marked for archiving.
DEBUG: Test Passed: Promoted object can be set for offline availability.
DEBUG: Test Passed: Unmamaged object cannot be set for offline availability.
DEBUG: Test Passed: User with read only user cannot promote the unmanaged object.Access denied. Your license type does not allow this operation.

CoVaultExternalObjectOperations.cpp, 185, Access denied. Your license type does not allow this operation. (0x8004080B)
ServerVaultExternalObjectOperationsHelper.cpp, 51, Access denied. Your license type does not allow this operation. (0x8004080B)
LatestRPC.generated.cpp, 30055, Access denied. Your license type does not allow this operation. (0x8004080B)
RPCDocumentOperations.cpp, 13914, Access denied. Your license type does not allow this operation. (0x8004080B)
RPCDocumentOperations.cpp, 9904, Access denied. Your license type does not allow this operation. (0x8004080B)
SessionManager.cpp, 1244, Access denied. Your license type does not allow this operation. (0x8004080B)
MFSession.cpp, 1062, Access denied. Your license type does not allow this operation. (0x8004080B)
MFSession.cpp, 1093, Access denied. Your license type does not allow this operation. (0x8004080B)
(M-Files 19.2.7341.0)

(0063)
DEBUG: Test Passed: Special characters #%*:<>?/ can be added in the title of the object TestDocument13#%*:>?/
DEBUG: Test Passed: Rollback operation cannot be performed for external objects.
DEBUG: Test Passed: Comments cannot be added to the unmanaged object.
DEBUG: Test Passed: Comment can be added to the promoted object.
