﻿{
    "declaration": {
        "enabled": true,
        "displayName": "FileNet",
        "authenticationType": "Common",
        "permissionsOptions": {
            "enforceAcls": true,
            "naclUsage": "Always",
            "nacl": "{A470B682-2B52-48EF-B3A8-1A4B3F2B6B35}",
            "enforceAclsForFolderContents": true
        },
        "associationOptions": {
            "propertyBasedAssociationProperties": [],
            "loginBasedUserAssociation": true,
            "loginBasedGroupAssociation": 0,
            "replicateUserGroups": true
        },
        "mappingOptions": {
            "objectTypes": [
                {
                    "objectType": "{53F0C8FD-0BF0-47C4-8FA6-4C2D0DADB650}",
                    "externalType": "*"
                }
            ],
            "commonProperties": []
        },
        "searchIndex": {
            "metadataIndexingOptions": {
                "enabled": true,
                "folderCrawlerOptions": {
                    "refreshPeriodInHours": 23,
                    "newObjectCheckPeriodInHours": 71,
                    "indexObjectDataAssociatedWithFolders": true
                },
                "notifyServerAboutChangesInIndexing": true
            },
            "filedataIndexingOptions": {
                "enabled": true,
                "folderCrawlerOptions": {
                    "refreshPeriodInHours": 23,
                    "newObjectCheckPeriodInHours": 71,
                    "indexObjectDataAssociatedWithFolders": true
                },
                "notifyServerAboutChangesInIndexing": false
            },
            "indexObjectModifications": true,
            "verifyVersionVisibilityToUserInSearches": false,
            "errorLimitInOneBatch": 20,
            "indexAcls": true,
            "errorReportingLevel": "Error"
        },
        "debugOptions": {
            "trackFiles": false,
            "fastFolderCrawlerRefresh": false,
            "showErrorsInsteadOfIncompleteMetadata": false,
            "reportMissingPermissionsWhenRetrievingFolderContents": false,
            "treatAllErrorsAsGeneric": false
        },
        "removeInvalidCredentials": true
    },
    "customConfiguration": {
        "Logging": {
            "Level": "Off"
        },
        "Service Url": "http://mfl-fn-8.centralus.cloudapp.azure.com:9080/wsi/FNCEWS40MTOM",
        "Object Store": "CMDOS"
    }
}