DEBUG: Test Passed. Root folder has objects and the count is 9
DEBUG: Test Passed. Status of the object Sample12.txt is, CheckedOut:False
DEBUG: Test Passed.File Converted to PDF. EscapedTitleWithID:Sample12 (ID 1).pdf
DEBUG: Test Passed. Sample8.xlsx is available in the external repository and the DeletedStatus is False
DEBUG: Test Passed.Demoting the promoted object is successfull. Object Sample8.xlsx is of type Internal:False
DEBUG: Test Passed. Staus of the object Sample8.xlsx after undo checkout operation is CheckedOut:False
DEBUG: Test Passed. Object is checked out successfully and the status of object Sample8.xlsx is CheckedOut:True
DEBUG: Test Passed: Object Sample8.xlsx has been deleted from repository.
DEBUG: Test Passed. Check in operation is successfull and the status of object TestDocument11 - Copy.docx is, CheckedOut:False
DEBUG: Test Passed. Downloading the object TestDocument11 - Copy.docx is successful.
DEBUG: Test Passed. Properties of the object TestDocument11 - Copy.docx is not empty.
DEBUG: Test Passed. Renaming the object is successful and the new named object is TestObject302
DEBUG: Test Passed:  External object TestObject302.docx is not available in deleted search view.
DEBUG: Test Passed. Sub folder has objects and the count is 35
DEBUG: Test Passed. Promoting the unmanaged object is successfull. Object File8.txt is of type Internal:True
DEBUG: Test Passed. Promoting the unmanaged object is successfull. Object File8.docx is of type Internal:True
DEBUG: Test Passed.The permission of external object is not changed.
DEBUG: Test Passed.The permission of external object is not changed.
DEBUG: Test Passed. Object is not checked out by read only user and the Check Out status of object File12.txt is False
DEBUG: Test Passed. Object is not checked out by read only user and the Check Out status of object File12.txt is False
DEBUG: Test Passed: Adding the unmanaged object TestDocument4 - Copy.docx thorws expected error Not found.
ERROR: Test Failed:Search with metadata operation fails for managed objects File8.txt
ERROR: Test Failed: Search with filecontents operation fails for managed object File8.txt
ERROR: Test Failed: Search with filecontents operation fails for unmanaged objects File9.txt
DEBUG: Test Passed: Search with metadata operation succeds for unmanaged object File9.txt
DEBUG: Test Passed: Search with metadata operation succeds for unmanaged object File9.docx
DEBUG: Test Passed. Properties of the object is not empty
DEBUG: Test Passed. Properties of the object is not empty
DEBUG: Test Passed: Adding & removing promoted object File8.docx from favorite is successfull.
ERROR: System.Runtime.InteropServices.COMException (0x80040001): The object cannot be checked out. This may be because the file in the external repository is read-only or has been checked out by another user or process. (The file "https://intopalooy.sharepoint.com/sites/fabrikam-inc/Shared Documents/TestConnector/File11.txt" is checked out for editing by i:0#.f|membership|jonathan.doe@intopaloo.)

CoVaultObjectOperations.cpp, 787, The object cannot be checked out. This may be because the file in the external repository is read-only or has been checked out by another user or process. (The file "https://intopalooy.sharepoint.com/sites/fabrikam-inc/Shared Documents/TestConnector/File11.txt" is checked out for editing by i:0#.f|membership|jonathan.doe@intopaloo.) (0x80040957)
ServerVaultObjectOperationsHelper.cpp, 183, The object cannot be checked out. This may be because the file in the external repository is read-only or has been checked out by another user or process. (The file "https://intopalooy.sharepoint.com/sites/fabrikam-inc/Shared Documents/TestConnector/File11.txt" is checked out for editing by i:0#.f|membership|jonathan.doe@intopaloo.) (0x80040957)
LatestRPC.generated.cpp, 9565, The object cannot be checked out. This may be because the file in the external repository is read-only or has been checked out by another user or process. (The file "https://intopalooy.sharepoint.com/sites/fabrikam-inc/Shared Documents/TestConnector/File11.txt" is checked out for editing by i:0#.f|membership|jonathan.doe@intopaloo.) (0x80040957)
RPCDocumentOperations.cpp, 10777, The object cannot be checked out. This may be because the file in the external repository is read-only or has been checked out by another user or process. (The file "https://intopalooy.sharepoint.com/sites/fabrikam-inc/Shared Documents/TestConnector/File11.txt" is checked out for editing by i:0#.f|membership|jonathan.doe@intopaloo.) (0x80040957)
RPCDocumentOperations.cpp, 5919, The object cannot be checked out. This may be because the file in the external repository is read-only or has been checked out by another user or process. (The file "https://intopalooy.sharepoint.com/sites/fabrikam-inc/Shared Documents/TestConnector/File11.txt" is checked out for editing by i:0#.f|membership|jonathan.doe@intopaloo.) (0x80040957)
MCallInLoop.h, 358, The object cannot be checked out. This may be because the file in the external repository is read-only or has been checked out by another user or process. (The file "https://intopalooy.sharepoint.com/sites/fabrikam-inc/Shared Documents/TestConnector/File11.txt" is checked out for editing by i:0#.f|membership|jonathan.doe@intopaloo.) (0x80040957)
RPCDocumentOperationsHelper.cpp, 4360, The object cannot be checked out. This may be because the file in the external repository is read-only or has been checked out by another user or process. (The file "https://intopalooy.sharepoint.com/sites/fabrikam-inc/Shared Documents/TestConnector/File11.txt" is checked out for editing by i:0#.f|membership|jonathan.doe@intopaloo.) (0x80040957)
VaultDBSession.cpp, 125, The object cannot be checked out. This may be because the file in the external repository is read-only or has been checked out by another user or process. (The file "https://intopalooy.sharepoint.com/sites/fabrikam-inc/Shared Documents/TestConnector/File11.txt" is checked out for editing by i:0#.f|membership|jonathan.doe@intopaloo.) (0x80040957)
DBSession.cpp, 705, The object cannot be checked out. This may be because the file in the external repository is read-only or has been checked out by another user or process. (The file "https://intopalooy.sharepoint.com/sites/fabrikam-inc/Shared Documents/TestConnector/File11.txt" is checked out for editing by i:0#.f|membership|jonathan.doe@intopaloo.) (0x80040957)
CachedDBSession.cpp, 1204, The object cannot be checked out. This may be because the file in the external repository is read-only or has been checked out by another user or process. (The file "https://intopalooy.sharepoint.com/sites/fabrikam-inc/Shared Documents/TestConnector/File11.txt" is checked out for editing by i:0#.f|membership|jonathan.doe@intopaloo.) (0x80040957)
TransactionActions.cpp, 147, The object cannot be checked out. This may be because the file in the external repository is read-only or has been checked out by another user or process. (The file "https://intopalooy.sharepoint.com/sites/fabrikam-inc/Shared Documents/TestConnector/File11.txt" is checked out for editing by i:0#.f|membership|jonathan.doe@intopaloo.) (0x80040957)
TransactionActions.cpp, 335, The object cannot be checked out. This may be because the file in the external repository is read-only or has been checked out by another user or process. (The file "https://intopalooy.sharepoint.com/sites/fabrikam-inc/Shared Documents/TestConnector/File11.txt" is checked out for editing by i:0#.f|membership|jonathan.doe@intopaloo.) (0x80040957)
VaultAction_ExternalRepositoryOperations.cpp, 1582, The object cannot be checked out. This may be because the file in the external repository is read-only or has been checked out by another user or process. (The file "https://intopalooy.sharepoint.com/sites/fabrikam-inc/Shared Documents/TestConnector/File11.txt" is checked out for editing by i:0#.f|membership|jonathan.doe@intopaloo.) (0x80040957)
VaultAction_ExternalRepositoryOperations.cpp, 634, The object cannot be checked out. This may be because the file in the external repository is read-only or has been checked out by another user or process. (The file "https://intopalooy.sharepoint.com/sites/fabrikam-inc/Shared Documents/TestConnector/File11.txt" is checked out for editing by i:0#.f|membership|jonathan.doe@intopaloo.) (0x80040957)
VaultAction_ExternalRepositoryOperations.cpp, 701, The object cannot be checked out. This may be because the file in the external repository is read-only or has been checked out by another user or process. (The file "https://intopalooy.sharepoint.com/sites/fabrikam-inc/Shared Documents/TestConnector/File11.txt" is checked out for editing by i:0#.f|membership|jonathan.doe@intopaloo.) (0x80040957)
VaultAction_ExternalRepositoryOperations.cpp, 1758, The object cannot be checked out. This may be because the file in the external repository is read-only or has been checked out by another user or process. (The file "https://intopalooy.sharepoint.com/sites/fabrikam-inc/Shared Documents/TestConnector/File11.txt" is checked out for editing by i:0#.f|membership|jonathan.doe@intopaloo.) (0x80040957)
VaultAction_ExternalRepositoryOperations.cpp, 2508, The object cannot be checked out. This may be because the file in the external repository is read-only or has been checked out by another user or process. (The file "https://intopalooy.sharepoint.com/sites/fabrikam-inc/Shared Documents/TestConnector/File11.txt" is checked out for editing by i:0#.f|membership|jonathan.doe@intopaloo.) (0x80040957)
AccessCoordinator.cs:line 148], , The object cannot be checked out. This may be because the file in the external repository is read-only or has been checked out by another user or process. (The file "https://intopalooy.sharepoint.com/sites/fabrikam-inc/Shared Documents/TestConnector/File11.txt" is checked out for editing by i:0#.f|membership|jonathan.doe@intopaloo.) (0x80040957)
OnlineOperationContext.cs:line 121], , The object cannot be checked out. This may be because the file in the external repository is read-only or has been checked out by another user or process. (The file "https://intopalooy.sharepoint.com/sites/fabrikam-inc/Shared Documents/TestConnector/File11.txt" is checked out for editing by i:0#.f|membership|jonathan.doe@intopaloo.) (0x80040957)
(M-Files 18.11.6987.0)

(0334)
   at MFilesAPI.IVaultObjectOperations.CheckOutMultipleObjects(ObjIDs ObjIDs)
   at Mfiles.Connectors.TestFramework.Tests.CheckInCheckOutUnmanagedObjects.CheckInCheckOutUnmanagedObjects_CheckOutMultipleObjects() in E:\BuildAgent\work\d39f3bee807c0e65\ConnectorTestAutomation\Mfiles.Connectors.TestFramework\Mfiles.Connectors.TestFramework\Tests\CheckInCheckOutUnmanagedObjects.cs:line 220 
Inner Exception:
 
DEBUG: Test Passed. Cannot check out the object which was checked out by another user. Checked Out to TestSonS
ERROR: System.Runtime.InteropServices.COMException (0x80040001): Not found.

CoVaultObjectOperations.cpp, 669, Not found. (0x8004000B)
ServerVaultObjectOperationsHelper.cpp, 106, Not found. (0x8004000B)
LatestRPC.generated.cpp, 9765, Not found. (0x8004000B)
RPCDocumentOperations.cpp, 10684, Not found. (0x8004000B)
RPCDocumentOperations.cpp, 5780, Not found. (0x8004000B)
MCallInLoop.h, 358, Not found. (0x8004000B)
RPCDocumentOperationsHelper.cpp, 4125, Not found. (0x8004000B)
RPCDocumentOperationsHelper.cpp, 4066, Not found. (0x8004000B)
ExternalRepositoryHelper.cpp, 5053, Not found. (0x8004000B)
ExternalRepositoryHelperAide.cpp, 110, Not found. (0x8004000B)
(M-Files 18.11.6987.0)

(0010)
   at MFilesAPI.IVaultObjectOperations.CheckInMultipleObjects(ObjVers ObjVers)
   at Mfiles.Connectors.TestFramework.Tests.CheckInCheckOutUnmanagedObjects.CheckInCheckOutUnmanagedObjects_CheckInMultipleObjects() in E:\BuildAgent\work\d39f3bee807c0e65\ConnectorTestAutomation\Mfiles.Connectors.TestFramework\Mfiles.Connectors.TestFramework\Tests\CheckInCheckOutUnmanagedObjects.cs:line 310 
Inner Exception:
 
DEBUG: Test Passed: Rollback operation cannot be performed for external objects.
DEBUG: Test Passed: Special characters #%*:<>?/ should not a part of object title The file or folder name "/sites/fabrikam-inc/Shared Documents/TestConnector/SubFolder1/Sample3#%25*:>?/.pptx" contains invalid characters. Please use a different name. Common invalid characters include the following: # % * : < > ? /  |

CoVaultObjectOperations.cpp, 604, The file or folder name "/sites/fabrikam-inc/Shared Documents/TestConnector/SubFolder1/Sample3#%25*:>?/.pptx" contains invalid characters. Please use a different name. Common invalid characters include the following: # % * : < > ? /  | (0x80131600)
ServerVaultObjectOperationsHelper.cpp, 65, The file or folder name "/sites/fabrikam-inc/Shared Documents/TestConnector/SubFolder1/Sample3#%25*:>?/.pptx" contains invalid characters. Please use a different name. Common invalid characters include the following: # % * : < > ? /  | (0x80131600)
RPCObjectOperationsHelper.cpp, 283, The file or folder name "/sites/fabrikam-inc/Shared Documents/TestConnector/SubFolder1/Sample3#%25*:>?/.pptx" contains invalid characters. Please use a different name. Common invalid characters include the following: # % * : < > ? /  | (0x80131600)
LatestRPC.generated.cpp, 9662, The file or folder name "/sites/fabrikam-inc/Shared Documents/TestConnector/SubFolder1/Sample3#%25*:>?/.pptx" contains invalid characters. Please use a different name. Common invalid characters include the following: # % * : < > ? /  | (0x80131600)
RPCDocumentOperations.cpp, 10639, The file or folder name "/sites/fabrikam-inc/Shared Documents/TestConnector/SubFolder1/Sample3#%25*:>?/.pptx" contains invalid characters. Please use a different name. Common invalid characters include the following: # % * : < > ? /  | (0x80131600)
RPCDocumentOperations.cpp, 5714, The file or folder name "/sites/fabrikam-inc/Shared Documents/TestConnector/SubFolder1/Sample3#%25*:>?/.pptx" contains invalid characters. Please use a different name. Common invalid characters include the following: # % * : < > ? /  | (0x80131600)
MCallInLoop.h, 358, The file or folder name "/sites/fabrikam-inc/Shared Documents/TestConnector/SubFolder1/Sample3#%25*:>?/.pptx" contains invalid characters. Please use a different name. Common invalid characters include the following: # % * : < > ? /  | (0x80131600)
RPCDocumentOperationsHelper.cpp, 4175, The file or folder name "/sites/fabrikam-inc/Shared Documents/TestConnector/SubFolder1/Sample3#%25*:>?/.pptx" contains invalid characters. Please use a different name. Common invalid characters include the following: # % * : < > ? /  | (0x80131600)
VaultDBSession.cpp, 125, The file or folder name "/sites/fabrikam-inc/Shared Documents/TestConnector/SubFolder1/Sample3#%25*:>?/.pptx" contains invalid characters. Please use a different name. Common invalid characters include the following: # % * : < > ? /  | (0x80131600)
DBSession.cpp, 705, The file or folder name "/sites/fabrikam-inc/Shared Documents/TestConnector/SubFolder1/Sample3#%25*:>?/.pptx" contains invalid characters. Please use a different name. Common invalid characters include the following: # % * : < > ? /  | (0x80131600)
CachedDBSession.cpp, 1204, The file or folder name "/sites/fabrikam-inc/Shared Documents/TestConnector/SubFolder1/Sample3#%25*:>?/.pptx" contains invalid characters. Please use a different name. Common invalid characters include the following: # % * : < > ? /  | (0x80131600)
TransactionActions.cpp, 147, The file or folder name "/sites/fabrikam-inc/Shared Documents/TestConnector/SubFolder1/Sample3#%25*:>?/.pptx" contains invalid characters. Please use a different name. Common invalid characters include the following: # % * : < > ? /  | (0x80131600)
TransactionActions.cpp, 335, The file or folder name "/sites/fabrikam-inc/Shared Documents/TestConnector/SubFolder1/Sample3#%25*:>?/.pptx" contains invalid characters. Please use a different name. Common invalid characters include the following: # % * : < > ? /  | (0x80131600)
VaultAction_ExternalRepositoryOperations.cpp, 1582, The file or folder name "/sites/fabrikam-inc/Shared Documents/TestConnector/SubFolder1/Sample3#%25*:>?/.pptx" contains invalid characters. Please use a different name. Common invalid characters include the following: # % * : < > ? /  | (0x80131600)
VaultAction_ExternalRepositoryOperations.cpp, 640, The file or folder name "/sites/fabrikam-inc/Shared Documents/TestConnector/SubFolder1/Sample3#%25*:>?/.pptx" contains invalid characters. Please use a different name. Common invalid characters include the following: # % * : < > ? /  | (0x80131600)
VaultAction_ExternalRepositoryOperations.cpp, 949, The file or folder name "/sites/fabrikam-inc/Shared Documents/TestConnector/SubFolder1/Sample3#%25*:>?/.pptx" contains invalid characters. Please use a different name. Common invalid characters include the following: # % * : < > ? /  | (0x80131600)
VaultAction_ExternalRepositoryOperations.cpp, 2139, The file or folder name "/sites/fabrikam-inc/Shared Documents/TestConnector/SubFolder1/Sample3#%25*:>?/.pptx" contains invalid characters. Please use a different name. Common invalid characters include the following: # % * : < > ? /  | (0x80131600)
ExternalRepositoryHelper.cpp, 1872, The file or folder name "/sites/fabrikam-inc/Shared Documents/TestConnector/SubFolder1/Sample3#%25*:>?/.pptx" contains invalid characters. Please use a different name. Common invalid characters include the following: # % * : < > ? /  | (0x80131600)
CoContentProviderHost.cpp, 487, The file or folder name "/sites/fabrikam-inc/Shared Documents/TestConnector/SubFolder1/Sample3#%25*:>?/.pptx" contains invalid characters. Please use a different name. Common invalid characters include the following: # % * : < > ? /  | (0x80131600)
ManagedError.cpp, 129, The file or folder name "/sites/fabrikam-inc/Shared Documents/TestConnector/SubFolder1/Sample3#%25*:>?/.pptx" contains invalid characters. Please use a different name. Common invalid characters include the following: # % * : < > ? /  | (0x80131600)
Mfiles.SharePoint.Connector.Online: [CManagedError* CContentProviderHost.RenameObject(CContentProviderHost*, CManagedError*, CMF_ExtensionCallInformation*, CMF_ObjVer*, CMF_String*, CMF_ObjVer*)], IL:29, The file or folder name "/sites/fabrikam-inc/Shared Documents/TestConnector/SubFolder1/Sample3#%25*:>?/.pptx" contains invalid characters. Please use a different name. Common invalid characters include the following: # % * : < > ? /  | (0x80131600)
Mfiles.SharePoint.Connector.Online: [MFiles.Common.Types.ObjVer RenameObject(MFiles.ExternalConnectorHost.CallContext, MFiles.Common.Types.ObjVer, System.String)], IL:78, The file or folder name "/sites/fabrikam-inc/Shared Documents/TestConnector/SubFolder1/Sample3#%25*:>?/.pptx" contains invalid characters. Please use a different name. Common invalid characters include the following: # % * : < > ? /  | (0x80131600)
Mfiles.SharePoint.Connector.Online: [TResult ForSystem[TResult](MFiles.ExternalConnectorHost.CallContext, System.String, MFiles.Common.Types.ExtensionAuthenticationResponse, MFiles.ExternalConnectorHost.RepositoryConnectorHosting.DenyUserInteraction, System.Func`2[MFiles.ExternalConnectorHost.RepositoryConnectorHosting.RepositoryConnectorContext,TResult])], IL:0, The file or folder name "/sites/fabrikam-inc/Shared Documents/TestConnector/SubFolder1/Sample3#%25*:>?/.pptx" contains invalid characters. Please use a different name. Common invalid characters include the following: # % * : < > ? /  | (0x80131600)
Mfiles.SharePoint.Connector.Online: [TResult ForSystem[TResult](MFiles.ExternalConnectorHost.CallContext, System.String, MFiles.Common.Types.ExtensionAuthenticationResponse, MFiles.ExternalConnectorHost.RepositoryConnectorHosting.ExplicitLogin, MFiles.ExternalConnectorHost.RepositoryConnectorHosting.DenyUserInteraction, System.Func`2[MFiles.ExternalConnectorHost.RepositoryConnectorHosting.RepositoryConnectorContext,TResult])], IL:161, The file or folder name "/sites/fabrikam-inc/Shared Documents/TestConnector/SubFolder1/Sample3#%25*:>?/.pptx" contains invalid characters. Please use a different name. Common invalid characters include the following: # % * : < > ? /  | (0x80131600)
Mfiles.SharePoint.Connector.Online: [TMFilesResult <ForObject>b__0(MFiles.ExternalConnectorHost.RepositoryConnectorHosting.RepositoryConnectorContext)], IL:55, The file or folder name "/sites/fabrikam-inc/Shared Documents/TestConnector/SubFolder1/Sample3#%25*:>?/.pptx" contains invalid characters. Please use a different name. Common invalid characters include the following: # % * : < > ? /  | (0x80131600)
Mfiles.SharePoint.Connector.Online: [MFiles.ExternalConnectorHost.RepositoryConnectorHosting.ConnectorCallResult <RenameObject>b__0(MFiles.ExternalConnectorHost.RepositoryConnectorHosting.RepositoryConnectorContext)], IL:0, The file or folder name "/sites/fabrikam-inc/Shared Documents/TestConnector/SubFolder1/Sample3#%25*:>?/.pptx" contains invalid characters. Please use a different name. Common invalid characters include the following: # % * : < > ? /  | (0x80131600)
Mfiles.SharePoint.Connector.Online: [MFiles.Extensibility.ExternalRepositories.ObjectVersionData RenameObject(MFiles.Extensibility.ExternalRepositories.ObjectVersionIdentity, System.String, MFiles.Extensibility.ExternalRepositories.ObjectVersionDataRequest)], IL:-1, The file or folder name "/sites/fabrikam-inc/Shared Documents/TestConnector/SubFolder1/Sample3#%25*:>?/.pptx" contains invalid characters. Please use a different name. Common invalid characters include the following: # % * : < > ? /  | (0x80131600)
Mfiles.SharePoint.Connector.Online: [Void PrivateInvoke(System.Runtime.Remoting.Proxies.MessageData ByRef, Int32)], IL:442, The file or folder name "/sites/fabrikam-inc/Shared Documents/TestConnector/SubFolder1/Sample3#%25*:>?/.pptx" contains invalid characters. Please use a different name. Common invalid characters include the following: # % * : < > ? /  | (0x80131600)
Mfiles.SharePoint.Connector.Online: [Void HandleReturnMessage(System.Runtime.Remoting.Messaging.IMessage, System.Runtime.Remoting.Messaging.IMessage)], IL:39, The file or folder name "/sites/fabrikam-inc/Shared Documents/TestConnector/SubFolder1/Sample3#%25*:>?/.pptx" contains invalid characters. Please use a different name. Common invalid characters include the following: # % * : < > ? /  | (0x80131600)
(M-Files 18.11.6987.0)

(0235)
DEBUG: Test Passed: User with read only user cannot promote the unmanaged object.The action could not be completed because you could not be authenticated for accessing the external repository.
The operation was prevented because M-Files Server required input from the M-Files client, but the installed version of the client software does not have a communication channel from the server to the client.

CoVaultObjectOperations.cpp, 2205, The action could not be completed because you could not be authenticated for accessing the external repository. (0x80040959)
ServerVaultObjectOperationsHelper.cpp, 1216, The action could not be completed because you could not be authenticated for accessing the external repository. (0x80040959)
LatestRPC.generated.cpp, 12920, The action could not be completed because you could not be authenticated for accessing the external repository. (0x80040959)
RPCDocumentOperations.cpp, 11189, The action could not be completed because you could not be authenticated for accessing the external repository. (0x80040959)
RPCDocumentOperations.cpp, 6550, The action could not be completed because you could not be authenticated for accessing the external repository. (0x80040959)
ExternalRepositoryHelper.cpp, 4870, The action could not be completed because you could not be authenticated for accessing the external repository. (0x80040959)
ExternalRepositoryHelper.cpp, 4974, The action could not be completed because you could not be authenticated for accessing the external repository. (0x80040959)
ExternalRepositoryHelper.cpp, 748, The action could not be completed because you could not be authenticated for accessing the external repository. (0x80040959)
CoContentProviderHost.cpp, 215, The action could not be completed because you could not be authenticated for accessing the external repository. (0x80040959)
ManagedError.cpp, 129, The action could not be completed because you could not be authenticated for accessing the external repository. (0x80040959)
MFCLRBridgeV45: [CManagedError* CContentProviderHost.GetObjectInfo(CContentProviderHost*, CManagedError*, CMF_ExtensionCallInformation*, UInt32, CMF_ObjVer*, RPCServerArray<CMF_ObjectVersionEx>*)], IL:21, The action could not be completed because you could not be authenticated for accessing the external repository. (0x80040959)
MFCLRBridgeV45: [System.Collections.Generic.IEnumerable`1[MFiles.Common.Types.ObjectVersionEx] GetObjectInfo(MFiles.ExternalConnectorHost.CallContext, MFiles.Common.Types.ObjVerCollection)], IL:73, The action could not be completed because you could not be authenticated for accessing the external repository. (0x80040959)
MFCLRBridgeV45: [System.Collections.Generic.IEnumerable`1[TMFilesResult] ForObjectIdentifiersBySystem[TMFilesId,TConnectorIdentity,TConnectorResult,TMFilesResult](MFiles.ExternalConnectorHost.CallContext, System.Collections.Generic.IEnumerable`1[TMFilesId], MFiles.Common.Types.Acl.ObjectAccess, MFiles.ExternalConnectorHost.RepositoryConnectorHosting.LocationRequired, MFiles.ExternalConnectorHost.RepositoryConnectorHosting.DenyUserInteraction, MFiles.ExternalConnectorHost.RepositoryConnectorHosting.OperationContextForEvents, System.Func`3[System.Collections.Generic.IReadOnlyCollection`1[TConnectorIdentity],MFiles.ExternalConnectorHost.RepositoryConnectorHosting.RepositoryConnectorContext,System.Collections.Generic.IEnumerable`1[TConnectorResult]], System.Func`3[System.Collections.Generic.IEnumerable`1[TConnectorResult],MFiles.ExternalConnectorHost.RepositoryConnectorHosting.RepositoryConnectorContext,System.Collections.Generic.IEnumerable`1[TMFilesResult]], System.Func`2[System.Collections.Generic.IEnumerable`1[TMFilesId],System.Collections.Generic.IEnumerable`1[TMFilesResult]])], IL:24, The action could not be completed because you could not be authenticated for accessing the external repository. (0x80040959)
MFCLRBridgeV45: [Void ProcessObjects[TMFilesId,TConnectorIdentity,TConnectorResult,TMFilesResult](MFiles.ExternalConnectorHost.CallContext, MFiles.ExternalConnectorHost.RepositoryConnectorHosting.OperationContextForEvents, MFiles.ExternalConnectorHost.RepositoryConnectorHosting.LocationRequired, MFiles.ExternalConnectorHost.RepositoryConnectorHosting.DenyUserInteraction, System.Func`3[System.Collections.Generic.IReadOnlyCollection`1[TConnectorIdentity],MFiles.ExternalConnectorHost.RepositoryConnectorHosting.RepositoryConnectorContext,System.Collections.Generic.IEnumerable`1[TConnectorResult]], System.Func`3[System.Collections.Generic.IEnumerable`1[TConnectorResult],MFiles.ExternalConnectorHost.RepositoryConnectorHosting.RepositoryConnectorContext,System.Collections.Generic.IEnumerable`1[TMFilesResult]], MFiles.ExternalConnectorHost.RepositoryConnectorHosting.SystemObjectSplitter`2[TMFilesId,TMFilesResult], MFiles.Common.Types.Acl.ObjectAccess, System.Func`2[System.Collections.Generic.IEnumerable`1[TMFilesId],System.Collections.Generic.IEnumerable`1[TMFilesResult]])], IL:241, The action could not be completed because you could not be authenticated for accessing the external repository. (0x80040959)
MFCLRBridgeV45: [TResult ForSystem[TResult](MFiles.ExternalConnectorHost.CallContext, System.String, MFiles.Common.Types.ExtensionAuthenticationResponse, MFiles.ExternalConnectorHost.RepositoryConnectorHosting.DenyUserInteraction, System.Func`2[MFiles.ExternalConnectorHost.RepositoryConnectorHosting.RepositoryConnectorContext,TResult])], IL:0, The action could not be completed because you could not be authenticated for accessing the external repository. (0x80040959)
MFCLRBridgeV45: [TResult ForSystem[TResult](MFiles.ExternalConnectorHost.CallContext, System.String, MFiles.Common.Types.ExtensionAuthenticationResponse, MFiles.ExternalConnectorHost.RepositoryConnectorHosting.ExplicitLogin, MFiles.ExternalConnectorHost.RepositoryConnectorHosting.DenyUserInteraction, System.Func`2[MFiles.ExternalConnectorHost.RepositoryConnectorHosting.RepositoryConnectorContext,TResult])], IL:174, The action could not be completed because you could not be authenticated for accessing the external repository. (0x80040959)
MFCLRBridgeV45: [MFiles.ExternalConnectorHost.RepositoryConnectorHosting.RepositoryConnectorContext CreateContext(MFiles.ExternalConnectorHost.RepositoryConnectorHosting.EffectiveUser, MFiles.ExternalConnectorHost.CallContext, MFiles.ExternalConnectorHost.RepositoryConnectorHosting.ConnectionContext, MFiles.ExternalConnectorHost.RepositoryConnectorHosting.SessionCache.RepositorySessionCache, MFiles.ExternalConnectorHost.IServerVaultDataAccess, MFiles.ExternalConnectorHost.INativeConverter, MFiles.Common.Types.ExtensionAuthenticationResponse, Boolean, Boolean, MFiles.ExternalConnectorHost.RepositoryConnectorHosting.ExplicitLogin, MFiles.ExternalConnectorHost.RepositoryConnectorHosting.DenyUserInteraction)], IL:0, The action could not be completed because you could not be authenticated for accessing the external repository. (0x80040959)
MFCLRBridgeV45: [MFiles.ExternalConnectorHost.RepositoryConnectorHosting.SessionCache.CacheableSession GetSession(MFiles.ExternalConnectorHost.RepositoryConnectorHosting.EffectiveUser, MFiles.ExternalConnectorHost.CallContext, MFiles.ExternalConnectorHost.RepositoryConnectorHosting.ConnectionContext, MFiles.Common.Types.ExtensionAuthenticationResponse, Boolean, Boolean, MFiles.ExternalConnectorHost.RepositoryConnectorHosting.ExplicitLogin, MFiles.ExternalConnectorHost.RepositoryConnectorHosting.DenyUserInteraction)], IL:53, The action could not be completed because you could not be authenticated for accessing the external repository. (0x80040959)
MFCLRBridgeV45: [MFiles.ExternalConnectorHost.RepositoryConnectorHosting.AuthenticationHelperResult`1[TResult] ForUser[TResult](MFiles.ExternalConnectorHost.RepositoryConnectorHosting.EffectiveUser, MFiles.ExternalConnectorHost.CallContext, System.String, MFiles.Common.Types.ExtensionAuthenticationResponse, Boolean, Boolean, MFiles.ExternalConnectorHost.RepositoryConnectorHosting.ExplicitLogin, MFiles.ExternalConnectorHost.RepositoryConnectorHosting.DenyUserInteraction, NullResult, OnError, MFiles.ExternalConnectorHost.ApplicationHosting.CrossDomain.RemoteHandle`1[MFiles.Extensibility.ExternalRepositories.IRepositoryConnection], MFiles.ExternalConnectorHost.RepositoryConnectorHosting.RepositoryConnectorHost, System.Func`2[MFiles.Extensibility.ExternalRepositories.RepositorySessionInformation,TResult])], IL:178, The action could not be completed because you could not be authenticated for accessing the external repository. (0x80040959)
MFCLRBridgeV45: [MFiles.Common.Types.ExtensionAuthenticationResponse PerformAuthenticationFromUser(MFiles.ExternalConnectorHost.CallContext, MFiles.ExternalConnectorHost.RepositoryConnectorHosting.EffectiveUser, System.String, MFiles.Common.Types.PluginInfoCollection, MFiles.ExternalConnectorHost.RepositoryConnectorHosting.ExplicitLogin, MFiles.ExternalConnectorHost.RepositoryConnectorHosting.RepositoryConnectorHost, MFiles.ExternalConnectorHost.RepositoryConnectorHosting.DenyUserInteraction ByRef)], IL:161, The action could not be completed because you could not be authenticated for accessing the external repository. (0x80040959)
MFCLRBridgeV45: [MFiles.Common.Types.ExtensionAuthenticationResponse GetAuthenticationData(System.String, System.String, MFiles.Common.Types.PluginInfoCollection, MFiles.ExternalConnectorHost.RepositoryConnectorHosting.ExplicitLogin, MFiles.ExternalConnectorHost.RepositoryConnectorHosting.DenyUserInteraction ByRef)], IL:0, The action could not be completed because you could not be authenticated for accessing the external repository. (0x80040959)
MFCLRBridgeV45: [MFiles.Common.Types.ExtensionAuthenticationResponse GetExtensionAuthenticationFromUser(MFiles.Common.Types.CallInformation, System.String, System.String, MFiles.Common.Types.PluginInfoCollection, Boolean, Boolean ByRef)], IL:183, The action could not be completed because you could not be authenticated for accessing the external repository. (0x80040959)
MFCLRBridgeV45: [Void CManagedError.ThrowManagedExceptionOnCOMError(Int32)], IL:115, The action could not be completed because you could not be authenticated for accessing the external repository. (0x80040959)
CoServerVaultDataAccess.cpp, 825, The action could not be completed because you could not be authenticated for accessing the external repository. (0x80040959)
CoServerVaultDataAccess.cpp, 825, The operation was prevented because M-Files Server required input from the M-Files client, but the installed version of the client software does not have a communication channel from the server to the client. (0x80040932)
(M-Files 18.11.6987.0)

(0321)
DEBUG: Test Passed: Unmamaged object cannot be set for offline availability.
DEBUG: Test Passed: Promoted object can be set for offline availability.
DEBUG: Test Passed: Unmanaged Object Sample9 - Copy.xlsx has been destroyed from repository.
DEBUG: Test Passed: Promoted Object TestDocument6 - Copy.docx has been destroyed from repository.
DEBUG: Test Passed: Multiple objects can be destroyed from external repository.
DEBUG: Test Passed: Unmanaged SFD object cannot be converted to MFD document
DEBUG: Test Passed: Properties cannot be added to metadata of unmamaged object.
DEBUG: Test Passed: Property is added to the metadatacard of promoted object.
DEBUG: Test Passed: Comments cannot be added to the unmanaged object.
DEBUG: Test Passed: Comment can be added to the promoted object.
