DEBUG: Test Passed. Root folder has objects and the count is 29
DEBUG: Test Passed. Status of the object Sample3 - Copy (0900000380039d2f).txt is, CheckedOut:False
DEBUG: Test Passed.File Converted to PDF. EscapedTitleWithID:Sample3 - Copy (0900000380039d2f) (ID 1).pdf
DEBUG: Test Passed. Sample3 - Copy (0900000380039d30).xlsx is available in the external repository and the DeletedStatus is False
DEBUG: Test Passed: Promoted Object Sample3 - Copy (0900000380039d30).xlsx has been deleted from repository.
DEBUG: Test Passed: Object Sample3 - Copy (0900000380039d31).pptx has been deleted from repository.
DEBUG: Test Passed.Demoting the promoted object is successfull. Object Sample2 (0900000380039d32).pptx is of type Internal:False
DEBUG: Test Passed. Check in operation is successfull and the status of object Sample2 (0900000380039d32).pptx is, CheckedOut:False
DEBUG: Test Passed. Staus of the object Sample2 (0900000380039d32).pptx after undo checkout operation is CheckedOut:False
DEBUG: Test Passed. Promoting the unmanaged object is successfull. Object File8.txt is of type Internal:True
DEBUG: Test Passed. Promoting the unmanaged object is successfull. Object File8.docx is of type Internal:True
DEBUG: Test Passed. Downloading the object Sample2 (0900000380039d32).pptx is successful.
DEBUG: Test Passed. Properties of the object Sample2 (0900000380039d32).pptx is not empty.
DEBUG: Test Passed. Renaming the object is successful and the new named object is TestObject415 (0900000380039d32)
DEBUG: Test Passed:  External object TestObject415 (0900000380039d32).pptx is not available in deleted search view.
DEBUG: Test Passed. Sub folder has objects and the count is 44
DEBUG: Test Passed. Object is checked out successfully and the status of object Sample1 (0900000380039d24).xlsx is CheckedOut:True
DEBUG: Test Passed.The permission of external object is not changed.
DEBUG: Test Passed.The permission of external object is not changed.
DEBUG: Test Passed. Object is not checked out by read only user and the Check Out status of object File13 (090000038000f154).txt is False
DEBUG: Test Passed. Object is not checked out by read only user and the Check Out status of object File13 (090000038000f154).txt is False
DEBUG: Test Passed: Adding the unmanaged object Sample1 (0900000380039d24).xlsx thorws expected error Not found.
DEBUG: Test Passed: Adding & removing promoted object File8.docx from favorite is successfull.
DEBUG: Test Passed. Multiple objects were checked out at same time.
DEBUG: Test Passed. Multiple objects were checked out at same time.
DEBUG: Test Passed. Cannot check out the object which was checked out by another user. Checked Out to TestDocS
DEBUG: Test Passed. Multiple objects were checked out at same time.
DEBUG: Test Passed. Multiple objects were checked out at same time.
DEBUG: Test Passed. Repository name in metadata of external object is Documentum
DEBUG: Test Passed. Repository name in metadata of external object is Documentum
DEBUG: Test Passed: Multiple proerties is added to the metadatacard of promoted object.
DEBUG: Test Passed: Property is added to the metadatacard of promoted object.
DEBUG: Test Passed: Properties cannot be added to metadata of unmamaged object.
DEBUG: Test Passed: Unmanaged SFD object cannot be converted to MFD document
DEBUG: Test Passed: Multiple objects can be demoted at once.
DEBUG: Test Passed: Demoting cannot be done for promoted object when it is in checked out state.
DEBUG: Test Passed: Comments cannot be added to the unmanaged object.
DEBUG: Test Passed: Multiple objects can be destroyed from external repository.
DEBUG: Test Passed: Unmanaged Object Performance191 (090000038003892f).png has been destroyed from repository.
DEBUG: Test Passed: External object cannot be marked for archiving.
DEBUG: Test Passed: External object cannot be marked for archiving.
ERROR: System.NullReferenceException: Object reference not set to an instance of an object.
   at Mfiles.Connectors.TestFramework.Tests.ExternalRepoObjectOperations.ExternalRepoObjectOperations_MarkPromotedObjectForOffline() in D:\BuildAgent\work\d39f3bee807c0e65\ConnectorTestAutomation\Mfiles.Connectors.TestFramework\Mfiles.Connectors.TestFramework\Tests\ExternalRepoObjectOperations.cs:line 742 
Inner Exception:
 
ERROR: System.NullReferenceException: Object reference not set to an instance of an object.
   at Mfiles.Connectors.TestFramework.Tests.ExternalRepoObjectOperations.ExternalRepoObjectOperations_MarkUnManagedObjectForOffline() in D:\BuildAgent\work\d39f3bee807c0e65\ConnectorTestAutomation\Mfiles.Connectors.TestFramework\Mfiles.Connectors.TestFramework\Tests\ExternalRepoObjectOperations.cs:line 813 
Inner Exception:
 
DEBUG: Test Passed: User with read only user cannot promote the unmanaged object.Access denied. Your license type does not allow this operation.

CoVaultExternalObjectOperations.cpp, 185, Access denied. Your license type does not allow this operation. (0x8004080B)
ServerVaultExternalObjectOperationsHelper.cpp, 51, Access denied. Your license type does not allow this operation. (0x8004080B)
LatestRPC.generated.cpp, 20920, Access denied. Your license type does not allow this operation. (0x8004080B)
RPCDocumentOperations.cpp, 13783, Access denied. Your license type does not allow this operation. (0x8004080B)
RPCDocumentOperations.cpp, 9904, Access denied. Your license type does not allow this operation. (0x8004080B)
SessionManager.cpp, 1242, Access denied. Your license type does not allow this operation. (0x8004080B)
MFSession.cpp, 1060, Access denied. Your license type does not allow this operation. (0x8004080B)
MFSession.cpp, 1091, Access denied. Your license type does not allow this operation. (0x8004080B)
(M-Files 19.1.7261.0)

(0063)
ERROR: System.NullReferenceException: Object reference not set to an instance of an object.
   at Mfiles.Connectors.TestFramework.Tests.ExternalRepoObjectOperations.ExternalRepoObjectOperations_RollbackWithPromotedObject() in D:\BuildAgent\work\d39f3bee807c0e65\ConnectorTestAutomation\Mfiles.Connectors.TestFramework\Mfiles.Connectors.TestFramework\Tests\ExternalRepoObjectOperations.cs:line 403 
Inner Exception:
 
ERROR: System.NullReferenceException: Object reference not set to an instance of an object.
   at Mfiles.Connectors.TestFramework.Tests.ExternalRepoObjectOperations.ExternalRepoObjectOperations_DestroyPromotedObject() in D:\BuildAgent\work\d39f3bee807c0e65\ConnectorTestAutomation\Mfiles.Connectors.TestFramework\Mfiles.Connectors.TestFramework\Tests\ExternalRepoObjectOperations.cs:line 92 
Inner Exception:
 
ERROR: System.NullReferenceException: Object reference not set to an instance of an object.
   at Mfiles.Connectors.TestFramework.Tests.ExternalRepoObjectOperations.ExternalRepoObjectOperations_AddCommentToPromotedObject() in D:\BuildAgent\work\d39f3bee807c0e65\ConnectorTestAutomation\Mfiles.Connectors.TestFramework\Mfiles.Connectors.TestFramework\Tests\ExternalRepoObjectOperations.cs:line 265 
Inner Exception:
 
