\relax 
\providecommand\hyper@newdestlabel[2]{}
\@writefile{toc}{\contentsline {chapter}{\numberline {5}Implementacija i korisničko sučelje}{75}{chapter.5}\protected@file@percent }
\@writefile{lof}{\addvspace {10\p@ }}
\@writefile{lot}{\addvspace {10\p@ }}
\@writefile{toc}{\contentsline {section}{\numberline {5.1}Korištene tehnologije i alati}{75}{section.5.1}\protected@file@percent }
\@writefile{toc}{\contentsline {section}{\numberline {5.2}Ispitivanje programskog rješenja}{77}{section.5.2}\protected@file@percent }
\@writefile{toc}{\contentsline {subsection}{\numberline {5.2.1}Ispitivanje komponenti}{77}{subsection.5.2.1}\protected@file@percent }
\@writefile{toc}{\contentsline {subsubsection}{Ispitni slučaj 1: Registracija korisnika s ispravnim podacima}{77}{subsubsection*.4}\protected@file@percent }
\@writefile{toc}{\contentsline {subsubsection}{Ulaz:}{77}{subsubsection*.5}\protected@file@percent }
\@writefile{toc}{\contentsline {subsubsection}{Očekivani rezultat:}{77}{subsubsection*.6}\protected@file@percent }
\@writefile{toc}{\contentsline {subsubsection}{Rezultat:}{77}{subsubsection*.7}\protected@file@percent }
\@writefile{toc}{\contentsline {subsubsection}{Ispitni slučaj 2: Registracija korisnika s neispravnim podacima}{77}{subsubsection*.8}\protected@file@percent }
\@writefile{toc}{\contentsline {subsubsection}{Ulaz:}{77}{subsubsection*.9}\protected@file@percent }
\@writefile{toc}{\contentsline {subsubsection}{Očekivani rezultat:}{78}{subsubsection*.10}\protected@file@percent }
\@writefile{toc}{\contentsline {subsubsection}{Rezultat:}{78}{subsubsection*.11}\protected@file@percent }
\@writefile{toc}{\contentsline {subsubsection}{Ispitni slučaj 3: Brisanje korisničkog računa koji postoji u bazi}{78}{subsubsection*.12}\protected@file@percent }
\@writefile{toc}{\contentsline {subsubsection}{Ulaz:}{78}{subsubsection*.13}\protected@file@percent }
\@writefile{toc}{\contentsline {subsubsection}{Očekivani rezultat:}{78}{subsubsection*.14}\protected@file@percent }
\@writefile{toc}{\contentsline {subsubsection}{Rezultat:}{78}{subsubsection*.15}\protected@file@percent }
\@writefile{toc}{\contentsline {subsubsection}{Ispitni slučaj 4: Brisanje korisničkog računa koji ne postoji u bazi}{78}{subsubsection*.16}\protected@file@percent }
\@writefile{toc}{\contentsline {subsubsection}{Ulaz:}{78}{subsubsection*.17}\protected@file@percent }
\@writefile{toc}{\contentsline {subsubsection}{Očekivani rezultat:}{78}{subsubsection*.18}\protected@file@percent }
\@writefile{toc}{\contentsline {subsubsection}{Rezultat:}{78}{subsubsection*.19}\protected@file@percent }
\@writefile{toc}{\contentsline {subsubsection}{Ispitni slučaj 5: Registracija romobila s ispravnim podacima}{79}{subsubsection*.20}\protected@file@percent }
\@writefile{toc}{\contentsline {subsubsection}{Ulaz:}{79}{subsubsection*.21}\protected@file@percent }
\@writefile{toc}{\contentsline {subsubsection}{Očekivani rezultat:}{79}{subsubsection*.22}\protected@file@percent }
\@writefile{toc}{\contentsline {subsubsection}{Rezultat:}{79}{subsubsection*.23}\protected@file@percent }
\@writefile{toc}{\contentsline {subsubsection}{Ispitni slučaj 6: Registracija romobila s neispravnim podacima}{79}{subsubsection*.24}\protected@file@percent }
\@writefile{toc}{\contentsline {subsubsection}{Ulaz:}{79}{subsubsection*.25}\protected@file@percent }
\@writefile{toc}{\contentsline {subsubsection}{Očekivani rezultat:}{79}{subsubsection*.26}\protected@file@percent }
\@writefile{toc}{\contentsline {subsubsection}{Rezultat:}{79}{subsubsection*.27}\protected@file@percent }
\@writefile{lof}{\contentsline {figure}{\numberline {5.1}{\ignorespaces Prikaz terminala nakon pokretanja unit testova}}{79}{figure.5.1}\protected@file@percent }
\newlabel{fig:unit}{{5.1}{79}{Prikaz terminala nakon pokretanja unit testova}{figure.5.1}{}}
\@writefile{toc}{\contentsline {section}{\numberline {5.3}Dijagram razmještaja}{80}{section.5.3}\protected@file@percent }
\@writefile{lof}{\contentsline {figure}{\numberline {5.2}{\ignorespaces Dijagram razmještaja}}{80}{figure.5.2}\protected@file@percent }
\newlabel{fig:dijagramRazmjestaja}{{5.2}{80}{Dijagram razmještaja}{figure.5.2}{}}
\@writefile{toc}{\contentsline {section}{\numberline {5.4}Upute za puštanje u pogon}{81}{section.5.4}\protected@file@percent }
\@setckpt{Implementacija}{
\setcounter{page}{82}
\setcounter{equation}{0}
\setcounter{enumi}{1}
\setcounter{enumii}{2}
\setcounter{enumiii}{1}
\setcounter{enumiv}{0}
\setcounter{footnote}{0}
\setcounter{mpfootnote}{0}
\setcounter{part}{0}
\setcounter{chapter}{5}
\setcounter{section}{4}
\setcounter{subsection}{0}
\setcounter{subsubsection}{0}
\setcounter{paragraph}{0}
\setcounter{subparagraph}{0}
\setcounter{figure}{2}
\setcounter{table}{0}
\setcounter{parentequation}{0}
\setcounter{LT@tables}{14}
\setcounter{LT@chunks}{4}
\setcounter{Item}{302}
\setcounter{Hfootnote}{0}
\setcounter{bookmark@seq@number}{21}
\setcounter{float@type}{4}
\setcounter{section@level}{0}
}
