\relax 
\providecommand\hyper@newdestlabel[2]{}
\@writefile{toc}{\contentsline {chapter}{\numberline {2}Opis projektnog zadatka}{7}{chapter.2}\protected@file@percent }
\@writefile{lof}{\addvspace {10\p@ }}
\@writefile{lot}{\addvspace {10\p@ }}
\@writefile{lof}{\contentsline {figure}{\numberline {2.1}{\ignorespaces Prozor s popisom trenutno aktualnih ponuda vozila (lijevo) i detaljan pogled na informacije o ponudi (desno)}}{10}{figure.2.1}\protected@file@percent }
\newlabel{fig:slicnaaplikacija1}{{2.1}{10}{Prozor s popisom trenutno aktualnih ponuda vozila (lijevo) i detaljan pogled na informacije o ponudi (desno)}{figure.2.1}{}}
\@writefile{lof}{\contentsline {figure}{\numberline {2.2}{\ignorespaces Registracija vozila – upis tehničkih specifikacija (lijevo) i odabir fotografija (desno)}}{11}{figure.2.2}\protected@file@percent }
\newlabel{fig:slicnaaplikacija2}{{2.2}{11}{Registracija vozila – upis tehničkih specifikacija (lijevo) i odabir fotografija (desno)}{figure.2.2}{}}
\@writefile{lof}{\contentsline {figure}{\numberline {2.3}{\ignorespaces Prikaz razgovora između klijenta i iznajmljivača – iznajmljivač prihvatio zahtjev klijenta}}{12}{figure.2.3}\protected@file@percent }
\newlabel{fig:slicnaaplikacija3}{{2.3}{12}{Prikaz razgovora između klijenta i iznajmljivača – iznajmljivač prihvatio zahtjev klijenta}{figure.2.3}{}}
\@setckpt{Opis_projektnog_zadatka}{
\setcounter{page}{15}
\setcounter{equation}{0}
\setcounter{enumi}{0}
\setcounter{enumii}{0}
\setcounter{enumiii}{0}
\setcounter{enumiv}{0}
\setcounter{footnote}{0}
\setcounter{mpfootnote}{0}
\setcounter{part}{0}
\setcounter{chapter}{2}
\setcounter{section}{0}
\setcounter{subsection}{0}
\setcounter{subsubsection}{0}
\setcounter{paragraph}{0}
\setcounter{subparagraph}{0}
\setcounter{figure}{3}
\setcounter{table}{0}
\setcounter{parentequation}{0}
\setcounter{LT@tables}{1}
\setcounter{LT@chunks}{4}
\setcounter{Item}{0}
\setcounter{Hfootnote}{0}
\setcounter{bookmark@seq@number}{2}
\setcounter{float@type}{4}
\setcounter{section@level}{0}
}
