\relax 
\providecommand\hyper@newdestlabel[2]{}
\bbl@beforestart
\providecommand\HyperFirstAtBeginDocument{\AtBeginDocument}
\HyperFirstAtBeginDocument{\ifx\hyper@anchor\@undefined
\global\let\oldcontentsline\contentsline
\gdef\contentsline#1#2#3#4{\oldcontentsline{#1}{#2}{#3}}
\global\let\oldnewlabel\newlabel
\gdef\newlabel#1#2{\newlabelxx{#1}#2}
\gdef\newlabelxx#1#2#3#4#5#6{\oldnewlabel{#1}{{#2}{#3}}}
\AtEndDocument{\ifx\hyper@anchor\@undefined
\let\contentsline\oldcontentsline
\let\newlabel\oldnewlabel
\fi}
\fi}
\global\let\hyper@last\relax 
\gdef\HyperFirstAtBeginDocument#1{#1}
\providecommand\HyField@AuxAddToFields[1]{}
\providecommand\HyField@AuxAddToCoFields[2]{}
\providecommand \oddpage@label [2]{}
\babel@aux{croatian}{}
\@input{Dnevnik_promjena_dokumentacije.aux}
\@input{Opis_projektnog_zadatka.aux}
\@input{Specifikacija_programske_potpore.aux}
\@input{Arhitektura.aux}
\@input{Implementacija.aux}
\@input{Zakljucak.aux}
\@input{Literatura.aux}
\@writefile{toc}{\contentsline {chapter}{Indeks slika i dijagrama}{66}{chapter*.5}\protected@file@percent }
\@input{Dodatak.aux}
\newlabel{LastPage}{{}{70}{}{page.70}{}}
\xdef\lastpage@lastpage{70}
\xdef\lastpage@lastpageHy{70}
