stan1;Ana;Anic;1;-1;301.25833333177786
stan2;Biba;Bibiđ;2;1;-199.4833314444445
stan3;Didi;Didić;3;2;-714.4450000018484
stan4;Ele;Eliš;4;0;-1875.4999999998786
stan5;Tomi;Tomič;6;3;633.3333333333335
stan6;Riba;Ribiž;2;5;-724.1973333331985
