stan1;Ana;Anic;1;-1;267.833333335;2015-12-28 20:37:31
stan2;Biba;Bibiđ;2;1;5244.66666665;2015-12-28 20:37:31
stan3;Didi;Didić;3;2;-877.545454546;2015-12-28 20:37:31
stan4;Ele;Eliš;4;0;266.867333335;2015-12-28 20:37:31
stan5;Tomi;Tomič;6;3;998894.269091;2015-12-28 20:37:31
stan6;Riba;Ribiž;2;5;-335.156969698;2015-12-28 20:37:31
stan1;Ana;Anic;1;-1;267.166666668;2015-12-28 20:37:31
stan2;Biba;Bibiđ;2;1;5243.33333332;2015-12-28 20:37:31
stan3;Didi;Didić;3;2;-879.545454546;2015-12-28 20:37:31
stan4;Ele;Eliš;4;0;264.200666668;2015-12-28 20:37:31
stan5;Tomi;Tomič;6;3;998890.269091;2015-12-28 20:37:31
stan6;Riba;Ribiž;2;5;-336.490303031;2015-12-28 20:37:31
stan1;Ana;Anic;1;-1;267.166666668;2015-12-28 20:37:35
stan2;Biba;Bibiđ;2;1;5243.33333332;2015-12-28 20:37:35
stan3;Didi;Didić;3;2;-879.545454546;2015-12-28 20:37:35
stan4;Ele;Eliš;4;0;264.200666668;2015-12-28 20:37:35
stan5;Tomi;Tomič;6;3;998890.269091;2015-12-28 20:37:35
stan6;Riba;Ribiž;2;5;-336.490303031;2015-12-28 20:37:35
stan1;Ana;Anic;1;-1;267.166666668;2015-12-28 20:37:35
stan2;Biba;Bibiđ;2;1;5243.33333332;2015-12-28 20:37:35
stan3;Didi;Didić;3;2;-888.272727273;2015-12-28 20:37:35
stan4;Ele;Eliš;4;0;264.200666668;2015-12-28 20:37:35
stan5;Tomi;Tomič;6;3;998872.814546;2015-12-28 20:37:35
stan6;Riba;Ribiž;2;5;-342.308484849;2015-12-28 20:37:35
stan1;Ana;Anic;1;-1;267.166666668;2015-12-28 20:56:08
stan2;Biba;Bibiđ;2;1;5243.33333332;2015-12-28 20:56:08
stan3;Didi;Didić;3;2;-888.272727273;2015-12-28 20:56:08
stan4;Ele;Eliš;4;0;264.200666668;2015-12-28 20:56:08
stan5;Tomi;Tomič;6;3;998872.814546;2015-12-28 20:56:08
stan6;Riba;Ribiž;2;5;-342.308484849;2015-12-28 20:56:08
stan1;Ana;Anic;1;-1;259.833333335;2015-12-28 20:56:08
stan2;Biba;Bibiđ;2;1;5228.66666665;2015-12-28 20:56:08
stan3;Didi;Didić;3;2;-910.272727273;2015-12-28 20:56:08
stan4;Ele;Eliš;4;0;234.867333335;2015-12-28 20:56:08
stan5;Tomi;Tomič;6;3;998828.814546;2015-12-28 20:56:08
stan6;Riba;Ribiž;2;5;-356.975151516;2015-12-28 20:56:08
stan1;Ana;Anic;1;-1;259.833333335;2015-12-28 20:56:13
stan2;Biba;Bibiđ;2;1;5228.66666665;2015-12-28 20:56:13
stan3;Didi;Didić;3;2;-910.272727273;2015-12-28 20:56:13
stan4;Ele;Eliš;4;0;234.867333335;2015-12-28 20:56:13
stan5;Tomi;Tomič;6;3;998828.814546;2015-12-28 20:56:13
stan6;Riba;Ribiž;2;5;-356.975151516;2015-12-28 20:56:13
stan1;Ana;Anic;1;-1;259.833333335;2015-12-28 20:56:13
stan2;Biba;Bibiđ;2;1;5228.66666665;2015-12-28 20:56:13
stan3;Didi;Didić;3;2;-28264.2727273;2015-12-28 20:56:13
stan4;Ele;Eliš;4;0;234.867333335;2015-12-28 20:56:13
stan5;Tomi;Tomič;6;3;944120.814546;2015-12-28 20:56:13
stan6;Riba;Ribiž;2;5;-18592.9751515;2015-12-28 20:56:13
stan1;Ana;Anic;1;-1;259.833333335;2015-12-28 20:56:31
stan2;Biba;Bibiđ;2;1;5228.66666665;2015-12-28 20:56:31
stan3;Didi;Didić;3;2;-28264.2727273;2015-12-28 20:56:31
stan4;Ele;Eliš;4;0;234.867333335;2015-12-28 20:56:31
stan5;Tomi;Tomič;6;3;944120.814546;2015-12-28 20:56:31
stan6;Riba;Ribiž;2;5;-18592.9751515;2015-12-28 20:56:31
stan1;Ana;Anic;1;-1;-7.71818438515e+12;2015-12-28 20:56:31
stan2;Biba;Bibiđ;2;1;-1.54363687656e+13;2015-12-28 20:56:31
stan3;Didi;Didić;3;2;-2.31545531845e+13;2015-12-28 20:56:31
stan4;Ele;Eliš;4;0;-3.08727375414e+13;2015-12-28 20:56:31
stan5;Tomi;Tomič;6;3;-4.63091053683e+13;2015-12-28 20:56:31
stan6;Riba;Ribiž;2;5;-1.54363687894e+13;2015-12-28 20:56:31
stan1;Ana;Anic;1;-1;-7.71818438515e+12;2015-12-28 20:56:56
stan2;Biba;Bibiđ;2;1;-1.54363687656e+13;2015-12-28 20:56:56
stan3;Didi;Didić;3;2;-2.31545531845e+13;2015-12-28 20:56:56
stan4;Ele;Eliš;4;0;-3.08727375414e+13;2015-12-28 20:56:56
stan5;Tomi;Tomič;6;3;-4.63091053683e+13;2015-12-28 20:56:56
stan6;Riba;Ribiž;2;5;-1.54363687894e+13;2015-12-28 20:56:56
stan1;Ana;Anic;1;-1;-7.71818438515e+12;2015-12-28 20:56:56
stan2;Biba;Bibiđ;2;1;-1.54363687656e+13;2015-12-28 20:56:56
stan3;Didi;Didić;3;2;-2.31545531845e+13;2015-12-28 20:56:56
stan4;Ele;Eliš;4;0;-3.08727375414e+13;2015-12-28 20:56:56
stan5;Tomi;Tomič;6;3;-4.63091053683e+13;2015-12-28 20:56:56
stan6;Riba;Ribiž;2;5;-1.54363687894e+13;2015-12-28 20:56:56
stan1;Ana;Anic;1;-1;123.0;2015-12-28 21:01:04
stan2;Biba;Bibiđ;2;1;432424.0;2015-12-28 21:01:04
stan3;Didi;Didić;3;2;324.0;2015-12-28 21:01:04
stan4;Ele;Eliš;4;0;0.0;2015-12-28 21:01:04
stan5;Tomi;Tomič;6;3;-434.0;2015-12-28 21:01:04
stan6;Riba;Ribiž;2;5;-12.0;2015-12-28 21:01:04
stan1;Ana;Anic;1;-1;123.0;2015-12-28 21:01:04
stan2;Biba;Bibiđ;2;1;432424.0;2015-12-28 21:01:04
stan3;Didi;Didić;3;2;320.727272727;2015-12-28 21:01:04
stan4;Ele;Eliš;4;0;0.0;2015-12-28 21:01:04
stan5;Tomi;Tomič;6;3;-440.545454545;2015-12-28 21:01:04
stan6;Riba;Ribiž;2;5;-14.1818181818;2015-12-28 21:01:04
stan1;Ana;Anic;1;-1;123.0;2015-12-28 21:01:17
stan2;Biba;Bibiđ;2;1;432424.0;2015-12-28 21:01:17
stan3;Didi;Didić;3;2;320.727272727;2015-12-28 21:01:17
stan4;Ele;Eliš;4;0;0.0;2015-12-28 21:01:17
stan5;Tomi;Tomič;6;3;-440.545454545;2015-12-28 21:01:17
stan6;Riba;Ribiž;2;5;-14.1818181818;2015-12-28 21:01:17
stan1;Ana;Anic;1;-1;122.333333333;2015-12-28 21:01:17
stan2;Biba;Bibiđ;2;1;432422.666667;2015-12-28 21:01:17
stan3;Didi;Didić;3;2;318.727272727;2015-12-28 21:01:17
stan4;Ele;Eliš;4;0;-2.66666666667;2015-12-28 21:01:17
stan5;Tomi;Tomič;6;3;-444.545454545;2015-12-28 21:01:17
stan6;Riba;Ribiž;2;5;-15.5151515151;2015-12-28 21:01:17
stan1;Ana;Anic;1;-1;122.333333333;2015-12-28 21:01:39
stan2;Biba;Bibiđ;2;1;432422.666667;2015-12-28 21:01:39
stan3;Didi;Didić;3;2;318.727272727;2015-12-28 21:01:39
stan4;Ele;Eliš;4;0;-2.66666666667;2015-12-28 21:01:39
stan5;Tomi;Tomič;6;3;-444.545454545;2015-12-28 21:01:39
stan6;Riba;Ribiž;2;5;-15.5151515151;2015-12-28 21:01:39
stan1;Ana;Anic;1;-1;121.666666666;2015-12-28 21:01:39
stan2;Biba;Bibiđ;2;1;432421.333334;2015-12-28 21:01:39
stan3;Didi;Didić;3;2;316.727272727;2015-12-28 21:01:39
stan4;Ele;Eliš;4;0;-5.33333333334;2015-12-28 21:01:39
stan5;Tomi;Tomič;6;3;-448.545454545;2015-12-28 21:01:39
stan6;Riba;Ribiž;2;5;-16.8484848484;2015-12-28 21:01:39
stan1;Ana;Anic;1;-1;121.666666666;2015-12-28 21:02:31
stan2;Biba;Bibiđ;2;1;432421.333334;2015-12-28 21:02:31
stan3;Didi;Didić;3;2;316.727272727;2015-12-28 21:02:31
stan4;Ele;Eliš;4;0;-5.33333333334;2015-12-28 21:02:31
stan5;Tomi;Tomič;6;3;-448.545454545;2015-12-28 21:02:31
stan6;Riba;Ribiž;2;5;-16.8484848484;2015-12-28 21:02:31
stan1;Ana;Anic;1;-1;120.999999999;2015-12-28 21:02:31
stan2;Biba;Bibiđ;2;1;432420.000001;2015-12-28 21:02:31
stan3;Didi;Didić;3;2;314.727272727;2015-12-28 21:02:31
stan4;Ele;Eliš;4;0;-8.00000000001;2015-12-28 21:02:31
stan5;Tomi;Tomič;6;3;-452.545454545;2015-12-28 21:02:31
stan6;Riba;Ribiž;2;5;-18.1818181817;2015-12-28 21:02:31
stan1;Ana;Anic;1;-1;120.999999999;2015-12-28 21:02:59
stan2;Biba;Bibiđ;2;1;432420.000001;2015-12-28 21:02:59
stan3;Didi;Didić;3;2;314.727272727;2015-12-28 21:02:59
stan4;Ele;Eliš;4;0;-8.00000000001;2015-12-28 21:02:59
stan5;Tomi;Tomič;6;3;-452.545454545;2015-12-28 21:02:59
stan6;Riba;Ribiž;2;5;-18.1818181817;2015-12-28 21:02:59
stan1;Ana;Anic;1;-1;120.333333332;2015-12-28 21:02:59
stan2;Biba;Bibiđ;2;1;432418.666668;2015-12-28 21:02:59
stan3;Didi;Didić;3;2;312.727272727;2015-12-28 21:02:59
stan4;Ele;Eliš;4;0;-10.6666666667;2015-12-28 21:02:59
stan5;Tomi;Tomič;6;3;-456.545454545;2015-12-28 21:02:59
stan6;Riba;Ribiž;2;5;-19.515151515;2015-12-28 21:02:59
stan1;Ana;Anic;1;-1;120.333333332;2015-12-28 21:03:06
stan2;Biba;Bibiđ;2;1;432418.666668;2015-12-28 21:03:06
stan3;Didi;Didić;3;2;312.727272727;2015-12-28 21:03:06
stan4;Ele;Eliš;4;0;-10.6666666667;2015-12-28 21:03:06
stan5;Tomi;Tomič;6;3;-456.545454545;2015-12-28 21:03:06
stan6;Riba;Ribiž;2;5;-19.515151515;2015-12-28 21:03:06
stan1;Ana;Anic;1;-1;119.666666665;2015-12-28 21:03:06
stan2;Biba;Bibiđ;2;1;432417.333335;2015-12-28 21:03:06
stan3;Didi;Didić;3;2;310.727272727;2015-12-28 21:03:06
stan4;Ele;Eliš;4;0;-13.3333333334;2015-12-28 21:03:06
stan5;Tomi;Tomič;6;3;-460.545454545;2015-12-28 21:03:06
stan6;Riba;Ribiž;2;5;-20.8484848483;2015-12-28 21:03:06
stan1;Ana;Anic;1;-1;119.666666665;2015-12-28 21:03:09
stan2;Biba;Bibiđ;2;1;432417.333335;2015-12-28 21:03:09
stan3;Didi;Didić;3;2;310.727272727;2015-12-28 21:03:09
stan4;Ele;Eliš;4;0;-13.3333333334;2015-12-28 21:03:09
stan5;Tomi;Tomič;6;3;-460.545454545;2015-12-28 21:03:09
stan6;Riba;Ribiž;2;5;-20.8484848483;2015-12-28 21:03:09
stan1;Ana;Anic;1;-1;119.666666665;2015-12-28 21:03:09
stan2;Biba;Bibiđ;2;1;432417.333335;2015-12-28 21:03:09
stan3;Didi;Didić;3;2;302.0;2015-12-28 21:03:09
stan4;Ele;Eliš;4;0;-13.3333333334;2015-12-28 21:03:09
stan5;Tomi;Tomič;6;3;-478.0;2015-12-28 21:03:09
stan6;Riba;Ribiž;2;5;-26.6666666665;2015-12-28 21:03:09
stan1;Ana;Anic;1;-1;119.666666665;2015-12-28 21:21:31
stan2;Biba;Bibiđ;2;1;432417.333335;2015-12-28 21:21:31
stan3;Didi;Didić;3;2;302.0;2015-12-28 21:21:31
stan4;Ele;Eliš;4;0;-13.3333333334;2015-12-28 21:21:31
stan5;Tomi;Tomič;6;3;-478.0;2015-12-28 21:21:31
stan6;Riba;Ribiž;2;5;-26.6666666665;2015-12-28 21:21:31
stan1;Ana;Anic;1;-1;112.709444443;2015-12-28 21:21:31
stan2;Biba;Bibiđ;2;1;432403.418891;2015-12-28 21:21:31
stan3;Didi;Didić;3;2;281.128333333;2015-12-28 21:21:31
stan4;Ele;Eliš;4;0;-41.1622222223;2015-12-28 21:21:31
stan5;Tomi;Tomič;6;3;-519.743333333;2015-12-28 21:21:31
stan6;Riba;Ribiž;2;5;-40.5811111109;2015-12-28 21:21:31
stan1;Ana;Anic;1;-1;112.709444443;2015-12-28 21:22:00
stan2;Biba;Bibiđ;2;1;432403.418891;2015-12-28 21:22:00
stan3;Didi;Didić;3;2;281.128333333;2015-12-28 21:22:00
stan4;Ele;Eliš;4;0;-41.1622222223;2015-12-28 21:22:00
stan5;Tomi;Tomič;6;3;-519.743333333;2015-12-28 21:22:00
stan6;Riba;Ribiž;2;5;-40.5811111109;2015-12-28 21:22:00
stan1;Ana;Anic;1;-1;112.709444443;2015-12-28 21:22:00
stan2;Biba;Bibiđ;2;1;432403.418891;2015-12-28 21:22:00
stan3;Didi;Didić;3;2;277.773787878;2015-12-28 21:22:00
stan4;Ele;Eliš;4;0;-41.1622222223;2015-12-28 21:22:00
stan5;Tomi;Tomič;6;3;-526.452424242;2015-12-28 21:22:00
stan6;Riba;Ribiž;2;5;-42.8174747473;2015-12-28 21:22:00
stan1;Ana;Anic;1;-1;112.709444443;2015-12-28 21:25:02
stan2;Biba;Bibiđ;2;1;432403.418891;2015-12-28 21:25:02
stan3;Didi;Didić;3;2;277.773787878;2015-12-28 21:25:02
stan4;Ele;Eliš;4;0;-41.1622222223;2015-12-28 21:25:02
stan5;Tomi;Tomič;6;3;-526.452424242;2015-12-28 21:25:02
stan6;Riba;Ribiž;2;5;-42.8174747473;2015-12-28 21:25:02
stan1;Ana;Anic;1;-1;112.709444443;2015-12-28 21:25:02
stan2;Biba;Bibiđ;2;1;432403.418891;2015-12-28 21:25:02
stan3;Didi;Didić;3;2;274.419242423;2015-12-28 21:25:02
stan4;Ele;Eliš;4;0;-41.1622222223;2015-12-28 21:25:02
stan5;Tomi;Tomič;6;3;-533.161515151;2015-12-28 21:25:02
stan6;Riba;Ribiž;2;5;-45.0538383837;2015-12-28 21:25:02
stan1;Ana;Anic;1;-1;112.709444443;2015-12-28 21:26:32
stan2;Biba;Bibiđ;2;1;432403.418891;2015-12-28 21:26:32
stan3;Didi;Didić;3;2;274.419242423;2015-12-28 21:26:32
stan4;Ele;Eliš;4;0;-41.1622222223;2015-12-28 21:26:32
stan5;Tomi;Tomič;6;3;-533.161515151;2015-12-28 21:26:32
stan6;Riba;Ribiž;2;5;-45.0538383837;2015-12-28 21:26:32
stan1;Ana;Anic;1;-1;112.709444443;2015-12-28 21:26:32
stan2;Biba;Bibiđ;2;1;432403.418891;2015-12-28 21:26:32
stan3;Didi;Didić;3;2;240.78651515;2015-12-28 21:26:32
stan4;Ele;Eliš;4;0;-41.1622222223;2015-12-28 21:26:32
stan5;Tomi;Tomič;6;3;-600.426969696;2015-12-28 21:26:32
stan6;Riba;Ribiž;2;5;-67.4756565655;2015-12-28 21:26:32
stan1;Ana;Anic;1;-1;112.709444443;2015-12-29 11:42:59
stan2;Biba;Bibiđ;2;1;432403.418891;2015-12-29 11:42:59
stan3;Didi;Didić;3;2;240.78651515;2015-12-29 11:42:59
stan4;Ele;Eliš;4;0;-41.1622222223;2015-12-29 11:42:59
stan5;Tomi;Tomič;6;3;-600.426969696;2015-12-29 11:42:59
stan6;Riba;Ribiž;2;5;-67.4756565655;2015-12-29 11:42:59
stan1;Ana;Anic;1;-1;112.580555554;2015-12-29 11:42:59
stan2;Biba;Bibiđ;2;1;432403.161113;2015-12-29 11:42:59
stan3;Didi;Didić;3;2;240.399848483;2015-12-29 11:42:59
stan4;Ele;Eliš;4;0;-41.6777777779;2015-12-29 11:42:59
stan5;Tomi;Tomič;6;3;-601.200303029;2015-12-29 11:42:59
stan6;Riba;Ribiž;2;5;-67.7334343433;2015-12-29 11:42:59
stan1;Ana;Anic;1;-1;112.580555554;2015-12-29 11:43:08
stan2;Biba;Bibiđ;2;1;432403.161113;2015-12-29 11:43:08
stan3;Didi;Didić;3;2;240.399848483;2015-12-29 11:43:08
stan4;Ele;Eliš;4;0;-41.6777777779;2015-12-29 11:43:08
stan5;Tomi;Tomič;6;3;-601.200303029;2015-12-29 11:43:08
stan6;Riba;Ribiž;2;5;-67.7334343433;2015-12-29 11:43:08
stan1;Ana;Anic;1;-1;112.580555554;2015-12-29 11:43:08
stan2;Biba;Bibiđ;2;1;432403.161113;2015-12-29 11:43:08
stan3;Didi;Didić;3;2;236.799848483;2015-12-29 11:43:08
stan4;Ele;Eliš;4;0;-41.6777777779;2015-12-29 11:43:08
stan5;Tomi;Tomič;6;3;-608.400303029;2015-12-29 11:43:08
stan6;Riba;Ribiž;2;5;-70.1334343433;2015-12-29 11:43:08
stan1;Ana;Anic;1;-1;112.580555554;2015-12-29 16:09:06
stan2;Biba;Bibiđ;2;1;432403.161113;2015-12-29 16:09:06
stan3;Didi;Didić;3;2;236.799848483;2015-12-29 16:09:06
stan4;Ele;Eliš;4;0;998.3222222221;2015-12-29 16:09:06
stan5;Tomi;Tomič;6;3;-608.400303029;2015-12-29 16:09:06
stan6;Riba;Ribiž;2;5;-70.1334343433;2015-12-29 16:09:06
stan1;Ana;Anic;1;-1;112.580555554;2015-12-29 16:09:09
stan2;Biba;Bibiđ;2;1;432403.161113;2015-12-29 16:09:09
stan3;Didi;Didić;3;2;236.799848483;2015-12-29 16:09:09
stan4;Ele;Eliš;4;0;1998.3222222221;2015-12-29 16:09:09
stan5;Tomi;Tomič;6;3;-608.400303029;2015-12-29 16:09:09
stan6;Riba;Ribiž;2;5;-70.1334343433;2015-12-29 16:09:09
stan1;Ana;Anic;1;-1;112.580555554;2015-12-29 16:28:16
stan2;Biba;Bibiđ;2;1;43.161113;2015-12-29 16:28:16
stan3;Didi;Didić;3;2;236.799848483;2015-12-29 16:28:16
stan4;Ele;Eliš;4;0;1.3222222221;2015-12-29 16:28:16
stan5;Tomi;Tomič;6;3;-60.400303029;2015-12-29 16:28:16
stan6;Riba;Ribiž;2;5;-70.1334343433;2015-12-29 16:28:16
stan1;Ana;Anic;1;-1;106.340555554;2015-12-29 16:28:16
stan2;Biba;Bibiđ;2;1;30.681113000000003;2015-12-29 16:28:16
stan3;Didi;Didić;3;2;218.079848483;2015-12-29 16:28:16
stan4;Ele;Eliš;4;0;-23.6377777779;2015-12-29 16:28:16
stan5;Tomi;Tomič;6;3;-97.840303029;2015-12-29 16:28:16
stan6;Riba;Ribiž;2;5;-82.6134343433;2015-12-29 16:28:16
stan1;Ana;Anic;1;-1;112.580555554;2015-12-29 16:30:28
stan2;Biba;Bibiđ;2;1;43.161113;2015-12-29 16:30:28
stan3;Didi;Didić;3;2;236.799848483;2015-12-29 16:30:28
stan4;Ele;Eliš;4;0;1.3222222221;2015-12-29 16:30:28
stan5;Tomi;Tomič;6;3;-60.400303029;2015-12-29 16:30:28
stan6;Riba;Ribiž;2;5;-70.1334343433;2015-12-29 16:30:28
stan1;Ana;Anic;1;-1;112.580555554;2015-12-29 16:30:31
stan2;Biba;Bibiđ;2;1;43.161113;2015-12-29 16:30:31
stan3;Didi;Didić;3;2;236.799848483;2015-12-29 16:30:31
stan4;Ele;Eliš;4;0;1.3222222221;2015-12-29 16:30:31
stan5;Tomi;Tomič;6;3;0.5996969710000002;2015-12-29 16:30:31
stan6;Riba;Ribiž;2;5;-70.1334343433;2015-12-29 16:30:31
stan1;Ana;Anic;1;-1;112.580555554;2015-12-29 16:31:11
stan2;Biba;Bibiđ;2;1;43.161113;2015-12-29 16:31:11
stan3;Didi;Didić;3;2;236.799848483;2015-12-29 16:31:11
stan4;Ele;Eliš;4;0;1.3222222221;2015-12-29 16:31:11
stan5;Tomi;Tomič;6;3;0.5996969710000002;2015-12-29 16:31:11
stan6;Riba;Ribiž;2;5;-70.1334343433;2015-12-29 16:31:11
stan1;Ana;Anic;1;-1;57.02499999844444;2015-12-29 16:31:11
stan2;Biba;Bibiđ;2;1;-67.94999811111111;2015-12-29 16:31:11
stan3;Didi;Didić;3;2;70.13318181633332;2015-12-29 16:31:11
stan4;Ele;Eliš;4;0;-220.90000000012222;2015-12-29 16:31:11
stan5;Tomi;Tomič;6;3;-332.73363636233336;2015-12-29 16:31:11
stan6;Riba;Ribiž;2;5;-181.2445454544111;2015-12-29 16:31:11
stan1;Ana;Anic;1;-1;57.02499999844444;2015-12-29 16:47:10
stan2;Biba;Bibiđ;2;1;-67.94999811111111;2015-12-29 16:47:10
stan3;Didi;Didić;3;2;70.13318181633332;2015-12-29 16:47:10
stan4;Ele;Eliš;4;0;-220.90000000012222;2015-12-29 16:47:10
stan5;Tomi;Tomič;6;3;-332.73363636233336;2015-12-29 16:47:10
stan6;Riba;Ribiž;2;5;-181.2445454544111;2015-12-29 16:47:10
stan1;Ana;Anic;1;-1;-498.5305555571111;2015-12-29 16:47:10
stan2;Biba;Bibiđ;2;1;-1179.0611092222223;2015-12-29 16:47:10
stan3;Didi;Didić;3;2;-1596.5334848503333;2015-12-29 16:47:10
stan4;Ele;Eliš;4;0;-2443.1222222223446;2015-12-29 16:47:10
stan5;Tomi;Tomič;6;3;-3666.0669696956666;2015-12-29 16:47:10
stan6;Riba;Ribiž;2;5;-1292.3556565655222;2015-12-29 16:47:10
stan1;Ana;Anic;1;-1;-498.5305555571111;2015-12-29 16:51:20
stan2;Biba;Bibiđ;2;1;-1179.0611092222223;2015-12-29 16:51:20
stan3;Didi;Didić;3;2;-1596.5334848503333;2015-12-29 16:51:20
stan4;Ele;Eliš;4;0;-2443.1222222223446;2015-12-29 16:51:20
stan5;Tomi;Tomič;6;3;-3666.0669696956666;2015-12-29 16:51:20
stan6;Riba;Ribiž;2;5;-1292.3556565655222;2015-12-29 16:51:20
stan1;Ana;Anic;1;-1;-1182.530555557111;2015-12-29 16:51:20
stan2;Biba;Bibiđ;2;1;-2547.0611092222225;2015-12-29 16:51:20
stan3;Didi;Didić;3;2;-3648.5334848503335;2015-12-29 16:51:20
stan4;Ele;Eliš;4;0;-5179.122222222344;2015-12-29 16:51:20
stan5;Tomi;Tomič;6;3;-7770.066969695667;2015-12-29 16:51:20
stan6;Riba;Ribiž;2;5;-2660.355656565522;2015-12-29 16:51:20
stan1;Ana;Anic;1;-1;-1182.530555557111;2015-12-29 16:53:52
stan2;Biba;Bibiđ;2;1;-2547.0611092222225;2015-12-29 16:53:52
stan3;Didi;Didić;3;2;-3648.5334848503335;2015-12-29 16:53:52
stan4;Ele;Eliš;4;0;-5179.122222222344;2015-12-29 16:53:52
stan5;Tomi;Tomič;6;3;-7770.066969695667;2015-12-29 16:53:52
stan6;Riba;Ribiž;2;5;-2660.355656565522;2015-12-29 16:53:52
stan1;Ana;Anic;1;-1;-1189.3638888904443;2015-12-29 16:53:52
stan2;Biba;Bibiđ;2;1;-2560.727775888889;2015-12-29 16:53:52
stan3;Didi;Didić;3;2;-3669.0334848503335;2015-12-29 16:53:52
stan4;Ele;Eliš;4;0;-5206.455555555677;2015-12-29 16:53:52
stan5;Tomi;Tomič;6;3;-7811.066969695667;2015-12-29 16:53:52
stan6;Riba;Ribiž;2;5;-2674.0223232321887;2015-12-29 16:53:52
stan1;Ana;Anic;1;-1;-1189.3638888904443;2015-12-29 16:54:04
stan2;Biba;Bibiđ;2;1;-2560.727775888889;2015-12-29 16:54:04
stan3;Didi;Didić;3;2;-3669.0334848503335;2015-12-29 16:54:04
stan4;Ele;Eliš;4;0;-5206.455555555677;2015-12-29 16:54:04
stan5;Tomi;Tomič;6;3;-7811.066969695667;2015-12-29 16:54:04
stan6;Riba;Ribiž;2;5;-2674.0223232321887;2015-12-29 16:54:04
stan1;Ana;Anic;1;-1;-1189.3638888904443;2015-12-29 16:54:04
stan2;Biba;Bibiđ;2;1;-2560.727775888889;2015-12-29 16:54:04
stan3;Didi;Didić;3;2;-3705.0334848503335;2015-12-29 16:54:04
stan4;Ele;Eliš;4;0;-5206.455555555677;2015-12-29 16:54:04
stan5;Tomi;Tomič;6;3;-7883.066969695667;2015-12-29 16:54:04
stan6;Riba;Ribiž;2;5;-2698.0223232321887;2015-12-29 16:54:04
stan1;Ana;Anic;1;-1;-1189.3638888904443;2015-12-29 16:54:16
stan2;Biba;Bibiđ;2;1;-2560.727775888889;2015-12-29 16:54:16
stan3;Didi;Didić;3;2;-3705.0334848503335;2015-12-29 16:54:16
stan4;Ele;Eliš;4;0;-5206.455555555677;2015-12-29 16:54:16
stan5;Tomi;Tomič;6;3;-7883.066969695667;2015-12-29 16:54:16
stan6;Riba;Ribiž;2;5;-2698.0223232321887;2015-12-29 16:54:16
stan1;Ana;Anic;1;-1;-1189.3638888904443;2015-12-29 16:54:19
stan2;Biba;Bibiđ;2;1;-2560.727775888889;2015-12-29 16:54:19
stan3;Didi;Didić;3;2;-3705.0334848503335;2015-12-29 16:54:19
stan4;Ele;Eliš;4;0;-5206.455555555677;2015-12-29 16:54:19
stan5;Tomi;Tomič;6;3;92116.93303030434;2015-12-29 16:54:19
stan6;Riba;Ribiž;2;5;-2698.0223232321887;2015-12-29 16:54:19
stan1;Ana;Anic;1;-1;89.3638888904443;2015-12-29 16:56:03
stan2;Biba;Bibiđ;2;1;60.727775888889;2015-12-29 16:56:03
stan3;Didi;Didić;3;2;5.0334848503335;2015-12-29 16:56:03
stan4;Ele;Eliš;4;0;6.455555555677;2015-12-29 16:56:03
stan5;Tomi;Tomič;6;3;16.93303030434;2015-12-29 16:56:03
stan6;Riba;Ribiž;2;5;98.0223232321887;2015-12-29 16:56:03
stan1;Ana;Anic;1;-1;-466.19166666511126;2015-12-29 16:56:03
stan2;Biba;Bibiđ;2;1;-1050.383335222222;2015-12-29 16:56:03
stan3;Didi;Didić;3;2;-1661.633181816333;2015-12-29 16:56:03
stan4;Ele;Eliš;4;0;-2215.766666666545;2015-12-29 16:56:03
stan5;Tomi;Tomič;6;3;-3316.400303028993;2015-12-29 16:56:03
stan6;Riba;Ribiž;2;5;-1013.0887878789224;2015-12-29 16:56:03
stan1;Ana;Anic;1;-1;89.3638888904443;2015-12-29 16:57:41
stan2;Biba;Bibiđ;2;1;60.727775888889;2015-12-29 16:57:41
stan3;Didi;Didić;3;2;5.0334848503335;2015-12-29 16:57:41
stan4;Ele;Eliš;4;0;6.455555555677;2015-12-29 16:57:41
stan5;Tomi;Tomič;6;3;16.93303030434;2015-12-29 16:57:41
stan6;Riba;Ribiž;2;5;98.0223232321887;2015-12-29 16:57:41
stan1;Ana;Anic;1;-1;-5466.191666665111;2015-12-29 16:57:41
stan2;Biba;Bibiđ;2;1;-11050.383335222223;2015-12-29 16:57:41
stan3;Didi;Didić;3;2;-16661.633181816334;2015-12-29 16:57:41
stan4;Ele;Eliš;4;0;-22215.766666666546;2015-12-29 16:57:41
stan5;Tomi;Tomič;6;3;-33316.400303029;2015-12-29 16:57:41
stan6;Riba;Ribiž;2;5;-11013.088787878922;2015-12-29 16:57:41
stan1;Ana;Anic;1;-1;89.3638888904443;2015-12-29 16:58:22
stan2;Biba;Bibiđ;2;1;60.727775888889;2015-12-29 16:58:22
stan3;Didi;Didić;3;2;5.0334848503335;2015-12-29 16:58:22
stan4;Ele;Eliš;4;0;6.455555555677;2015-12-29 16:58:22
stan5;Tomi;Tomič;6;3;16.93303030434;2015-12-29 16:58:22
stan6;Riba;Ribiž;2;5;98.0223232321887;2015-12-29 16:58:22
stan1;Ana;Anic;1;-1;83.80833333488874;2015-12-29 16:58:22
stan2;Biba;Bibiđ;2;1;49.616664777777885;2015-12-29 16:58:22
stan3;Didi;Didić;3;2;-11.633181816333163;2015-12-29 16:58:22
stan4;Ele;Eliš;4;0;-15.766666666545222;2015-12-29 16:58:22
stan5;Tomi;Tomič;6;3;-16.400303028993328;2015-12-29 16:58:22
stan6;Riba;Ribiž;2;5;86.91121212107758;2015-12-29 16:58:22
stan1;Ana;Anic;1;-1;89.3638888904443;2015-12-30 10:34:39
stan2;Biba;Bibiđ;2;1;60.727775888889;2015-12-30 10:34:39
stan3;Didi;Didić;3;2;5.0334848503335;2015-12-30 10:34:39
stan4;Ele;Eliš;4;0;6.455555555677;2015-12-30 10:34:39
stan5;Tomi;Tomič;6;3;16.93303030434;2015-12-30 10:34:39
stan6;Riba;Ribiž;2;5;98.0223232321887;2015-12-30 10:34:39
stan1;Ana;Anic;1;-1;88.80833333488874;2015-12-30 10:34:39
stan2;Biba;Bibiđ;2;1;59.616664777777885;2015-12-30 10:34:39
stan3;Didi;Didić;3;2;3.366818183666833;2015-12-30 10:34:39
stan4;Ele;Eliš;4;0;4.233333333454778;2015-12-30 10:34:39
stan5;Tomi;Tomič;6;3;13.599696971006667;2015-12-30 10:34:39
stan6;Riba;Ribiž;2;5;96.91121212107758;2015-12-30 10:34:39
stan1;Ana;Anic;1;-1;88.80833333488874;2015-12-31 10:26:22
stan2;Biba;Bibiđ;2;1;59.616664777777885;2015-12-31 10:26:22
stan3;Didi;Didić;3;2;3.366818183666833;2015-12-31 10:26:22
stan4;Ele;Eliš;4;0;-4.233333333454778;2015-12-31 10:26:22
stan5;Tomi;Tomič;6;3;13.599696971006667;2015-12-31 10:26:22
stan6;Riba;Ribiž;2;5;96.91121212107758;2015-12-31 10:26:22
stan1;Ana;Anic;1;-1;88.80833333488874;2015-12-31 10:26:58
stan2;Biba;Bibiđ;2;1;59.616664777777885;2015-12-31 10:26:58
stan3;Didi;Didić;3;2;3.366818183666833;2015-12-31 10:26:58
stan4;Ele;Eliš;4;0;-4.233333333454778;2015-12-31 10:26:58
stan5;Tomi;Tomič;6;3;13.599696971006667;2015-12-31 10:26:58
stan6;Riba;Ribiž;2;5;96.91121212107758;2015-12-31 10:26:58
stan1;Ana;Anic;1;-1;88.80833333488874;2015-12-31 10:27:23
stan2;Biba;Bibiđ;2;1;59.616664777777885;2015-12-31 10:27:23
stan3;Didi;Didić;3;2;3.366818183666833;2015-12-31 10:27:23
stan4;Ele;Eliš;4;0;-4.233333333454778;2015-12-31 10:27:23
stan5;Tomi;Tomič;6;3;13.599696971006667;2015-12-31 10:27:23
stan6;Riba;Ribiž;2;5;96.91121212107758;2015-12-31 10:27:23
stan1;Ana;Anic;1;-1;88.1238888904443;2015-12-31 10:27:23
stan2;Biba;Bibiđ;2;1;58.247775888888995;2015-12-31 10:27:23
stan3;Didi;Didić;3;2;1.3134848503335;2015-12-31 10:27:23
stan4;Ele;Eliš;4;0;-6.971111111232555;2015-12-31 10:27:23
stan5;Tomi;Tomič;6;3;9.49303030434;2015-12-31 10:27:23
stan6;Riba;Ribiž;2;5;95.54232323218869;2015-12-31 10:27:23
stan1;Ana;Anic;1;-1;88.1238888904443;2015-12-31 10:27:38
stan2;Biba;Bibiđ;2;1;58.247775888888995;2015-12-31 10:27:38
stan3;Didi;Didić;3;2;1.3134848503335;2015-12-31 10:27:38
stan4;Ele;Eliš;4;0;-6.971111111232555;2015-12-31 10:27:38
stan5;Tomi;Tomič;6;3;9.49303030434;2015-12-31 10:27:38
stan6;Riba;Ribiž;2;5;95.54232323218869;2015-12-31 10:27:38
stan1;Ana;Anic;1;-1;69.61166666822209;2015-12-31 10:27:38
stan2;Biba;Bibiđ;2;1;21.223331444444547;2015-12-31 10:27:38
stan3;Didi;Didić;3;2;-54.223181816333174;2015-12-31 10:27:38
stan4;Ele;Eliš;4;0;-81.02000000012146;2015-12-31 10:27:38
stan5;Tomi;Tomič;6;3;-101.58030302899336;2015-12-31 10:27:38
stan6;Riba;Ribiž;2;5;58.517878787744245;2015-12-31 10:27:38
stan1;Ana;Anic;1;-1;69.61166666822209;2015-12-31 10:28:28
stan2;Biba;Bibiđ;2;1;21.223331444444547;2015-12-31 10:28:28
stan3;Didi;Didić;3;2;-54.223181816333174;2015-12-31 10:28:28
stan4;Ele;Eliš;4;0;-81.02000000012146;2015-12-31 10:28:28
stan5;Tomi;Tomič;6;3;-101.58030302899336;2015-12-31 10:28:28
stan6;Riba;Ribiž;2;5;58.517878787744245;2015-12-31 10:28:28
stan1;Ana;Anic;1;-1;69.61166666822209;2015-12-31 10:28:28
stan2;Biba;Bibiđ;2;1;21.223331444444547;2015-12-31 10:28:28
stan3;Didi;Didić;3;2;-145.101363634515;2015-12-31 10:28:28
stan4;Ele;Eliš;4;0;-81.02000000012146;2015-12-31 10:28:28
stan5;Tomi;Tomič;6;3;-283.33666666535703;2015-12-31 10:28:28
stan6;Riba;Ribiž;2;5;-2.0675757577103084;2015-12-31 10:28:28
stan1;Ana;Anic;1;-1;69.61166666822209;2015-12-31 10:29:24
stan2;Biba;Bibiđ;2;1;21.223331444444547;2015-12-31 10:29:24
stan3;Didi;Didić;3;2;-145.101363634515;2015-12-31 10:29:24
stan4;Ele;Eliš;4;0;-81.02000000012146;2015-12-31 10:29:24
stan5;Tomi;Tomič;6;3;-283.33666666535703;2015-12-31 10:29:24
stan6;Riba;Ribiž;2;5;-2.0675757577103084;2015-12-31 10:29:24
stan1;Ana;Anic;1;-1;69.61166666822209;2015-12-31 10:29:24
stan2;Biba;Bibiđ;2;1;21.223331444444547;2015-12-31 10:29:24
stan3;Didi;Didić;3;2;-154.15863636178773;2015-12-31 10:29:24
stan4;Ele;Eliš;4;0;-81.02000000012146;2015-12-31 10:29:24
stan5;Tomi;Tomič;6;3;-301.4512121199025;2015-12-31 10:29:24
stan6;Riba;Ribiž;2;5;-8.105757575892127;2015-12-31 10:29:24
stan1;Ana;Anic;1;-1;69.61166666822209;2015-12-31 10:30:00
stan2;Biba;Bibiđ;2;1;21.223331444444547;2015-12-31 10:30:00
stan3;Didi;Didić;3;2;-154.15863636178773;2015-12-31 10:30:00
stan4;Ele;Eliš;4;0;-81.02000000012146;2015-12-31 10:30:00
stan5;Tomi;Tomič;6;3;-301.4512121199025;2015-12-31 10:30:00
stan6;Riba;Ribiž;2;5;-8.105757575892127;2015-12-31 10:30:00
stan1;Ana;Anic;1;-1;7.205000001555419;2015-12-31 10:30:00
stan2;Biba;Bibiđ;2;1;-103.59000188888879;2015-12-31 10:30:00
stan3;Didi;Didić;3;2;-341.3786363617877;2015-12-31 10:30:00
stan4;Ele;Eliš;4;0;-330.6466666667881;2015-12-31 10:30:00
stan5;Tomi;Tomič;6;3;-675.8912121199025;2015-12-31 10:30:00
stan6;Riba;Ribiž;2;5;-132.91909090922547;2015-12-31 10:30:00
stan1;Ana;Anic;1;-1;7.205000001555419;2015-12-31 10:33:36
stan2;Biba;Bibiđ;2;1;-103.59000188888879;2015-12-31 10:33:36
stan3;Didi;Didić;3;2;-341.3786363617877;2015-12-31 10:33:36
stan4;Ele;Eliš;4;0;-330.6466666667881;2015-12-31 10:33:36
stan5;Tomi;Tomič;6;3;-675.8912121199025;2015-12-31 10:33:36
stan6;Riba;Ribiž;2;5;-132.91909090922547;2015-12-31 10:33:36
stan1;Ana;Anic;1;-1;7.205000001555419;2015-12-31 10:33:40
stan2;Biba;Bibiđ;2;1;-103.59000188888879;2015-12-31 10:33:40
stan3;Didi;Didić;3;2;-341.3786363617877;2015-12-31 10:33:40
stan4;Ele;Eliš;4;0;-330.6466666667881;2015-12-31 10:33:40
stan5;Tomi;Tomič;6;3;24.108787880097452;2015-12-31 10:33:40
stan6;Riba;Ribiž;2;5;-132.91909090922547;2015-12-31 10:33:40
stan1;Ana;Anic;1;-1;7.205000001555419;2015-12-31 10:33:54
stan2;Biba;Bibiđ;2;1;-103.59000188888879;2015-12-31 10:33:54
stan3;Didi;Didić;3;2;-341.3786363617877;2015-12-31 10:33:54
stan4;Ele;Eliš;4;0;-330.6466666667881;2015-12-31 10:33:54
stan5;Tomi;Tomič;6;3;24.108787880097452;2015-12-31 10:33:54
stan6;Riba;Ribiž;2;5;-132.91909090922547;2015-12-31 10:33:54
stan1;Ana;Anic;1;-1;7.205000001555419;2015-12-31 10:33:59
stan2;Biba;Bibiđ;2;1;-103.59000188888879;2015-12-31 10:33:59
stan3;Didi;Didić;3;2;-341.3786363617877;2015-12-31 10:33:59
stan4;Ele;Eliš;4;0;-330.6466666667881;2015-12-31 10:33:59
stan5;Tomi;Tomič;6;3;24.108787880097452;2015-12-31 10:33:59
stan6;Riba;Ribiž;2;5;20.314909090774535;2015-12-31 10:33:59
stan1;Ana;Anic;1;-1;7.205000001555419;2015-12-31 10:37:22
stan2;Biba;Bibiđ;2;1;-103.59000188888879;2015-12-31 10:37:22
stan3;Didi;Didić;3;2;-341.3786363617877;2015-12-31 10:37:22
stan4;Ele;Eliš;4;0;-330.6466666667881;2015-12-31 10:37:22
stan5;Tomi;Tomič;6;3;24.108787880097452;2015-12-31 10:37:22
stan6;Riba;Ribiž;2;5;20.314909090774535;2015-12-31 10:37:22
stan1;Ana;Anic;1;-1;7.205000001555419;2015-12-31 10:37:22
stan2;Biba;Bibiđ;2;1;-103.59000188888879;2015-12-31 10:37:22
stan3;Didi;Didić;3;2;-1192.920454543606;2015-12-31 10:37:22
stan4;Ele;Eliš;4;0;-330.6466666667881;2015-12-31 10:37:22
stan5;Tomi;Tomič;6;3;-1678.974848483539;2015-12-31 10:37:22
stan6;Riba;Ribiž;2;5;-547.3796363637709;2015-12-31 10:37:22
stan1;Ana;Anic;1;-1;7.205000001555419;2015-12-31 10:38:39
stan2;Biba;Bibiđ;2;1;-103.59000188888879;2015-12-31 10:38:39
stan3;Didi;Didić;3;2;-1192.920454543606;2015-12-31 10:38:39
stan4;Ele;Eliš;4;0;-330.6466666667881;2015-12-31 10:38:39
stan5;Tomi;Tomič;6;3;-1678.974848483539;2015-12-31 10:38:39
stan6;Riba;Ribiž;2;5;-547.3796363637709;2015-12-31 10:38:39
stan1;Ana;Anic;1;-1;0.3594444459998636;2015-12-31 10:38:39
stan2;Biba;Bibiđ;2;1;-117.2811129999999;2015-12-31 10:38:39
stan3;Didi;Didić;3;2;-1213.4571212102726;2015-12-31 10:38:39
stan4;Ele;Eliš;4;0;-358.0288888890103;2015-12-31 10:38:39
stan5;Tomi;Tomič;6;3;-1720.0481818168723;2015-12-31 10:38:39
stan6;Riba;Ribiž;2;5;-561.0707474748821;2015-12-31 10:38:39
stan1;Ana;Anic;1;-1;0.3594444459998636;2015-12-31 10:40:32
stan2;Biba;Bibiđ;2;1;-117.2811129999999;2015-12-31 10:40:32
stan3;Didi;Didić;3;2;-1213.4571212102726;2015-12-31 10:40:32
stan4;Ele;Eliš;4;0;-358.0288888890103;2015-12-31 10:40:32
stan5;Tomi;Tomič;6;3;-1720.0481818168723;2015-12-31 10:40:32
stan6;Riba;Ribiž;2;5;-561.0707474748821;2015-12-31 10:40:32
stan1;Ana;Anic;1;-1;-6.486111109555692;2015-12-31 10:40:33
stan2;Biba;Bibiđ;2;1;-130.97222411111102;2015-12-31 10:40:33
stan3;Didi;Didić;3;2;-1233.9937878769392;2015-12-31 10:40:33
stan4;Ele;Eliš;4;0;-385.4111111112325;2015-12-31 10:40:33
stan5;Tomi;Tomič;6;3;-1761.1215151502056;2015-12-31 10:40:33
stan6;Riba;Ribiž;2;5;-574.7618585859932;2015-12-31 10:40:33
stan1;Ana;Anic;1;-1;0.3594444459998636;2015-12-31 10:44:00
stan2;Biba;Bibiđ;2;1;-117.2811129999999;2015-12-31 10:44:00
stan3;Didi;Didić;3;2;-1213.4571212102726;2015-12-31 10:44:00
stan4;Ele;Eliš;4;0;-358.0288888890103;2015-12-31 10:44:00
stan5;Tomi;Tomič;6;3;-1720.0481818168723;2015-12-31 10:44:00
stan6;Riba;Ribiž;2;5;-561.0707474748821;2015-12-31 10:44:00
stan1;Ana;Anic;1;-1;0.3594444459998636;2015-12-31 10:44:00
stan2;Biba;Bibiđ;2;1;-117.2811129999999;2015-12-31 10:44:00
stan3;Didi;Didić;3;2;-1571.3325757557272;2015-12-31 10:44:00
stan4;Ele;Eliš;4;0;-358.0288888890103;2015-12-31 10:44:00
stan5;Tomi;Tomič;6;3;-2435.7990909077816;2015-12-31 10:44:00
stan6;Riba;Ribiž;2;5;-799.6543838385185;2015-12-31 10:44:00
stan1;Ana;Anic;1;-1;0.3594444459998636;2015-12-31 10:44:55
stan2;Biba;Bibiđ;2;1;-117.2811129999999;2015-12-31 10:44:55
stan3;Didi;Didić;3;2;-1213.4571212102726;2015-12-31 10:44:55
stan4;Ele;Eliš;4;0;-358.0288888890103;2015-12-31 10:44:55
stan5;Tomi;Tomič;6;3;-1720.0481818168723;2015-12-31 10:44:55
stan6;Riba;Ribiž;2;5;-561.0707474748821;2015-12-31 10:44:55
stan1;Ana;Anic;1;-1;-6.480555554000136;2015-12-31 10:44:55
stan2;Biba;Bibiđ;2;1;-130.9611129999999;2015-12-31 10:44:55
stan3;Didi;Didić;3;2;-1233.9771212102726;2015-12-31 10:44:55
stan4;Ele;Eliš;4;0;-385.38888888901033;2015-12-31 10:44:55
stan5;Tomi;Tomič;6;3;-1761.0881818168723;2015-12-31 10:44:55
stan6;Riba;Ribiž;2;5;-574.750747474882;2015-12-31 10:44:55
stan1;Ana;Anic;1;-1;-6.480555554000136;2015-12-31 10:45:08
stan2;Biba;Bibiđ;2;1;-130.9611129999999;2015-12-31 10:45:08
stan3;Didi;Didić;3;2;-1233.9771212102726;2015-12-31 10:45:08
stan4;Ele;Eliš;4;0;-385.38888888901033;2015-12-31 10:45:08
stan5;Tomi;Tomič;6;3;-1761.0881818168723;2015-12-31 10:45:08
stan6;Riba;Ribiž;2;5;-574.750747474882;2015-12-31 10:45:08
stan1;Ana;Anic;1;-1;-6.480555554000136;2015-12-31 10:45:08
stan2;Biba;Bibiđ;2;1;-130.9611129999999;2015-12-31 10:45:08
stan3;Didi;Didić;3;2;-1240.312575755727;2015-12-31 10:45:08
stan4;Ele;Eliš;4;0;-385.38888888901033;2015-12-31 10:45:08
stan5;Tomi;Tomič;6;3;-1773.7590909077815;2015-12-31 10:45:08
stan6;Riba;Ribiž;2;5;-578.9743838385184;2015-12-31 10:45:08
stan1;Ana;Anic;1;-1;-6.480555554000136;2015-12-31 10:45:50
stan2;Biba;Bibiđ;2;1;-130.9611129999999;2015-12-31 10:45:50
stan3;Didi;Didić;3;2;-1240.312575755727;2015-12-31 10:45:50
stan4;Ele;Eliš;4;0;-385.38888888901033;2015-12-31 10:45:50
stan5;Tomi;Tomič;6;3;-1773.7590909077815;2015-12-31 10:45:50
stan6;Riba;Ribiž;2;5;-578.9743838385184;2015-12-31 10:45:50
stan1;Ana;Anic;1;-1;3.5194444459998637;2015-12-31 10:45:51
stan2;Biba;Bibiđ;2;1;-130.9611129999999;2015-12-31 10:45:51
stan3;Didi;Didić;3;2;-1240.312575755727;2015-12-31 10:45:51
stan4;Ele;Eliš;4;0;-385.38888888901033;2015-12-31 10:45:51
stan5;Tomi;Tomič;6;3;-1773.7590909077815;2015-12-31 10:45:51
stan6;Riba;Ribiž;2;5;-578.9743838385184;2015-12-31 10:45:51
stan1;Ana;Anic;1;-1;-6.480555554000136;2015-12-31 10:48:52
stan2;Biba;Bibiđ;2;1;-130.9611129999999;2015-12-31 10:48:52
stan3;Didi;Didić;3;2;-1240.312575755727;2015-12-31 10:48:52
stan4;Ele;Eliš;4;0;-385.38888888901033;2015-12-31 10:48:52
stan5;Tomi;Tomič;6;3;-1773.7590909077815;2015-12-31 10:48:52
stan6;Riba;Ribiž;2;5;-578.9743838385184;2015-12-31 10:48:52
stan1;Ana;Anic;1;-1;-6.480555554000136;2015-12-31 10:48:57
stan2;Biba;Bibiđ;2;1;-130.9611129999999;2015-12-31 10:48:57
stan3;Didi;Didić;3;2;759.687424244273;2015-12-31 10:48:57
stan4;Ele;Eliš;4;0;-385.38888888901033;2015-12-31 10:48:57
stan5;Tomi;Tomič;6;3;-1773.7590909077815;2015-12-31 10:48:57
stan6;Riba;Ribiž;2;5;-578.9743838385184;2015-12-31 10:48:57
stan1;Ana;Anic;1;-1;-6.480555554000136;2016-01-17 17:29:50
stan2;Biba;Bibiđ;2;1;-130.9611129999999;2016-01-17 17:29:50
stan3;Didi;Didić;3;2;759.687424244273;2016-01-17 17:29:50
stan4;Ele;Eliš;4;0;-385.38888888901033;2016-01-17 17:29:50
stan5;Tomi;Tomič;6;3;-1773.7590909077815;2016-01-17 17:29:50
stan6;Riba;Ribiž;2;5;-578.9743838385184;2016-01-17 17:29:50
stan1;Ana;Anic;1;-1;33.519444445999866;2016-01-17 17:29:53
stan2;Biba;Bibiđ;2;1;-130.9611129999999;2016-01-17 17:29:53
stan3;Didi;Didić;3;2;759.687424244273;2016-01-17 17:29:53
stan4;Ele;Eliš;4;0;-385.38888888901033;2016-01-17 17:29:53
stan5;Tomi;Tomič;6;3;-1773.7590909077815;2016-01-17 17:29:53
stan6;Riba;Ribiž;2;5;-578.9743838385184;2016-01-17 17:29:53
stan1;Ana;Anic;1;-1;33.519444445999866;2016-01-17 17:45:55
stan2;Biba;Bibiđ;2;1;-130.9611129999999;2016-01-17 17:45:55
stan3;Didi;Didić;3;2;759.687424244273;2016-01-17 17:45:55
stan4;Ele;Eliš;4;0;-385.38888888901033;2016-01-17 17:45:55
stan5;Tomi;Tomič;6;3;-1773.7590909077815;2016-01-17 17:45:55
stan6;Riba;Ribiž;2;5;-578.9743838385184;2016-01-17 17:45:55
stan1;Ana;Anic;1;-1;22.408333334888756;2016-01-17 17:45:55
stan2;Biba;Bibiđ;2;1;-153.18333522222213;2016-01-17 17:45:55
stan3;Didi;Didić;3;2;726.3540909109396;2016-01-17 17:45:55
stan4;Ele;Eliš;4;0;-429.8333333334548;2016-01-17 17:45:55
stan5;Tomi;Tomič;6;3;-1840.4257575744482;2016-01-17 17:45:55
stan6;Riba;Ribiž;2;5;-601.1966060607406;2016-01-17 17:45:55
stan1;Ana;Anic;1;-1;22.408333334888756;2016-01-17 17:46:04
stan2;Biba;Bibiđ;2;1;-153.18333522222213;2016-01-17 17:46:04
stan3;Didi;Didić;3;2;726.3540909109396;2016-01-17 17:46:04
stan4;Ele;Eliš;4;0;-429.8333333334548;2016-01-17 17:46:04
stan5;Tomi;Tomič;6;3;-1840.4257575744482;2016-01-17 17:46:04
stan6;Riba;Ribiž;2;5;-601.1966060607406;2016-01-17 17:46:04
stan1;Ana;Anic;1;-1;11.297222223777645;2016-01-17 17:46:04
stan2;Biba;Bibiđ;2;1;-175.40555744444436;2016-01-17 17:46:04
stan3;Didi;Didić;3;2;693.0207575776062;2016-01-17 17:46:04
stan4;Ele;Eliš;4;0;-474.27777777789925;2016-01-17 17:46:04
stan5;Tomi;Tomič;6;3;-1907.092424241115;2016-01-17 17:46:04
stan6;Riba;Ribiž;2;5;-623.4188282829627;2016-01-17 17:46:04
stan1;Ana;Anic;1;-1;11.297222223777645;2016-01-17 17:46:15
stan2;Biba;Bibiđ;2;1;-175.40555744444436;2016-01-17 17:46:15
stan3;Didi;Didić;3;2;693.0207575776062;2016-01-17 17:46:15
stan4;Ele;Eliš;4;0;-474.27777777789925;2016-01-17 17:46:15
stan5;Tomi;Tomič;6;3;-1907.092424241115;2016-01-17 17:46:15
stan6;Riba;Ribiž;2;5;-623.4188282829627;2016-01-17 17:46:15
stan1;Ana;Anic;1;-1;11.297222223777645;2016-01-17 17:46:15
stan2;Biba;Bibiđ;2;1;-175.40555744444436;2016-01-17 17:46:15
stan3;Didi;Didić;3;2;652.1116666685153;2016-01-17 17:46:15
stan4;Ele;Eliš;4;0;-474.27777777789925;2016-01-17 17:46:15
stan5;Tomi;Tomič;6;3;-1988.9106060592967;2016-01-17 17:46:15
stan6;Riba;Ribiž;2;5;-650.69155555569;2016-01-17 17:46:15
stan1;Ana;Anic;1;-1;11.297222223777645;2016-01-17 17:46:54
stan2;Biba;Bibiđ;2;1;-175.40555744444436;2016-01-17 17:46:54
stan3;Didi;Didić;3;2;652.1116666685153;2016-01-17 17:46:54
stan4;Ele;Eliš;4;0;-474.27777777789925;2016-01-17 17:46:54
stan5;Tomi;Tomič;6;3;-1988.9106060592967;2016-01-17 17:46:54
stan6;Riba;Ribiž;2;5;-650.69155555569;2016-01-17 17:46:54
stan1;Ana;Anic;1;-1;11.297222223777645;2016-01-17 17:46:58
stan2;Biba;Bibiđ;2;1;-175.40555744444436;2016-01-17 17:46:58
stan3;Didi;Didić;3;2;652.1116666685153;2016-01-17 17:46:58
stan4;Ele;Eliš;4;0;-474.27777777789925;2016-01-17 17:46:58
stan5;Tomi;Tomič;6;3;11.099393940703294;2016-01-17 17:46:58
stan6;Riba;Ribiž;2;5;-650.69155555569;2016-01-17 17:46:58
stan1;Ana;Anic;1;-1;11.297222223777645;2016-01-17 17:50:44
stan2;Biba;Bibiđ;2;1;-175.40555744444436;2016-01-17 17:50:44
stan3;Didi;Didić;3;2;652.1116666685153;2016-01-17 17:50:44
stan4;Ele;Eliš;4;0;-474.27777777789925;2016-01-17 17:50:44
stan5;Tomi;Tomič;6;3;-1988.9106060592967;2016-01-17 17:50:44
stan6;Riba;Ribiž;2;5;-650.69155555569;2016-01-17 17:50:44
stan1;Ana;Anic;1;-1;-99.81388888733346;2016-01-17 17:50:44
stan2;Biba;Bibiđ;2;1;-397.6277796666666;2016-01-17 17:50:44
stan3;Didi;Didić;3;2;318.77833333518197;2016-01-17 17:50:44
stan4;Ele;Eliš;4;0;-918.7222222223437;2016-01-17 17:50:44
stan5;Tomi;Tomič;6;3;-2655.5772727259637;2016-01-17 17:50:44
stan6;Riba;Ribiž;2;5;-872.9137777779122;2016-01-17 17:50:44
stan1;Ana;Anic;1;-1;-99.81388888733346;2016-01-17 17:52:36
stan2;Biba;Bibiđ;2;1;-397.6277796666666;2016-01-17 17:52:36
stan3;Didi;Didić;3;2;318.77833333518197;2016-01-17 17:52:36
stan4;Ele;Eliš;4;0;-918.7222222223437;2016-01-17 17:52:36
stan5;Tomi;Tomič;6;3;-2655.5772727259637;2016-01-17 17:52:36
stan6;Riba;Ribiž;2;5;-872.9137777779122;2016-01-17 17:52:36
stan1;Ana;Anic;1;-1;-113.09166666511123;2016-01-17 17:52:36
stan2;Biba;Bibiđ;2;1;-424.1833352222221;2016-01-17 17:52:36
stan3;Didi;Didić;3;2;278.94500000184865;2016-01-17 17:52:36
stan4;Ele;Eliš;4;0;-971.8333333334548;2016-01-17 17:52:36
stan5;Tomi;Tomič;6;3;-2735.24393939263;2016-01-17 17:52:36
stan6;Riba;Ribiž;2;5;-899.4693333334677;2016-01-17 17:52:36
stan1;Ana;Anic;1;-1;-113.09166666511123;2016-01-17 17:52:52
stan2;Biba;Bibiđ;2;1;-424.1833352222221;2016-01-17 17:52:52
stan3;Didi;Didić;3;2;278.94500000184865;2016-01-17 17:52:52
stan4;Ele;Eliš;4;0;-971.8333333334548;2016-01-17 17:52:52
stan5;Tomi;Tomič;6;3;-2735.24393939263;2016-01-17 17:52:52
stan6;Riba;Ribiž;2;5;-899.4693333334677;2016-01-17 17:52:52
stan1;Ana;Anic;1;-1;-113.09166666511123;2016-01-17 17:52:52
stan2;Biba;Bibiđ;2;1;-424.1833352222221;2016-01-17 17:52:52
stan3;Didi;Didić;3;2;245.3995454563941;2016-01-17 17:52:52
stan4;Ele;Eliš;4;0;-971.8333333334548;2016-01-17 17:52:52
stan5;Tomi;Tomič;6;3;-2802.334848483539;2016-01-17 17:52:52
stan6;Riba;Ribiž;2;5;-921.8329696971041;2016-01-17 17:52:52
stan1;Ana;Anic;1;-1;-113.09166666511123;2016-01-17 17:54:45
stan2;Biba;Bibiđ;2;1;-424.1833352222221;2016-01-17 17:54:45
stan3;Didi;Didić;3;2;278.94500000184865;2016-01-17 17:54:45
stan4;Ele;Eliš;4;0;-971.8333333334548;2016-01-17 17:54:45
stan5;Tomi;Tomič;6;3;-2735.24393939263;2016-01-17 17:54:45
stan6;Riba;Ribiž;2;5;-899.4693333334677;2016-01-17 17:54:45
stan1;Ana;Anic;1;-1;-801.2583333317779;2016-01-17 17:54:45
stan2;Biba;Bibiđ;2;1;-1800.5166685555555;2016-01-17 17:54:45
stan3;Didi;Didić;3;2;-1785.5549999981513;2016-01-17 17:54:45
stan4;Ele;Eliš;4;0;-3724.5000000001214;2016-01-17 17:54:45
stan5;Tomi;Tomič;6;3;-6864.243939392631;2016-01-17 17:54:45
stan6;Riba;Ribiž;2;5;-2275.802666666801;2016-01-17 17:54:45
stan1;Ana;Anic;1;-1;-801.2583333317779;2016-01-17 17:54:57
stan2;Biba;Bibiđ;2;1;-1800.5166685555555;2016-01-17 17:54:57
stan3;Didi;Didić;3;2;-1785.5549999981513;2016-01-17 17:54:57
stan4;Ele;Eliš;4;0;-3724.5000000001214;2016-01-17 17:54:57
stan5;Tomi;Tomič;6;3;-6864.243939392631;2016-01-17 17:54:57
stan6;Riba;Ribiž;2;5;-2275.802666666801;2016-01-17 17:54:57
stan1;Ana;Anic;1;-1;-801.2583333317779;2016-01-17 17:54:59
stan2;Biba;Bibiđ;2;1;-1800.5166685555555;2016-01-17 17:54:59
stan3;Didi;Didić;3;2;-1785.5549999981513;2016-01-17 17:54:59
stan4;Ele;Eliš;4;0;-3724.5000000001214;2016-01-17 17:54:59
stan5;Tomi;Tomič;6;3;135.75606060736936;2016-01-17 17:54:59
stan6;Riba;Ribiž;2;5;-2275.802666666801;2016-01-17 17:54:59
stan1;Ana;Anic;1;-1;-801.2583333317779;2016-01-17 17:56:40
stan2;Biba;Bibiđ;2;1;-1800.5166685555555;2016-01-17 17:56:40
stan3;Didi;Didić;3;2;-1785.5549999981513;2016-01-17 17:56:40
stan4;Ele;Eliš;4;0;-3724.5000000001214;2016-01-17 17:56:40
stan5;Tomi;Tomič;6;3;-6864.243939392631;2016-01-17 17:56:40
stan6;Riba;Ribiž;2;5;-2275.802666666801;2016-01-17 17:56:40
stan1;Ana;Anic;1;-1;-806.8138888873334;2016-01-17 17:56:40
stan2;Biba;Bibiđ;2;1;-1811.6277796666666;2016-01-17 17:56:40
stan3;Didi;Didić;3;2;-1802.221666664818;2016-01-17 17:56:40
stan4;Ele;Eliš;4;0;-3746.7222222223436;2016-01-17 17:56:40
stan5;Tomi;Tomič;6;3;-6897.577272725964;2016-01-17 17:56:40
stan6;Riba;Ribiž;2;5;-2286.9137777779124;2016-01-17 17:56:40
stan1;Ana;Anic;1;-1;-806.8138888873334;2016-01-17 17:56:51
stan2;Biba;Bibiđ;2;1;-1811.6277796666666;2016-01-17 17:56:51
stan3;Didi;Didić;3;2;-1802.221666664818;2016-01-17 17:56:51
stan4;Ele;Eliš;4;0;-3746.7222222223436;2016-01-17 17:56:51
stan5;Tomi;Tomič;6;3;-6897.577272725964;2016-01-17 17:56:51
stan6;Riba;Ribiž;2;5;-2286.9137777779124;2016-01-17 17:56:51
stan1;Ana;Anic;1;-1;-812.369444442889;2016-01-17 17:56:51
stan2;Biba;Bibiđ;2;1;-1822.7388907777777;2016-01-17 17:56:51
stan3;Didi;Didić;3;2;-1818.8883333314848;2016-01-17 17:56:51
stan4;Ele;Eliš;4;0;-3768.9444444445658;2016-01-17 17:56:51
stan5;Tomi;Tomič;6;3;-6930.910606059297;2016-01-17 17:56:51
stan6;Riba;Ribiž;2;5;-2298.0248888890237;2016-01-17 17:56:51
stan1;Ana;Anic;1;-1;-806.8138888873334;2016-01-17 18:00:21
stan2;Biba;Bibiđ;2;1;-1811.6277796666666;2016-01-17 18:00:21
stan3;Didi;Didić;3;2;-1802.221666664818;2016-01-17 18:00:21
stan4;Ele;Eliš;4;0;-3746.7222222223436;2016-01-17 18:00:21
stan5;Tomi;Tomič;6;3;-6897.577272725964;2016-01-17 18:00:21
stan6;Riba;Ribiž;2;5;-2286.9137777779124;2016-01-17 18:00:21
stan1;Ana;Anic;1;-1;-862.369444442889;2016-01-17 18:00:21
stan2;Biba;Bibiđ;2;1;-1922.7388907777777;2016-01-17 18:00:21
stan3;Didi;Didić;3;2;-1968.8883333314848;2016-01-17 18:00:21
stan4;Ele;Eliš;4;0;-3968.9444444445658;2016-01-17 18:00:21
stan5;Tomi;Tomič;6;3;-7230.910606059297;2016-01-17 18:00:21
stan6;Riba;Ribiž;2;5;-2398.0248888890237;2016-01-17 18:00:21
stan1;Ana;Anic;1;-1;862.369444442889;2016-01-18 20:07:55
stan2;Biba;Bibiđ;2;1;922.7388907777777;2016-01-18 20:07:55
stan3;Didi;Didić;3;2;968.8883333314848;2016-01-18 20:07:55
stan4;Ele;Eliš;4;0;368.9444444445658;2016-01-18 20:07:55
stan5;Tomi;Tomič;6;3;0.0;2016-01-18 20:07:55
stan6;Riba;Ribiž;2;5;398.0248888890237;2016-01-18 20:07:55
stan1;Ana;Anic;1;-1;856.8138888873334;2016-01-18 20:07:55
stan2;Biba;Bibiđ;2;1;911.6277796666666;2016-01-18 20:07:55
stan3;Didi;Didić;3;2;952.2216666648181;2016-01-18 20:07:55
stan4;Ele;Eliš;4;0;346.7222222223436;2016-01-18 20:07:55
stan5;Tomi;Tomič;6;3;-33.33333333333333;2016-01-18 20:07:55
stan6;Riba;Ribiž;2;5;386.9137777779126;2016-01-18 20:07:55
stan1;Ana;Anic;1;-1;856.8138888873334;2016-01-18 20:08:15
stan2;Biba;Bibiđ;2;1;911.6277796666666;2016-01-18 20:08:15
stan3;Didi;Didić;3;2;952.2216666648181;2016-01-18 20:08:15
stan4;Ele;Eliš;4;0;346.7222222223436;2016-01-18 20:08:15
stan5;Tomi;Tomič;6;3;-33.33333333333333;2016-01-18 20:08:15
stan6;Riba;Ribiž;2;5;386.9137777779126;2016-01-18 20:08:15
stan1;Ana;Anic;1;-1;301.25833333177786;2016-01-18 20:08:15
stan2;Biba;Bibiđ;2;1;-199.4833314444445;2016-01-18 20:08:15
stan3;Didi;Didić;3;2;-714.4450000018484;2016-01-18 20:08:15
stan4;Ele;Eliš;4;0;-1875.4999999998786;2016-01-18 20:08:15
stan5;Tomi;Tomič;6;3;-3366.6666666666665;2016-01-18 20:08:15
stan6;Riba;Ribiž;2;5;-724.1973333331985;2016-01-18 20:08:15
stan1;Ana;Anic;1;-1;301.25833333177786;2016-03-19 17:06:21
stan2;Biba;Bibiđ;2;1;-199.4833314444445;2016-03-19 17:06:21
stan3;Didi;Didić;3;2;-714.4450000018484;2016-03-19 17:06:21
stan4;Ele;Eliš;4;0;-1875.4999999998786;2016-03-19 17:06:21
stan5;Tomi;Tomič;6;3;-3366.6666666666665;2016-03-19 17:06:21
stan6;Riba;Ribiž;2;5;-724.1973333331985;2016-03-19 17:06:21
stan1;Ana;Anic;1;-1;301.25833333177786;2016-03-19 17:06:26
stan2;Biba;Bibiđ;2;1;-199.4833314444445;2016-03-19 17:06:26
stan3;Didi;Didić;3;2;-714.4450000018484;2016-03-19 17:06:26
stan4;Ele;Eliš;4;0;-1875.4999999998786;2016-03-19 17:06:26
stan5;Tomi;Tomič;6;3;633.3333333333335;2016-03-19 17:06:26
stan6;Riba;Ribiž;2;5;-724.1973333331985;2016-03-19 17:06:26
stan1;Ana;Anic;1;-1;301.25833333177786;2016-03-19 17:07:03
stan2;Biba;Bibiđ;2;1;-199.4833314444445;2016-03-19 17:07:03
stan3;Didi;Didić;3;2;-714.4450000018484;2016-03-19 17:07:03
stan4;Ele;Eliš;4;0;-1875.4999999998786;2016-03-19 17:07:03
stan5;Tomi;Tomič;6;3;633.3333333333335;2016-03-19 17:07:03
stan6;Riba;Ribiž;2;5;-724.1973333331985;2016-03-19 17:07:03
stan1;Ana;Anic;1;-1;301.25833333177786;2016-03-19 17:07:04
stan2;Biba;Bibiđ;2;1;-199.4833314444445;2016-03-19 17:07:04
stan3;Didi;Didić;3;2;-714.4450000018484;2016-03-19 17:07:04
stan4;Ele;Eliš;4;0;-1875.4999999998786;2016-03-19 17:07:04
stan5;Tomi;Tomič;6;3;1633.3333333333335;2016-03-19 17:07:04
stan6;Riba;Ribiž;2;5;-724.1973333331985;2016-03-19 17:07:04
stan1;Ana;Anic;1;-1;301.25833333177786;2016-03-19 17:08:24
stan2;Biba;Bibiđ;2;1;-199.4833314444445;2016-03-19 17:08:24
stan3;Didi;Didić;3;2;-714.4450000018484;2016-03-19 17:08:24
stan4;Ele;Eliš;4;0;-1875.4999999998786;2016-03-19 17:08:24
stan5;Tomi;Tomič;6;3;633.3333333333335;2016-03-19 17:08:24
stan6;Riba;Ribiž;2;5;-724.1973333331985;2016-03-19 17:08:24
stan1;Ana;Anic;1;-1;190.14722222066675;2016-03-19 17:08:24
stan2;Biba;Bibiđ;2;1;-421.70555366666673;2016-03-19 17:08:24
stan3;Didi;Didić;3;2;-1047.7783333351817;2016-03-19 17:08:24
stan4;Ele;Eliš;4;0;-2319.944444444323;2016-03-19 17:08:24
stan5;Tomi;Tomič;6;3;-33.33333333333326;2016-03-19 17:08:24
stan6;Riba;Ribiž;2;5;-946.4195555554206;2016-03-19 17:08:24
stan1;Ana;Anic;1;-1;190.14722222066675;2016-03-19 17:12:47
stan2;Biba;Bibiđ;2;1;-421.70555366666673;2016-03-19 17:12:47
stan3;Didi;Didić;3;2;-1047.7783333351817;2016-03-19 17:12:47
stan4;Ele;Eliš;4;0;-2319.944444444323;2016-03-19 17:12:47
stan5;Tomi;Tomič;6;3;-33.33333333333326;2016-03-19 17:12:47
stan6;Riba;Ribiž;2;5;-946.4195555554206;2016-03-19 17:12:47
stan1;Ana;Anic;1;-1;173.4805555540001;2016-03-19 17:12:47
stan2;Biba;Bibiđ;2;1;-455.03888700000005;2016-03-19 17:12:47
stan3;Didi;Didić;3;2;-1097.7783333351817;2016-03-19 17:12:47
stan4;Ele;Eliš;4;0;-2386.6111111109894;2016-03-19 17:12:47
stan5;Tomi;Tomič;6;3;-133.33333333333326;2016-03-19 17:12:47
stan6;Riba;Ribiž;2;5;-979.752888888754;2016-03-19 17:12:47
stan1;Ana;Anic;1;-1;173.4805555540001;2016-03-19 17:18:02
stan2;Biba;Bibiđ;2;1;-455.03888700000005;2016-03-19 17:18:02
stan3;Didi;Didić;3;2;-1097.7783333351817;2016-03-19 17:18:02
stan4;Ele;Eliš;4;0;-2386.6111111109894;2016-03-19 17:18:02
stan5;Tomi;Tomič;6;3;-133.33333333333326;2016-03-19 17:18:02
stan6;Riba;Ribiž;2;5;-979.752888888754;2016-03-19 17:18:02
stan1;Ana;Anic;1;-1;162.36944444288898;2016-03-19 17:18:02
stan2;Biba;Bibiđ;2;1;-477.2611092222223;2016-03-19 17:18:02
stan3;Didi;Didić;3;2;-1131.111666668515;2016-03-19 17:18:02
stan4;Ele;Eliš;4;0;-2431.055555555434;2016-03-19 17:18:02
stan5;Tomi;Tomič;6;3;-199.99999999999991;2016-03-19 17:18:02
stan6;Riba;Ribiž;2;5;-1001.9751111109762;2016-03-19 17:18:02
stan1;Ana;Anic;1;-1;162.36944444288898;2016-03-19 17:18:14
stan2;Biba;Bibiđ;2;1;-477.2611092222223;2016-03-19 17:18:14
stan3;Didi;Didić;3;2;-1131.111666668515;2016-03-19 17:18:14
stan4;Ele;Eliš;4;0;-2431.055555555434;2016-03-19 17:18:14
stan5;Tomi;Tomič;6;3;-199.99999999999991;2016-03-19 17:18:14
stan6;Riba;Ribiž;2;5;-1001.9751111109762;2016-03-19 17:18:14
stan1;Ana;Anic;1;-1;151.25833333177786;2016-03-19 17:18:14
stan2;Biba;Bibiđ;2;1;-499.4833314444445;2016-03-19 17:18:14
stan3;Didi;Didić;3;2;-1164.4450000018483;2016-03-19 17:18:14
stan4;Ele;Eliš;4;0;-2475.499999999878;2016-03-19 17:18:14
stan5;Tomi;Tomič;6;3;-266.6666666666666;2016-03-19 17:18:14
stan6;Riba;Ribiž;2;5;-1024.1973333331985;2016-03-19 17:18:14
stan1;Ana;Anic;1;-1;151.25833333177786;2016-03-19 17:18:28
stan2;Biba;Bibiđ;2;1;-499.4833314444445;2016-03-19 17:18:28
stan3;Didi;Didić;3;2;-1164.4450000018483;2016-03-19 17:18:28
stan4;Ele;Eliš;4;0;-2475.499999999878;2016-03-19 17:18:28
stan5;Tomi;Tomič;6;3;-266.6666666666666;2016-03-19 17:18:28
stan6;Riba;Ribiž;2;5;-1024.1973333331985;2016-03-19 17:18:28
stan1;Ana;Anic;1;-1;151.25833333177786;2016-03-19 17:18:28
stan2;Biba;Bibiđ;2;1;-499.4833314444445;2016-03-19 17:18:28
stan3;Didi;Didić;3;2;-1218.9904545473028;2016-03-19 17:18:28
stan4;Ele;Eliš;4;0;-2475.499999999878;2016-03-19 17:18:28
stan5;Tomi;Tomič;6;3;-375.75757575757564;2016-03-19 17:18:28
stan6;Riba;Ribiž;2;5;-1060.5609696968347;2016-03-19 17:18:28
stan1;Ana;Anic;1;-1;151.25833333177786;2016-03-19 17:29:11
stan2;Biba;Bibiđ;2;1;-499.4833314444445;2016-03-19 17:29:11
stan3;Didi;Didić;3;2;-1218.9904545473028;2016-03-19 17:29:11
stan4;Ele;Eliš;4;0;-2475.499999999878;2016-03-19 17:29:11
stan5;Tomi;Tomič;6;3;-375.75757575757564;2016-03-19 17:29:11
stan6;Riba;Ribiž;2;5;-1060.5609696968347;2016-03-19 17:29:11
stan1;Ana;Anic;1;-1;140.14722222066675;2016-03-19 17:29:11
stan2;Biba;Bibiđ;2;1;-521.7055536666667;2016-03-19 17:29:11
stan3;Didi;Didić;3;2;-1252.323787880636;2016-03-19 17:29:11
stan4;Ele;Eliš;4;0;-2519.9444444443225;2016-03-19 17:29:11
stan5;Tomi;Tomič;6;3;-442.42424242424227;2016-03-19 17:29:11
stan6;Riba;Ribiž;2;5;-1082.783191919057;2016-03-19 17:29:11
stan1;Ana;Anic;1;-1;140.14722222066675;2016-03-19 17:29:32
stan2;Biba;Bibiđ;2;1;-521.7055536666667;2016-03-19 17:29:32
stan3;Didi;Didić;3;2;-1252.323787880636;2016-03-19 17:29:32
stan4;Ele;Eliš;4;0;-2519.9444444443225;2016-03-19 17:29:32
stan5;Tomi;Tomič;6;3;-442.42424242424227;2016-03-19 17:29:32
stan6;Riba;Ribiž;2;5;-1082.783191919057;2016-03-19 17:29:32
stan1;Ana;Anic;1;-1;140.14722222066675;2016-03-19 17:29:32
stan2;Biba;Bibiđ;2;1;-521.7055536666667;2016-03-19 17:29:32
stan3;Didi;Didić;3;2;-1334.1419696988178;2016-03-19 17:29:32
stan4;Ele;Eliš;4;0;-2519.9444444443225;2016-03-19 17:29:32
stan5;Tomi;Tomič;6;3;-606.0606060606059;2016-03-19 17:29:32
stan6;Riba;Ribiž;2;5;-1137.3286464645114;2016-03-19 17:29:32
stan1;Ana;Anic;1;-1;140.14722222066675;2016-03-19 17:31:29
stan2;Biba;Bibiđ;2;1;-521.7055536666667;2016-03-19 17:31:29
stan3;Didi;Didić;3;2;-1334.1419696988178;2016-03-19 17:31:29
stan4;Ele;Eliš;4;0;-2519.9444444443225;2016-03-19 17:31:29
stan5;Tomi;Tomič;6;3;-606.0606060606059;2016-03-19 17:31:29
stan6;Riba;Ribiž;2;5;-1137.3286464645114;2016-03-19 17:31:29
stan1;Ana;Anic;1;-1;101.25833333177786;2016-03-19 17:31:30
stan2;Biba;Bibiđ;2;1;-599.4833314444445;2016-03-19 17:31:30
stan3;Didi;Didić;3;2;-1450.8086363654845;2016-03-19 17:31:30
stan4;Ele;Eliš;4;0;-2675.499999999878;2016-03-19 17:31:30
stan5;Tomi;Tomič;6;3;-839.3939393939393;2016-03-19 17:31:30
stan6;Riba;Ribiž;2;5;-1215.1064242422892;2016-03-19 17:31:30
stan1;Ana;Anic;1;-1;101.25833333177786;2016-03-19 17:55:20
stan2;Biba;Bibiđ;2;1;-599.4833314444445;2016-03-19 17:55:20
stan3;Didi;Didić;3;2;-1450.8086363654845;2016-03-19 17:55:20
stan4;Ele;Eliš;4;0;-2675.499999999878;2016-03-19 17:55:20
stan5;Tomi;Tomič;6;3;-839.3939393939393;2016-03-19 17:55:20
stan6;Riba;Ribiž;2;5;-1215.1064242422892;2016-03-19 17:55:20
stan1;Ana;Anic;1;-1;101.25833333177786;2016-03-19 17:57:02
stan2;Biba;Bibiđ;2;1;-599.4833314444445;2016-03-19 17:57:02
stan3;Didi;Didić;3;2;-1450.8086363654845;2016-03-19 17:57:02
stan4;Ele;Eliš;4;0;-2675.499999999878;2016-03-19 17:57:02
stan5;Tomi;Tomič;6;3;-839.3939393939393;2016-03-19 17:57:02
stan6;Riba;Ribiž;2;5;-1215.1064242422892;2016-03-19 17:57:02
stan1;Ana;Anic;1;-1;101.25833333177786;2016-03-19 17:58:57
stan2;Biba;Bibiđ;2;1;-599.4833314444445;2016-03-19 17:58:57
stan3;Didi;Didić;3;2;-1450.8086363654845;2016-03-19 17:58:57
stan4;Ele;Eliš;4;0;-2675.499999999878;2016-03-19 17:58:57
stan5;Tomi;Tomič;6;3;-839.3939393939393;2016-03-19 17:58:57
stan6;Riba;Ribiž;2;5;-1215.1064242422892;2016-03-19 17:58:57
stan1;Ana;Anic;1;-1;101.25833333177786;2016-03-19 18:29:29
stan2;Biba;Bibiđ;2;1;-599.4833314444445;2016-03-19 18:29:29
stan3;Didi;Didić;3;2;-1450.8086363654845;2016-03-19 18:29:29
stan4;Ele;Eliš;4;0;-2675.499999999878;2016-03-19 18:29:29
stan5;Tomi;Tomič;6;3;-839.3939393939393;2016-03-19 18:29:29
stan6;Riba;Ribiž;2;5;-1215.1064242422892;2016-03-19 18:29:29
stan1;Ana;Anic;1;-1;101.25833333177786;2016-03-19 18:29:29
stan2;Biba;Bibiđ;2;1;-599.4833314444445;2016-03-19 18:29:29
stan3;Didi;Didić;3;2;-1505.354090910939;2016-03-19 18:29:29
stan4;Ele;Eliš;4;0;-2675.499999999878;2016-03-19 18:29:29
stan5;Tomi;Tomič;6;3;-948.4848484848484;2016-03-19 18:29:29
stan6;Riba;Ribiž;2;5;-1251.4700606059255;2016-03-19 18:29:29
stan1;Ana;Anic;1;-1;101.25833333177786;2016-03-20 14:12:45
stan2;Biba;Bibiđ;2;1;-599.4833314444445;2016-03-20 14:12:45
stan3;Didi;Didić;3;2;-1505.354090910939;2016-03-20 14:12:45
stan4;Ele;Eliš;4;0;-2675.499999999878;2016-03-20 14:12:45
stan5;Tomi;Tomič;6;3;-948.4848484848484;2016-03-20 14:12:45
stan6;Riba;Ribiž;2;5;-1251.4700606059255;2016-03-20 14:12:45
stan1;Ana;Anic;1;-1;88.25833333177786;2016-03-20 14:12:45
stan2;Biba;Bibiđ;2;1;-625.4833314444445;2016-03-20 14:12:45
stan3;Didi;Didić;3;2;-1544.354090910939;2016-03-20 14:12:45
stan4;Ele;Eliš;4;0;-2727.499999999878;2016-03-20 14:12:45
stan5;Tomi;Tomič;6;3;-1026.4848484848485;2016-03-20 14:12:45
stan6;Riba;Ribiž;2;5;-1277.4700606059255;2016-03-20 14:12:45
stan1;Ana;Anic;1;-1;88.25833333177786;2016-03-20 14:35:29
stan2;Biba;Bibiđ;2;1;-625.4833314444445;2016-03-20 14:35:29
stan3;Didi;Didić;3;2;-1544.354090910939;2016-03-20 14:35:29
stan4;Ele;Eliš;4;0;-2727.499999999878;2016-03-20 14:35:29
stan5;Tomi;Tomič;6;3;-1026.4848484848485;2016-03-20 14:35:29
stan6;Riba;Ribiž;2;5;-1277.4700606059255;2016-03-20 14:35:29
stan1;Ana;Anic;1;-1;75.31388888733342;2016-03-20 14:35:29
stan2;Biba;Bibiđ;2;1;-651.3722203333334;2016-03-20 14:35:29
stan3;Didi;Didić;3;2;-1583.1874242442723;2016-03-20 14:35:29
stan4;Ele;Eliš;4;0;-2779.277777777656;2016-03-20 14:35:29
stan5;Tomi;Tomič;6;3;-1104.1515151515152;2016-03-20 14:35:29
stan6;Riba;Ribiž;2;5;-1303.3589494948144;2016-03-20 14:35:29
stan1;Ana;Anic;1;-1;75.31388888733342;2016-03-20 14:35:36
stan2;Biba;Bibiđ;2;1;-651.3722203333334;2016-03-20 14:35:36
stan3;Didi;Didić;3;2;-1583.1874242442723;2016-03-20 14:35:36
stan4;Ele;Eliš;4;0;-2779.277777777656;2016-03-20 14:35:36
stan5;Tomi;Tomič;6;3;-1104.1515151515152;2016-03-20 14:35:36
stan6;Riba;Ribiž;2;5;-1303.3589494948144;2016-03-20 14:35:36
stan1;Ana;Anic;1;-1;75.31388888733342;2016-03-20 14:35:36
stan2;Biba;Bibiđ;2;1;-651.3722203333334;2016-03-20 14:35:36
stan3;Didi;Didić;3;2;-1586.4601515169995;2016-03-20 14:35:36
stan4;Ele;Eliš;4;0;-2779.277777777656;2016-03-20 14:35:36
stan5;Tomi;Tomič;6;3;-1110.6969696969697;2016-03-20 14:35:36
stan6;Riba;Ribiž;2;5;-1305.5407676766326;2016-03-20 14:35:36
stan1;Ana;Anic;1;-1;75.31388888733342;2016-03-20 14:47:48
stan2;Biba;Bibiđ;2;1;-651.3722203333334;2016-03-20 14:47:48
stan3;Didi;Didić;3;2;-1586.4601515169995;2016-03-20 14:47:48
stan4;Ele;Eliš;4;0;-2779.277777777656;2016-03-20 14:47:48
stan5;Tomi;Tomič;6;3;-1110.6969696969697;2016-03-20 14:47:48
stan6;Riba;Ribiž;2;5;-1305.5407676766326;2016-03-20 14:47:48
stan1;Ana;Anic;1;-1;75.31388888733342;2016-03-20 14:48:02
stan2;Biba;Bibiđ;2;1;-651.3722203333334;2016-03-20 14:48:02
stan3;Didi;Didić;3;2;-1586.4601515169995;2016-03-20 14:48:02
stan4;Ele;Eliš;4;0;-2779.277777777656;2016-03-20 14:48:02
stan5;Tomi;Tomič;6;3;-1110.6969696969697;2016-03-20 14:48:02
stan6;Riba;Ribiž;2;5;-1305.5407676766326;2016-03-20 14:48:02
stan1;Ana;Anic;1;-1;309.3138888873334;2016-03-20 14:48:03
stan2;Biba;Bibiđ;2;1;-651.3722203333334;2016-03-20 14:48:03
stan3;Didi;Didić;3;2;-1586.4601515169995;2016-03-20 14:48:03
stan4;Ele;Eliš;4;0;-2779.277777777656;2016-03-20 14:48:03
stan5;Tomi;Tomič;6;3;-1110.6969696969697;2016-03-20 14:48:03
stan6;Riba;Ribiž;2;5;-1305.5407676766326;2016-03-20 14:48:03
