stan1;Ana;Anic;1;-1;-801.2583333317779
stan2;Biba;Bibiđ;2;1;-1800.5166685555555
stan3;Didi;Didić;3;2;-1785.5549999981513
stan4;Ele;Eliš;4;0;-3724.5000000001214
stan5;Tomi;Tomič;6;3;-6864.243939392631
stan6;Riba;Ribiž;2;5;-2275.802666666801
