stan1;Ana;Anic;1;-1;-806.8138888873334
stan2;Biba;Bibiđ;2;1;-1811.6277796666666
stan3;Didi;Didić;3;2;-1802.221666664818
stan4;Ele;Eliš;4;0;-3746.7222222223436
stan5;Tomi;Tomič;6;3;-6897.577272725964
stan6;Riba;Ribiž;2;5;-2286.9137777779124
