2015-12-28 21:21:31;Račun struje stubišne rasvjete 18 stanara, po stanaru 6.95722222222;125.23
2015-12-28 21:22:00;Račun struje lifta za 11 stanara, po stanaru 1.11818181818;12.3
2015-12-28 21:25:02;Račun struje lifta (11 stanara, po stanaru 1.11818181818);12.3
2015-12-28 21:26:32;Račun struje lifta (11 stanara, po stanaru 11.2109090909);123.32
2015-12-29 11:42:59;Račun struje stubišne rasvjete (18 stanara, po stanaru 0.128888888889);2.32
2015-12-29 11:43:08;Račun struje lifta (11 stanara, po stanaru 1.2);13.2
2015-12-29 16:09:09;Uplaćeno na račun stana stan4;1000.0
2015-12-29 16:15:17;Saldo blagajne ;434072.3300018868
2015-12-29 16:15:59;Saldo blagajne ;434072.3300018868
2015-12-29 16:17:02;Saldo blagajne ;263.3300018868
2015-12-29 16:17:27;Saldo blagajne ;263.3300018868
2015-12-29 16:28:16;Račun struje stubišne rasvjete (18 stanara, po stanaru 6.239999999999999);112.32
2015-12-29 16:30:31;Uplaćeno na račun stana stan5;61.0
2015-12-29 16:31:11;Račun struje stubišne rasvjete (18 stanara, po stanaru 55.55555555555556);1000.0
2015-12-29 16:47:10;Račun struje stubišne rasvjete (18 stanara, po stanaru 555.5555555555555);10000.0
2015-12-29 16:51:20;Račun struje stubišne rasvjete (18 stanara, po stanaru 684.0);12312.0
2015-12-29 16:53:52;Račun struje stubišne rasvjete (18 stanara, po stanaru 6.833333333333333);123.0
2015-12-29 16:54:04;Račun struje lifta (11 stanara, po stanaru 12.0);132.0
2015-12-29 16:54:19;Uplaćeno na račun stana stan5;100000.0
2015-12-29 16:56:03;Račun struje stubišne rasvjete (18 stanara, po stanaru 555.5555555555555);10000.0
2015-12-29 16:56:17;Storno zadnje transakcije;0
2015-12-29 16:57:41;Račun struje stubišne rasvjete (18 stanara, po stanaru 5555.555555555556);100000.0
2015-12-29 16:58:01;Storno zadnje transakcije;0
2015-12-29 16:58:22;Račun struje stubišne rasvjete (18 stanara, po stanaru 5.555555555555555);100.0
2015-12-29 16:58:34;Storno zadnje transakcije;0
2015-12-30 10:34:39;Račun struje stubišne rasvjete (18 stanara, po stanaru 0.5555555555555556);10.0
2015-12-31 10:27:23;Račun struje stubišne rasvjete (18 stanara, po stanaru 0.6844444444444444);12.32
2015-12-31 10:27:38;Račun struje stubišne rasvjete (18 stanara, po stanaru 18.512222222222224);333.22
2015-12-31 10:28:28;Račun struje lifta (11 stanara, po stanaru 30.292727272727276);333.22
2015-12-31 10:29:24;Račun struje lifta (11 stanara, po stanaru 3.019090909090909);33.21
2015-12-31 10:30:00;Račun struje stubišne rasvjete (18 stanara, po stanaru 62.406666666666666);1123.32
2015-12-31 10:32:09;Saldo blagajne -1577.220607945037;-1577.220607945037
2015-12-31 10:33:40;Uplaćeno na račun stana stan5;700.0
2015-12-31 10:33:59;Uplaćeno na račun stana stan6;153.234
2015-12-31 10:37:22;Račun struje lifta (11 stanara, po stanaru 283.84727272727275);3122.32
2015-12-31 10:38:39;Račun struje stubišne rasvjete (18 stanara, po stanaru 6.845555555555555);123.22
2015-12-31 10:38:45;Storno zadnje transakcije;0
2015-12-31 10:40:33;Račun struje stubišne rasvjete (18 stanara, po stanaru 6.845555555555555);123.22
2015-12-31 10:41:09;Storno zadnje transakcije;0
2015-12-31 10:42:51;Storno zadnje transakcije;0
2015-12-31 10:43:37;Storno zadnje transakcije;0
2015-12-31 10:44:00;Račun struje lifta (11 stanara, po stanaru 119.29181818181819);1312.21
2015-12-31 10:44:17;Storno zadnje transakcije;0
2015-12-31 10:44:55;Račun struje stubišne rasvjete (18 stanara, po stanaru 6.84);123.12
2015-12-31 10:45:08;Račun struje lifta (11 stanara, po stanaru 2.111818181818182);23.23
2015-12-31 10:45:51;Uplaćeno na račun stana stan1;10.0
2015-12-31 10:45:59;Saldo blagajne -4105.876607945037;-4105.876607945037
2015-12-31 10:47:10;Storno zadnje transakcije;0
2015-12-31 10:48:44;Saldo blagajne -4115.876607945037;-4115.876607945037
2015-12-31 10:48:57;Uplaćeno na račun stana stan3;2000.0
2016-01-17 17:29:53;Uplaćeno na račun stana stan1;40.0
2016-01-17 17:45:55;Račun struje stubišne rasvjete (18 stanara, po stanaru 11.11111111111111);200.0
2016-01-17 17:46:04;Račun struje stubišne rasvjete (18 stanara, po stanaru 11.11111111111111);200.0
2016-01-17 17:46:15;Račun struje lifta (11 stanara, po stanaru 13.636363636363637);150.0
2016-01-17 17:46:58;Uplaćeno na račun stana stan5;2000.01
2016-01-17 17:47:12;Saldo blagajne -625.8666079450373;-625.8666079450373
2016-01-17 17:48:11;Storno zadnje transakcije;0
2016-01-17 17:50:44;Račun struje stubišne rasvjete (18 stanara, po stanaru 111.11111111111111);2000.0
2016-01-17 17:51:31;Storno zadnje transakcije;0
2016-01-17 17:52:36;Račun struje stubišne rasvjete (18 stanara, po stanaru 13.277777777777779);239.0
2016-01-17 17:52:52;Račun struje lifta (11 stanara, po stanaru 11.181818181818182);123.0
2016-01-17 17:53:14;Storno zadnje transakcije;0
2016-01-17 17:54:45;Račun struje stubišne rasvjete (18 stanara, po stanaru 688.1666666666666);12387.0
2016-01-17 17:54:59;Uplaćeno na račun stana stan5;7000.0
2016-01-17 17:55:07;Storno zadnje transakcije;0
2016-01-17 17:56:40;Račun struje stubišne rasvjete (18 stanara, po stanaru 5.555555555555555);100.0
2016-01-17 17:56:51;Račun struje stubišne rasvjete (18 stanara, po stanaru 5.555555555555555);100.0
2016-01-17 17:58:13;Storno zadnje transakcije;0
2016-01-17 17:58:26;Storno zadnje transakcije;0
2016-01-17 18:00:21;Račun struje stubišne rasvjete (18 stanara, po stanaru 55.55555555555556);1000.0
2016-01-18 20:07:55;Račun struje stubišne rasvjete (18 stanara, po stanaru 5.555555555555555);100.0
2016-01-18 20:08:15;Račun struje stubišne rasvjete (18 stanara, po stanaru 555.5555555555555);10000.0
2016-03-19 17:06:26;Uplaćeno na račun stana stan5;4000.0
2016-03-19 17:07:04;Uplaćeno na račun stana stan5;1000.0
2016-03-19 17:07:11;Storno zadnje transakcije;0
2016-03-19 17:08:24;Račun struje stubišne rasvjete (18 stanara, po stanaru 111.11111111111111);2000.0
2016-03-19 17:12:47;Račun struje stubišne rasvjete (18 stanara, po stanaru 16.666666666666668);300.0
2016-03-19 17:18:02;Račun struje stubišne rasvjete (18 stanara, po stanaru 11.11111111111111);200.0
2016-03-19 17:18:14;Račun struje stubišne rasvjete (18 stanara, po stanaru 11.11111111111111);200.0
2016-03-19 17:18:28;Račun struje lifta (11 stanara, po stanaru 18.181818181818183);200.0
2016-03-19 17:29:11;Račun struje stubišne rasvjete (18 stanara, po stanaru 11.11111111111111);200.0
2016-03-19 17:29:32;Račun struje lifta (11 stanara, po stanaru 27.272727272727273);300.0
2016-03-19 17:31:30;Račun struje stubišne rasvjete (18 stanara, po stanaru 38.888888888888886);700.0
2016-03-19 18:29:29;Račun struje lifta (11 stanara, po stanaru 18.181818181818183);200.0
2016-03-20 14:12:45;Račun struje stubišne rasvjete (18 stanara, po stanaru 13.0);234.0
2016-03-20 14:35:29;Račun struje stubišne rasvjete (18 stanara, po stanaru 12.944444444444445);233.0
2016-03-20 14:35:36;Račun struje lifta (11 stanara, po stanaru 1.0909090909090908);12.0
2016-03-20 14:48:03;Uplaćeno na račun stana stan1;234.0
