stan1;Ana;Anic;1;-1;89.3638888904443
stan2;Biba;Bibiđ;2;1;60.727775888889
stan3;Didi;Didić;3;2;5.0334848503335
stan4;Ele;Eliš;4;0;6.455555555677
stan5;Tomi;Tomič;6;3;16.93303030434
stan6;Riba;Ribiž;2;5;98.0223232321887
