stan1;Ana;Anic;1;-1;-6.480555554000136
stan2;Biba;Bibiđ;2;1;-130.9611129999999
stan3;Didi;Didić;3;2;-1233.9771212102726
stan4;Ele;Eliš;4;0;-385.38888888901033
stan5;Tomi;Tomič;6;3;-1761.0881818168723
stan6;Riba;Ribiž;2;5;-574.750747474882
