stan1;Ana;Anic;1;-1;856.8138888873334
stan2;Biba;Bibiđ;2;1;911.6277796666666
stan3;Didi;Didić;3;2;952.2216666648181
stan4;Ele;Eliš;4;0;346.7222222223436
stan5;Tomi;Tomič;6;3;-33.33333333333333
stan6;Riba;Ribiž;2;5;386.9137777779126
