stan1;Ana;Anic;1;-1;101.25833333177786
stan2;Biba;Bibiđ;2;1;-599.4833314444445
stan3;Didi;Didić;3;2;-1450.8086363654845
stan4;Ele;Eliš;4;0;-2675.499999999878
stan5;Tomi;Tomič;6;3;-839.3939393939393
stan6;Riba;Ribiž;2;5;-1215.1064242422892
