stan1;Ana;Anic;1;-1;7.205000001555419
stan2;Biba;Bibiđ;2;1;-103.59000188888879
stan3;Didi;Didić;3;2;-341.3786363617877
stan4;Ele;Eliš;4;0;-330.6466666667881
stan5;Tomi;Tomič;6;3;-675.8912121199025
stan6;Riba;Ribiž;2;5;-132.91909090922547
