stan1;Ana;Anic;1;-1;11.297222223777645
stan2;Biba;Bibiđ;2;1;-175.40555744444436
stan3;Didi;Didić;3;2;693.0207575776062
stan4;Ele;Eliš;4;0;-474.27777777789925
stan5;Tomi;Tomič;6;3;-1907.092424241115
stan6;Riba;Ribiž;2;5;-623.4188282829627
